##TITLE=$$ Begin of the data block
##JCAMP-DX=5.00 $$ ACD/SpecManager v 10.08
##SPECTROMETER/DATA SYSTEM=Varian
##DATE=20 Nov 2012 14:22:34
##DATA TYPE=INFRARED SPECTRUM
##DATA CLASS=XYDATA
##ORIGIN=
##OWNER=
##NPOINTS=3735
##FIRSTX=399.26403809
##LASTX=4000.35498047
##MAXX=4000.35498047
##MINX=399.26403809
##MAXY=79.18060303
##MINY=27.23504257
##XFACTOR=1.0000000000
##YFACTOR=0.000000100000000
##FIRSTY=51.73709488
##DELTAX=0.96440572
##XUNITS=1/CM
##YUNITS=TRANSMITTANCE
##XYDATA=(X++(Y..Y))
399.3E17370949j3212280r032441N07431Q165360P425461L770370k90375Q67005j955300
407.9E13616180o564712k262306J108741J165543p00378j228485j930581j115722p4082
416.6E02014198p566414j3627586J8825493K1083031r82399n802155o348495n400963
424.3E02194710Q24890p2517j836701O386490M613724O51664K577973R5596J982498
433E17418327J234551n199738p996940q932915l732987l017616R61991Q824653N193672
441.7E04752998K617531R107094R811783k171822n963478N43366r1057k326164n081292
450.4E11198959k173195j031417J483993J1180802N789756n27725o587639M56887J1156921
459.1E30947342l713188q693428o059532m708405j409950l848992K03781N733185K308808
$$ y = [517370949, 504158669, 495126228, 495633659, 503799019, 511224480, 514994850, 514704475, 515571480, 513616180, 507051468, 504789162, 505897903, 507063446, 506363068, 505134583, 503204002, 502088280, 502014198, 494447784, 480820198, 499645691, 520728722, 519746323, 513944168, 507595673, 502194710, 503019600, 502947083, 501110382, 507496872, 512110596, 512762260, 515340233, 515435829, 517418327, 518652878, 513453140, 505456200, 496523285, 492790298, 489772682, 490734673, 499559326, 504752998, 507370529, 516477623, 526289406, 524117584, 518154106, 518697472, 518606415, 516280251, 511198959, 509025764, 507994347, 509478340, 520659142, 526448898, 525921173, 519333534, 519790421, 530947342, 527234154, 518540726, 512481194, 507772789, 506362839, 502513847, 502717628, 508450813, 510759621]
467.7E10759621L298797N433541j78070k377358m352608k813301l944435j0338745
475.5D95487442p538834j132927J786690J444702M495697R187012N524216J51481m225616
484.1E05179863k838745n75409J698456m018593j0387192k469711L82957L198891J751442
492.8D91921959M7417P216301N293846Q63304j614304j044578k642746q405075p212868
501.5D84423256m207840q20770j54381L129539L959046L151932K631492L67775k57263
510.2D92222786j000481l607368o168366p072868p435799m853019q91152J3733L25585
518.9D61533051J922187M355088J116027J545678L83834l482093k738076o623077m049072
527.5D53963547l049088j270981K509041K074623M600220L479004M951363M228591
$$ y = [510759621, 514058418, 519491959, 519313889, 516936531, 512583923, 509770622, 505826187, 495487442, 487948608, 486815681, 488602371, 490047073, 494542770, 503729782, 509253998, 509405479, 505179863, 502341118, 501765709, 503464165, 499445572, 489058380, 486588669, 486971626, 490170517, 491921959, 491969376, 499185677, 504479523, 505342827, 503728523, 502683945, 500041199, 491636124, 484423256, 480215416, 479394646, 479240265, 482369804, 486328850, 489480782, 492112274, 492480049, 492222786, 491222305, 487614937, 481446571, 474373703, 466937904, 462084885, 461193733, 461207466, 461533051, 463455238, 467810326, 468926353, 470472031, 470855865, 467373772, 464635696, 458012619, 453963547, 450914459, 449643478, 452152519, 454227142, 458827362, 462306366, 467257729, 471486320]
535.2D71486320J799508K712364J39656n7182p10144k045250j912957P42264M525376
543.9D76679955M079246N245895M732171K259674K847404J11046m115448l907623m231606
552.6D83700714n165748l081246k734375j684456M33235J839562L256798K784080Q62923
561.3D80211487j734123m042817n445785l868828l977623q029022o875305l738022
569D42499962o52161p24067J98974J451988J981202K614517j59989Q4000M55589p40509
578.6D47009506k375641o77642K826080K317161M337540N761414O629181O836052O167182
587.3D78830833M119301K607231J306267j967544m196282m359512k420006j039200
595D72881088M91562K935753L476295M621125M167900K503815J432876k13737k784081
$$ y = [471486320, 473285828, 475998192, 476137848, 476080666, 475370522, 473325272, 471412315, 472154579, 476679955, 480759201, 486005096, 490737267, 492996941, 495844345, 495955391, 491839943, 487932320, 483700714, 478534966, 475453720, 472719345, 471034889, 471468124, 473307686, 476564484, 479348564, 480211487, 478477364, 474434547, 468988762, 465119934, 461142311, 453113289, 446237984, 442499962, 441847801, 441123734, 441322708, 442774696, 444755898, 447370415, 447210426, 447294426, 447750015, 447009506, 444633865, 443956223, 446782303, 449099464, 453437004, 459198418, 465827599, 472663651, 478830833, 482950134, 485557365, 486863632, 484896088, 480699806, 476340294, 473920288, 472881088, 473372650, 476308403, 479784698, 484405823, 488573723, 491077538, 492510414, 492296677, 489512596]
603.7D89512596m634361m462624m046364k952690p71293K787208L660355L216553M280014
612.4D86589394L447914M439239L062592p11327k483368k737007j554146k002182j112289
621.1D86938820J879387M422340N099068M924888N468827N109176M059525J664314
628.8E19566345j049270l172188m225655m513206k457962P02285J828995L669167N032081
637.5E15380592N388260N662308M018249N82543l42751j861915m117851m075852m935226
646.2E15698357l253861K13318K423668N389786M629593M596443M428329K033196P93800
654.8E36952629q7814j688805m558220n396919l740540k112693R22165L064575M665451
663.5E28019829N337219N686264M463539r06982j1768418M876824J927376l595887
$$ y = [489512596, 484878235, 480415611, 476369247, 473416557, 472645264, 475432472, 479092827, 482309380, 486589394, 490037308, 494476547, 497539139, 496827812, 494344444, 491607437, 490053291, 488051109, 486938820, 488818207, 493240547, 498339615, 503264503, 508733330, 513842506, 517902031, 519566345, 518517075, 515344887, 511119232, 506606026, 504148064, 504850349, 506679344, 510348511, 515380592, 520768852, 526431160, 530449409, 531031952, 530689201, 528827286, 524709435, 520633583, 515698357, 512444496, 512657814, 515081482, 520471268, 525100861, 529697304, 534125633, 536158829, 536952629, 536864815, 535176010, 530617790, 525220871, 521480331, 519367638, 520289803, 523354378, 528019829, 533357048, 539043312, 543506851, 542599869, 530831451, 535708275, 537635651, 534039764]
671.2E34039764m256591k500763k86522J926422L016052M082451N788612N735283M254837
679.9E51799545K002640k73933j935616m226723m645652k809716k224388j904335J019669
688.6E36801491M318886N341186N340729M182396K726593J16463l640709n798722n486831
697.3E43901482n083504n163231l164940j240692N87997K971993L404999L860016K934265
705.9E43008385Q69522q17795k268906l211593m630890m180336k613335J40801K785988
714.6E29081841L873519O404381O844788O828232O091003L553467K274093M29612j843415
723.3E63537521l100586l248176j417694J040230L631629P391091R845924P649575
731E85329514N068283N127716K953643p80525j942177m474220o565475m591179r73206
$$ y = [534039764, 529783173, 527282410, 526995888, 528922310, 531938362, 536020813, 541809425, 547544708, 551799545, 553802185, 553528252, 551592636, 547365913, 542720261, 539910545, 537686157, 535781822, 536801491, 541120377, 546461563, 551802292, 555984688, 558711281, 558827744, 555187035, 549388313, 543901482, 538817978, 533654747, 530489807, 529249115, 529837112, 532809105, 536214104, 540074120, 543008385, 543877907, 543060112, 540791206, 537579613, 532948723, 528768387, 526155052, 526295853, 529081841, 532955360, 539359741, 546204529, 553032761, 559123764, 562677231, 564951324, 565380936, 563537521, 560436935, 557188759, 555771065, 556811295, 560442924, 567834015, 577679939, 585329514, 590397797, 595525513, 598479156, 597698631, 595756454, 591282234, 584716759, 580125580, 579152374]
739.7E79152374J217194K673797M960137O452675N393448K898483J608124p91855m468079
748.4E99096298p544594q979072o565972n431442l863869n72319N80826J971245K160912
757.1E70852013J829948K470894O48l300781n101280o533051o507454m846038k276917
765.7E46587982m94346J921234N372200P557907Q046303O603012N549164M803047J992836
774.4E87939339n3749p24373j146965j794586j68190L937606N770111P854538R476014
783.1F11089745Q784942P134857M453812K657051o93703l160820m201469l687019k617989
791.8F19759407j290398K213517M564933P297135Q609276P245254O294251M678497
799.5F59371872J022797k644959l551407n790176n167771l494987j586914K735329
$$ y = [579152374, 580369568, 583043365, 588003502, 594456177, 599849625, 602748108, 604356232, 603564377, 599096298, 591551704, 582572632, 576006660, 570575218, 566711349, 566139030, 566719856, 568691101, 570852013, 572681961, 575152855, 575153503, 571852722, 566751442, 560218391, 553710937, 548864899, 546587982, 546093636, 548014870, 553387070, 560944977, 568991280, 575594292, 581143456, 585946503, 587939339, 587885590, 587161217, 586014252, 584219666, 584051476, 587989082, 593759193, 601613731, 611089745, 619874687, 627009544, 631463356, 634120407, 633426704, 630265884, 626064415, 622377396, 619759407, 618469009, 620682526, 625247459, 632544594, 641153870, 648399124, 654693375, 659371872, 660394669, 657749710, 654198303, 648408127, 643240356, 639745369, 638158455, 640893784]
807.2F40893784N287017P276459P623215P097778L924713N78919k477722n730896n551148
815.9F58922119p323456n370407k978210j433792K864151M533004N835572N496444
823.6F60545425M290696K049713j323166n203095q435745q304977q360520o899948
831.3F28358383l789329j089669M46320K255516L921814L136024J811791j040268l440323
840F30570259n734672p352372p093925p087593n768357l244056m83742J946602L582535
848.7E99334679L315849J741104J179619q79250l439712m532776o242981q128281o830368
857.4E75517883m702797k607040M27360K816468N605545P676239P307548O174431M625626
866F02841263L139038J574097J321868L70522L74527K605362M536247P223015Q235588
$$ y = [640893784, 646180801, 653457260, 661080475, 668178253, 672102966, 672681885, 670204163, 664473267, 658922119, 651598663, 646228256, 643250046, 641816254, 644680405, 649213409, 655048981, 660545425, 664836121, 666885834, 665562668, 660359573, 651923828, 643618851, 635258331, 628358383, 624569054, 623479385, 623925705, 626181221, 630103035, 633239059, 635050850, 634010582, 630570259, 624835587, 617483215, 610389290, 603301697, 597533340, 594289284, 593805542, 595752144, 599334679, 602650528, 604391632, 605571251, 604692001, 601252289, 596719513, 590476532, 582348251, 575517883, 570815086, 568208046, 568635406, 571451874, 577057419, 584733658, 592041206, 598215637, 602841263, 605980301, 607554398, 608876266, 609246788, 609621315, 612226677, 616762924, 623985939, 632221527]
874.7F32221527Q689499Q172760N687637L274994Q9188l573227o619263p826385p547722
883.4F32569008n599747m065094j303215L87459L80821J602898J302757l2349k915802
892.1F22326736m897117o158524q090934p277489o029282n094490l087692j255798
899.8E80435410L62434K306480K131081M24042j311569l977509n633354o633187p609825
908.5E60494003p949485p228966o328774m426727k309036k281418j895981p72018j119652
917.2E26181946l339958m796448m851608m943200n134391n100556l397331j075974
924.9D93542480R92J177483L534622L525848K421647K246589J764946N04494j034660
933.6E07684441j615563k059822j455498l64685N63164K548561M062157M899597N338936
$$ y = [632221527, 640911026, 649083786, 654771423, 658046417, 658135605, 654562378, 647943115, 640116730, 632569008, 626969261, 622904167, 621600952, 621988411, 622369232, 623972130, 625274887, 625242538, 622326736, 617429619, 611271095, 603180161, 595902672, 589873390, 584778900, 581691208, 580435410, 580797844, 583104324, 585235405, 585659447, 584347878, 580370369, 574737015, 568103828, 560494003, 552544518, 545315552, 538986778, 534560051, 532251015, 529969597, 528073616, 527301598, 526181946, 522841988, 518045540, 513193932, 508250732, 503116341, 498015785, 494618454, 493542480, 493543472, 494720955, 498255577, 501781425, 504203072, 506449661, 508214607, 508719101, 507684441, 506068878, 504009056, 502553558, 502188873, 502752037, 505300598, 509362755, 514262352, 519601288]
942.2E19601288N550918L358193N41878j027718l855209o089211p205582p303161n861626
950.9D97709770m795761m422836m365311l574867m608879o270294o811448o906623
958.6D55953751q028412j0261421r992600r603958r122429q765335p339668o296654
966.3C86543274o812172o244202o422920n716591p212181p947845q478966q786354
974.1C28922043p395058q259620o365986o643277o355152m217663k623958j627903
981.8B85433426k502937j365529j540966p02400j810283j801243o45733j665554m33350
990.5B72965431o15005M51183L40519J212292K073097J497574J670646Q82378K158184
999.1B82636299P52602O504r11236r84077K95124m99230L93963j06754J526279J263962
$$ y = [519601288, 525152206, 528510399, 529052277, 528024559, 524169350, 518080139, 510874557, 503571396, 497709770, 492914009, 488491173, 484125862, 480550995, 475942116, 469671822, 462860374, 455953751, 447925339, 437663918, 427671318, 418067360, 408944931, 400179596, 392839928, 386543274, 379731102, 373486900, 367063980, 361347389, 354135208, 346187363, 337708397, 328922043, 321526985, 313267365, 306901379, 300258102, 293902950, 289685287, 287061329, 285433426, 282930489, 281564960, 280023994, 279321594, 277511311, 275710068, 275064335, 273398781, 272965431, 272350426, 272801609, 273142128, 274354420, 276427517, 277925091, 279595737, 280478115, 282636299, 283388901, 283395405, 282484169, 281500092, 281795216, 281295986, 281689949, 281583195, 283109474, 284373436]
1008.8B84373436N30777P62787M29725J114159q29525J26267j137047j629505p10640
1017.5B83030434o57025Q94432N28584K430229J988640K666321K431354J660195K066993
1026.1B97040157N12829J759854J53656N08060J63403j74218J670952J024189J940079
1034.8C04598961J631489K797851J524830J033344Q64392r71775k15569j085968l28903
1043.5C09848652j584816m15821M05578l62682J489315J500626L265896K185287K403183
1052.2C18735218J229096L30142K241631J193008J151467N08270K575111K894516L834115
1060.9C34692574M909248M856529O805534N200844M624482L207359K538910n33905
1068.6C66301575l355866l108177n482140m637184m459915l148231k697144j114845
$$ y = [284373436, 284904213, 285667000, 286096725, 287210884, 286381359, 286507626, 285370579, 283741074, 283030434, 282373409, 283267841, 283796425, 286226654, 288215294, 290881615, 293312969, 294973164, 297040157, 297552986, 299312840, 299466496, 299974556, 300137959, 299963741, 301634693, 302658882, 304598961, 306230450, 309028301, 310553131, 311586475, 312450867, 311479092, 311263523, 310177555, 309848652, 308263836, 307848015, 308253593, 307890911, 309380226, 310880852, 314146748, 316332035, 318735218, 319964314, 320294456, 322536087, 323729095, 324880562, 325388832, 327963943, 330858459, 334692574, 339601822, 344458351, 351263885, 356464729, 361089211, 364296570, 366835480, 366301575, 362945709, 359837532, 354355392, 349718208, 345258293, 342110062, 339412918, 338298073]
1076.3C38298073L26195j721611M19578o75354L01285k11105j288720k7732K3803K361984
1085.9C37806396J221657K719841L530655M149437M097672L039741L821564J576881
1093.6C61963844J823197K96898j08262M04435J03149P20101M36782K244377J094094
1102.3C68978615J853714K200661J890449J263123o43387M45938j079331l80363J30882
1111C74660301N63202P53288R17817L972168L381271M251861L407479K023926J407356
1119.7C95338669N46379N15404j961747j737213j111793K25410J402130J904564K788430
1128.4C97910233L374061M915581L634949K388992R34982J086312n5542k011872l87077
1137D11790619j928063l058967k449074n34706m7112j791381k072106k132339j626282
$$ y = [338298073, 338624268, 336902657, 337322235, 336646881, 336948166, 336737061, 335448341, 335420609, 335444412, 337806396, 339028053, 341747894, 345278549, 349427986, 353525658, 356565399, 360386963, 361963844, 363787041, 364083939, 363975677, 364380112, 364483261, 365203362, 365640144, 367884521, 368978615, 370832329, 373032990, 374923439, 376186562, 375543175, 375989113, 374909782, 374529419, 374660301, 375223503, 375976791, 376894608, 380866776, 384248047, 388499908, 391907387, 393931313, 395338669, 395885048, 396400452, 394438705, 392701492, 391589699, 391815109, 393217239, 395121803, 397910233, 401284294, 406199875, 409834824, 412223816, 413158798, 414245110, 414189568, 412177696, 411790619, 409862556, 406803589, 404354515, 403819809, 403772697, 401981316, 399909210, 397776871, 396150589]
1145.7C96150589l187637l007546l708076m674416m016037l999977j881828j702462
1153.4C69972610O78559J150589P06100J071587N30395J497803m90723M4594n64689
1162.1C74596825j122666n04455M68712K798309K066116L616753L967552N717697O300125
1170.8C97904968N585671O328239M541626M355316L430138L826523L579139L572579
1178.5D33124199M773827N265312P266807P581711Q559990P884064O924057O140022
1186.2D87519989L944855K686767J558571P64427Q3123J170921J655579K152290L772240
1194.9E05308762L863716M741401M392968K998581J311645m22859j431160k528114
1202.6E18234940k491265j349678m7912L00865J725807L847885M613648M989051M650498
$$ y = [396150589, 392962952, 389955406, 386247330, 381572914, 377556877, 373556900, 371675072, 369972610, 370651169, 371801758, 372507858, 373579445, 374109840, 375607643, 375116920, 375161514, 374596825, 373474159, 372969704, 373438416, 376236725, 378302841, 381919594, 385887146, 391604843, 397904968, 403490639, 409818878, 414360504, 418715820, 422145958, 425972481, 429551620, 433124199, 437898026, 443163338, 450430145, 458011856, 466571846, 474455910, 481379967, 487519989, 491464844, 494151611, 495710182, 496474609, 496557732, 497728653, 499384232, 501536522, 505308762, 509172478, 513913879, 518306847, 521305428, 522617073, 522194214, 520763054, 518234940, 515743675, 514393997, 514346085, 514646950, 516372757, 520220642, 524834290, 529823341, 534473839]
1211.3E34473839L746757K289696J660271M11415j404877j479378p16552k8420J150627
1220E40103378L247795M066124M333573M392204K971725J300431n46074k274704l225403
1228.6E54369049l840256l859291l282356j704216j07002J027107K005196K671203
1236.4E47279434K686196J865844O21186r95102k328835l226127l966599l266067j708489
1245E36961441m80423O71578K623558L846778M106751M081879L032302J726799M53186
1253.7E57023849j634407k370948k273445k188530j395836k34871J239586K839279
1261.4E51004677L660927M046478L621216K163582J042137J09329j445198k074394
1269.2E62128754k445717j752930q62198M46663K183533K854385L750916L640365K844658
$$ y = [534473839, 538220596, 540510292, 542170563, 542581978, 541177101, 539697723, 538981171, 538952751, 540103378, 543351173, 547417297, 551750870, 556143074, 559114799, 560415230, 559869156, 557594452, 554369049, 550528793, 546669502, 543387146, 541682930, 541575928, 542603035, 544608231, 547279434, 549965630, 551831474, 552452660, 551457558, 549128723, 545902596, 541935997, 538669930, 536961441, 536481018, 537152596, 539776154, 543622932, 547729683, 551811562, 554843864, 556570663, 557023849, 555389442, 553018494, 550745049, 548556519, 547160683, 546925812, 548165398, 551004677, 554665604, 558712082, 562333298, 564496880, 565539017, 565648346, 564203148, 562128754, 559683037, 557930107, 557067909, 557514572, 559698105, 562552490, 566303406, 569943771, 572788429]
1277.8E72788429J882630l891j614991k942810l506431l568878k680092j548195k63024
1286.5E58542747J233521K425957K800827K631569K342529M79317j117936k219543
1294.2E67118988l210068l801498m454041l361511j820335l74337O85540J550598K340507
1302.9E54673843K045136J340713l81164j614151k779427l780708l438568l388214
1310.6E42677460k653809j421013l24630J238899K207260K323723J899185P23114n87502
1319.3E46082687j161499k450523l760071m055099l675957k701569k189331j262779
1327E24825859J98174N64079N93300K1667p05185j658325k799339l294296l902550
1335.7E13843384m199028l214455j744881r53369P7668K013855K103691K597656K462616
$$ y = [572788429, 574671059, 574667168, 573052177, 570109367, 566602936, 563034058, 560353966, 558805771, 558542747, 559776268, 562202225, 565003052, 567634621, 569977150, 570456467, 569338531, 567118988, 563908920, 560107422, 555653381, 552291870, 550471535, 550097198, 550782738, 552333336, 554673843, 556718979, 558059692, 557678528, 556064377, 553284950, 549504242, 546065674, 542677460, 540023651, 538602638, 538278008, 539516907, 541724167, 544047890, 545947075, 546670189, 546082687, 544921188, 542470665, 538710594, 534655495, 530979538, 528277969, 526088638, 524825859, 525024033, 525588112, 526181412, 526203079, 525497894, 523839569, 521040230, 517745934, 513843384, 509644356, 506429901, 504685020, 503731651, 503809319, 505823174, 507926865, 510524521, 512987137]
1344.4E12987137J715545L58086q29468j723022l098908k824516j962852r94797r6092
1353.1E03531113O39496J717147K134896K272949J329536M99649m56657j479607k390022
1361.7E07798500l565369m155883j442299j26992j95655R55658J643867K048416K510300
1370.4E05470543J475601J527786L3837j903305j635590q52585q39271j853943P1983
1379.1E01495056P93953J671715K588272K757301L404541K967148K572060J035385
1386.8E19285431m71420j85814L4027n64957q65440K95906J221733J494331J321259
1395.5E21565056K921028K332153J051674j70402j135369j220092k956810k674714
1403.2E19712524k330780l163948j546249l0937J148414J532631J950608J041488P18727
$$ y = [512987137, 514702682, 515060768, 514231300, 512508278, 509409370, 506584854, 504622002, 503627205, 503531113, 504170609, 505887756, 508022652, 510295601, 511625137, 512124786, 511668129, 510188522, 507798500, 504233131, 500077248, 498634949, 498507957, 498312302, 499267960, 500911827, 502960243, 505470543, 506946144, 508473930, 508507767, 506604462, 504968872, 504116287, 503277016, 501423073, 501495056, 502289009, 503960724, 506548996, 509306297, 512710838, 515677986, 518250046, 519285431, 518814011, 518628197, 518662224, 518097267, 517231827, 517527733, 518749466, 520243797, 521565056, 524486084, 526818237, 527869911, 527699509, 526564140, 525344048, 522387238, 519712524, 517381744, 514217796, 512671547, 512640610, 513789024, 515321655, 517272263, 518313751, 519032478]
1411.9E19032478o81991j632118j829110k764434k452927k326431j233178m212074
1419.6E01900215R58824L446617K057991K498780J120147J489869J068077o41823n36652
1428.3E13362045k022896k550544j613617M48417O57883J351624L106270K370071K404060
1437E17513313J484070K811852J211814m9781o42014k210960j507683j801758K7428
1445.6E16836281P49397J148071J348915K004281L021736P91092K56004p20100o85654
1454.3E24750023k360687m447213p149620m803352L743401M93850K480660J628494
1462E14335556K687225L809929P30400L383751J572190J557922J06964R87740K044372
1470.7E31216049p9613L257752J899452P084351N121231O366386O260948N146981M959449
$$ y = [519032478, 518350487, 516718369, 514889259, 512124825, 509671898, 507345467, 506112289, 501900215, 502859039, 506305656, 508363647, 510862427, 511982574, 513472443, 514540520, 513898697, 513362045, 511339149, 508788605, 507174988, 507623405, 508281288, 509632912, 512739182, 515109253, 517513313, 518997383, 521809235, 523021049, 522971268, 522329254, 520118294, 518610611, 516808853, 516836281, 517585678, 518733749, 520082664, 522086945, 525108681, 525899773, 526155777, 525435677, 524750023, 522389336, 517942123, 510792503, 505989151, 509732552, 510226402, 512707062, 514335556, 517022781, 520832710, 521563110, 524946861, 526519051, 528076973, 528183937, 529171677, 531216049, 531136436, 534394188, 536293640, 543377991, 548499222, 554865608, 561126556, 566273537, 571232986]
1479.4E71232986K354317K605095N94101J499634N24254P40928K684403J714363L867874
1488.1E87817955L687859P413635M383926L934250L486519J172714J702957j040725
1495.8F12559090l371353K42309l82233N12963L670616M301605L361015N490723M238014
1504.5F30622749L287087l719750k985038L836250K24876L20473m67186l31802j028252
1513.1F29759407L131561L933945L421135N335541k91672M933929L522568k894897
1520.8F50851517m691391l052216K337341K16980j962814m33502L153610L338699L976899
1529.5F53735123M764328K778549L050384j494598k298279N04379j896820j068801
1537.2F58074265j278916m736328o729660P371750K667999L154068O164322K140198
$$ y = [571232986, 573587303, 576192398, 576786499, 578286133, 578810387, 579551315, 582235718, 583950081, 587817955, 591505814, 598919449, 603303375, 607237625, 610724144, 611896858, 613599815, 612559090, 609187737, 609430046, 609047813, 609560776, 613231392, 617532997, 620894012, 626384735, 630622749, 633909836, 630190086, 627205048, 631041298, 631266174, 631586647, 631119461, 630787659, 629759407, 632890968, 636824913, 640246048, 645581589, 645289917, 650223846, 653746414, 650851517, 646160126, 643107910, 645445251, 645662231, 643699417, 643265915, 646419525, 649758224, 653735123, 658499451, 661278000, 664328384, 662833786, 660535507, 661039886, 659143066, 658074265, 656795349, 652059021, 645329361, 652701111, 655369110, 658523178, 664687500, 666827698]
1545F66827698Q45108J343994P7591j908569n049744n104294o6986P95975N7373j551132
1554.6F56267014L276290N253678K942123o158981p129517J803360O296234J60141
1562.3F62710342k355423l399429n171127l85590J561432K485123K345810j828461
1570F55962677J974564K530593J41449j418533j315231m209290j0900955O15845m5624
1578.7F43335495n41229O57959J437912K205887J985931J548004O54144k47955j221390
1587.4F49814758k860260l210830l678437k954483k336273p60879M05387R27964J657104
1596.1F37004051R62868J075516N08575r10339k201348l313179l589744m328385l118286
1604.7F22089729k344856j140594l82348R53370J065902L00522J205101n28908j771926
$$ y = [666827698, 667672806, 669016800, 669094391, 667185822, 662136078, 657031784, 656964798, 657760773, 657818146, 656267014, 659543304, 664796982, 667739105, 661580124, 654450607, 656253967, 662550201, 662710342, 660354919, 656955490, 651784363, 651398773, 652960205, 655445328, 657791138, 655962677, 657937241, 660467834, 660609283, 659190750, 657875519, 653666229, 642765274, 643381119, 643335495, 642794266, 643452225, 644890137, 647096024, 649081955, 650629959, 651284103, 651036148, 649814758, 646954498, 643743668, 640065231, 637110748, 634774475, 634013596, 634418983, 635346947, 637004051, 637966919, 639042435, 639551010, 638640671, 636439323, 633126144, 629536400, 625208015, 622089729, 619744873, 618604279, 618221931, 619175301, 620241203, 620541725, 621746826, 621217918, 619445992]
1613.4F19445992l005105k278060l940888j1898994J140442L7651m00048q6059J880798
1622.1F00895729J226235j832085J241608L29093j96533l301735l827018j777573k879524
1630.8E89878197k225952j590538J450920J662292l009605O87790L202095J711654
1638.5E91766853J370545M34265j793175j188927k005119m16412j62659k661781N35011
1647.2E85878601Q12607L754539L571282M181900L958969K189407o150436J851044
1654.9F00047913K181243L27149l64189l10440Q29086K154808L588295L673096K141723
1663.6F14268684M064064L178063K448730K191277J075897l760300J38359K036896
1671.3F25641670q02192K850189M636230L039131J487275M759101M841004L952026
$$ y = [619445992, 616440887, 614162827, 610221939, 598322945, 599463387, 599501038, 599100990, 599014931, 600895729, 602121964, 600289879, 601531487, 601860580, 601664047, 598362312, 594535294, 592757721, 589878197, 587652245, 586061707, 587512627, 589174919, 586165314, 586853104, 590055199, 591766853, 593137398, 593571663, 591778488, 590589561, 588584442, 588168030, 588005371, 585343590, 585878601, 586691208, 590445747, 594017029, 598198929, 602157898, 604347305, 598196869, 600047913, 602229156, 602556305, 602192116, 601881676, 602710762, 604865570, 608453865, 612126961, 614268684, 618332748, 621510811, 623959541, 626150818, 627226715, 623466415, 623604774, 625641670, 624839478, 627689667, 632325897, 635365028, 636852303, 641611404, 646452408, 650404434]
1679F50404434L407135O12641J749267J475678n223008o684036O722717N580292L466492
1687.7F61511612L078155M431763N006638L852081L205414K519836K620850j89514
1695.4F86036835p527008K536850K776260L651810j860504n974045P521820O410446
1703.1F93572464M935989K533341J963882O7749O79245k8763k143859j842804k59552
1711.8F99477692Q27865J088639J153335K141113M460907M062424k364807K776108
1719.5G13623276K375564K73209j578217k745742k503815n03159K35367N61447K136078
1728.2G11874008L220062K572098J846009L730010K997971m557800m643784K826615
1735.9G19865189Q90503k156754j39313k641678j352920M969101M185791K788620K003403
$$ y = [650404434, 653811569, 654424210, 656173477, 657649155, 652426147, 645742111, 652464828, 658045120, 661511612, 664589767, 669021530, 674028168, 677880249, 681085663, 683605499, 686226349, 686036835, 678509827, 681046677, 683822937, 687474747, 685614243, 679640198, 687162018, 693572464, 698508453, 701041794, 703005676, 703073425, 703752670, 703723907, 701580048, 699737244, 699477692, 700305557, 701394196, 702547531, 704688644, 709149551, 713211975, 710847168, 713623276, 715998840, 716272049, 714693832, 711948090, 709444275, 708941116, 709176483, 709737930, 711874008, 715094070, 717666168, 719512177, 723242187, 726240158, 721682358, 717038574, 719865189, 720755692, 718598938, 718459625, 715817947, 714465027, 719434128, 723619919, 726408539, 728411942]
1744.6G28411942L390655K172394p0877j269608k555008Q33969m270858j795578L414154
1753.3G28261185J762390L375473M522247K383042J930389K893219J578751R62524
1761G47669220l445816k691422K34070j202392n12848J091003J597748p0114L694305
1769.7G46363754N401154L102188P92007k382965J409531n45273l490219q05130j970139
1778.3G47874908n47790o867O22254K767486L505097L533935K151871Q11081K29797
1787G60941772m94384j769181j322021k370682k576675l024826K24151M271546K942505
1795.7G56822205K239685K872696K726135J289291j024246P7362k634125k571792j451340
1804.4G58345871j527710L6392P55921J607818K341767L562469J796875J734161J656495
$$ y = [728411942, 731802597, 733974991, 733904114, 732634506, 730079498, 730913467, 726642609, 724847031, 728261185, 730023575, 733399048, 737921295, 740304337, 742234726, 745127945, 746706696, 747669220, 744223404, 741531982, 741766052, 740563660, 740050812, 741141815, 742739563, 742669449, 746363754, 751764908, 754867096, 755659103, 753276138, 754685669, 754140396, 750650177, 749845047, 747874908, 747327118, 747320251, 747942505, 750709991, 754215088, 757749023, 759900894, 760711975, 760941772, 760447388, 758678207, 757356186, 754985504, 752408829, 749384003, 749608154, 753879700, 756822205, 759061890, 761934586, 764660721, 765950012, 764925766, 765003128, 762369003, 759797211, 758345871, 756818161, 756854553, 757610474, 759218292, 761560059, 765122528, 766919403, 768653564, 770310059]
1813G70310059n97763r57566k320938k156830k701492j245117J01089N44434K253265
1821.7G63229141K252426L597489L025436J92795J65024L77579o15540l452530n722046
1830.4G63049774m41208P63092n03540P37305K477264L064347K716064J274338J830902
1839.1G74968338L93524o42776j748581j840515k719880o277923J591644J700516J120911
1847.8G66545258K108841K553100K653122J598740J384201j24436q42895j822586k513962
1856.4G71539383k133484k357788p82700M8294J421662J998520K300567K412415J747818
1865.1G76194687J596985k37808q67005l208237l667450r30938n03922l11355k02179
1873.8G67862778J635894K081604K563935K788772K004090R95865p64237j278686k347718
$$ y = [770310059, 769712296, 768754730, 766433792, 764276962, 761575470, 760330353, 760431442, 760975876, 763229141, 765481567, 769079056, 772104492, 772297287, 772462311, 772839890, 772224350, 768771820, 763049774, 762608566, 763371658, 762868118, 763605423, 766082687, 769147034, 771863098, 773137436, 774968338, 775361862, 774719086, 772970505, 771129990, 768410110, 762132187, 763723831, 765424347, 766545258, 768654099, 771207199, 773860321, 775459061, 776843262, 776718826, 775875931, 774053345, 771539383, 769405899, 767048111, 766265411, 766313705, 767735367, 769733887, 772034454, 774446869, 776194687, 777791672, 777553864, 776686859, 773478622, 769811172, 768880234, 768376312, 768064957, 767862778, 769498672, 771580276, 774144211, 776932983, 778937073, 779932938, 779168701, 777890015, 775542297]
1882.5G75542297k109985k169800j643829j66397M14505K592010K317047J070023K270279
1891.2G78116150K171249M24576j6632j355362l272400j695785j945267j301804k96707
1899.8G70828018M61731J923142J968612K652512K342224J437759J27716j208724j635285
1908.5G78897705k102356k424393k080612r01413m60510J207428J929398K298126L165817
1917.2G79529190R44367N01098O39496m84161j257553l050232k396241j132660p95059
1925.9G72498245m38690J127319K174836K184372K176513J821594J434708l63998r73130
1934.6G81641769j723632k329255k247390k179871o48193K63672J939697J687088O01654
1943.2G77005539K603378K501984Q40835k07290q81729j975632k223816k120743j750030
$$ y = [775542297, 773432312, 771262512, 769618683, 769452286, 769866791, 772458801, 774775848, 775845871, 778116150, 780287399, 780711975, 780695343, 779339981, 776067581, 774371796, 772426529, 771124725, 770828018, 771289749, 773212891, 775181503, 777834015, 780176239, 781613998, 781741714, 780532990, 778897705, 776795349, 774370956, 772290344, 771388931, 770928421, 772135849, 774065247, 776363373, 779529190, 780473557, 780974655, 781614151, 781129990, 779872437, 776822205, 774425964, 773293304, 772498245, 772059555, 773186874, 775361710, 777546082, 779722595, 781544189, 782978897, 782614899, 781641769, 779918137, 777588882, 775341492, 773161621, 772513428, 772777100, 774716797, 776403885, 777005539, 779608917, 782110901, 782951736, 782744446, 781862717, 779887085, 777663269, 775542526, 773792496]
1951.9G73792496n76325M06342J366882J823273K218551J944428J804123J017837l16085
1960.6G83481522j081696k092895j822281j914902j591263o35757j23520J237793K101669
1969.3G77558670K671433K086105J545944K50168p01752r41314j906891j608124j695175
1978G77259064j174240m40522J51368J204986J479416K392578K238999J331787M11758
1986.6G84855194n97000j778336j998291j053314j922226k411270l94363J084823J427384
1995.3G77212601K009430K337341J487503J144562O9809p74536j560822k093964j893081
2004G77938843j724167q31909j43357N75562J303482K078094K021256J402359Q78296
2012.7G83498459m10309j144180j701966j801071k036972j626510q70133l44391R25446
$$ y = [773792496, 773216171, 773622513, 774989395, 776812668, 779031219, 780975647, 782779770, 783797607, 783481522, 782399826, 780306931, 778484650, 776569748, 774978485, 774342728, 774219208, 775457001, 777558670, 780230103, 782316208, 783862152, 784112320, 783410568, 782469254, 780562363, 778954239, 777259064, 776084824, 775644302, 775795670, 777000656, 778480072, 780872650, 783111649, 784443436, 784855194, 784258194, 782479858, 780481567, 779428253, 777506027, 775094757, 774700394, 775785217, 777212601, 779222031, 781559372, 783046875, 784191437, 784261246, 783486710, 781925888, 779831924, 777938843, 776214676, 775382767, 775239410, 775814972, 777118454, 779196548, 781217804, 782620163, 783498459, 783088150, 781943970, 780242004, 778440933, 776403961, 774777451, 773907318, 773562927, 774488373]
2021.3G74488373J257629J856919J902923J223831P60422o02417j302948j733322j776657
2030G76074753k068024j698837m64783J79978N81359J141663J858826J582641J407852
2038.7G78595428L03269r06143j252442j639404j344452j942673j359329o81076m0283
2047.4G69732895R83276J108856K098313K035293J390076L35159o60171j301346k160873
2056.1G73561478j437455j284103j095734n93795L78265J536789J867905K099075J110001
2064.7G76142426N94635K95562l92456r52606j628189j826325j767349j007919k38419
2073.4G69219360O01960J407318J989441J873931J163941J070633K90146p00684j558380
2082.1G75357666j813660j591873j411514p42951J25123R13238J264191J848755J662140
$$ y = [774488373, 775746002, 777602921, 779505844, 780729675, 781490097, 780887680, 779584732, 777851410, 776074753, 774006729, 772307892, 771843109, 772023087, 772604446, 773746109, 775604935, 777187576, 778595428, 778898697, 777992554, 776740112, 775100708, 773756256, 771813583, 770454254, 769773178, 769732895, 770716171, 771825027, 773923340, 775958633, 777348709, 777683868, 777023697, 775722351, 773561478, 772124023, 770839920, 769744186, 769150391, 769528656, 771065445, 772933350, 775032425, 776142426, 776737061, 777032623, 776640167, 775687561, 774059372, 772233047, 770465698, 769457779, 769219360, 769821320, 771228638, 773218079, 775092010, 776255951, 777326584, 777616730, 776916046, 775357666, 773544006, 771952133, 770540619, 769797668, 769922791, 770836029, 772100220, 773948975, 775611115]
2090.8G75611115J279754R38416N874p46536j693344j400223j474075j467896p07168
2099.5G70345917O6681J046905J266022J886597J718368J266556N40390k25678m76455
2108.1G77435303j746140j636352j379395j164474o37818K14234J434021J497574J717910
2116.8G75734863J468048J235733O35682k66877j100845j888580j613617j684494p87506
2125.5G71732407j09406M88129J051254J092529J798478J334686J106262M71802m20685
2134.2G78545456j256409j882705j339875j394043q22372m00314L72772J126785J563644
2142.9G74512939J974564J088257J211319O90536p41272j719207j755829j281433j223832
2151.5G72756042p30667m18243O65970J237488J668930J899795J204834J059723K21634
$$ y = [775611115, 776890869, 777829285, 777835159, 777088623, 775395279, 773995056, 772520981, 771053085, 770345917, 770412598, 771459503, 772725525, 774612122, 776330490, 777597046, 778137436, 777911758, 777435303, 775689163, 774052811, 772673416, 771508942, 770871124, 771085358, 772519379, 774016953, 775734863, 777202911, 778438644, 779074326, 778807449, 777706604, 775818024, 774204407, 772519913, 771732407, 771623001, 772111130, 773162384, 774254913, 776053391, 777388077, 778494339, 778966141, 778545456, 777289047, 775406342, 774066467, 772672424, 771850052, 771449738, 771822510, 772949295, 774512939, 776487503, 777575760, 778787079, 779477615, 778736343, 777017136, 775261307, 773979874, 772756042, 772025375, 771607132, 772273102, 773510590, 775179520, 777079315, 778284149, 779343872, 779565506]
2160.2G79565506m73709j524353j627274j062393j059418n73120k60849O30341Q88061
2168.9G74502792J757050K326355J624756J060486j83564n43747j074218j197663j357803
2177.6G76914444j564560k72675O80085J188354J255722J660691J592254J103592Q38089
2186.3G83395996K88010m07257j443329j356583j341247j069489l74756K68402J105118
2194.9G79064865J545639K108612J531067J053848L79868o55975r83887j286087p47681
2203.6G82010269p44018q23594n09033K33155J137847J531601J688233J339493J105117
2212.3G86969070N29023K7084j040649j450882j152192j499938q27561l20511Q09860
2221G82043304J233902J423417K095031J149369Q18023J56861o05317r32312j137161
$$ y = [779565506, 779091797, 777567444, 775940170, 774877777, 773818359, 773245239, 772984390, 773614731, 774502792, 776259842, 778586197, 780210953, 781271439, 781087875, 780544128, 779469910, 778272247, 776914444, 775349884, 775077209, 775757294, 776945648, 778201370, 779862061, 781454315, 782557907, 783395996, 783684006, 783276749, 781833420, 780476837, 779135590, 778066101, 777691345, 777959747, 779064865, 780610504, 782719116, 784250183, 785304031, 785683899, 785027924, 784044037, 782757950, 782010269, 781266251, 780442657, 779933624, 780166779, 781304626, 782836227, 784524460, 785863953, 786969070, 787498093, 787525177, 786484528, 785033646, 783881454, 782381516, 781553955, 781233444, 782043304, 783277206, 784700623, 786795654, 787945023, 788763046, 788919907, 788314590, 787382278, 786245117]
2229.7G86245117j240082j128540m25491k52380O92138J236496J511460J627197J247635
2238.3G89513550P68585m52728p21436j166382j214599j317826j338806l04489K30484
2247G83996353P81708J130676J814575J273346P34711O73141k74963n66177j206436
2255.7G88356934j146393j226044r18274m86908p4615J128387J173706J641083J355972
2264.4G89803848R73969L46756n82810o18057j364365j146240j033859n51453l75061
2273G85452728M2496J036301J183395J469040P29141J126785P66144j55945n54428
2281.7G91095657j384964j083374j630172q12683l66440K15530J196747J050033J702729
2290.4G89983063J065597O28739l01895o51093p33261j374970j077423j995926q61511
$$ y = [786245117, 785005035, 783876495, 783451004, 783198624, 783890762, 785127258, 786638718, 788265915, 789513550, 790282135, 789829407, 789107971, 787941589, 786726990, 785409164, 784070358, 783765869, 783996353, 784778061, 785908737, 787723312, 788996658, 789731369, 790404510, 790129547, 789563370, 788356934, 787210541, 785984497, 785066223, 784579315, 784504700, 785633087, 786806793, 788447876, 789803848, 790777817, 791124573, 790541763, 789923706, 788559341, 787413101, 786379242, 785827789, 785452728, 785495224, 786531525, 787714920, 789183960, 789913101, 791039886, 791806030, 791650085, 791095657, 789710693, 788627319, 786997147, 786184464, 785818024, 786033554, 787230301, 788280334, 789983063, 791048660, 791677399, 791375504, 790724411, 789991150, 788616180, 787538757, 785542831, 784681320]
2299.1G84681320j23138N96084J276474Q19321R78775M87747R47876n15899j191483
2307.8G87957077r50165j554031j255036j623687n54962p40662L88870O13327P01523
2316.4G82982254J782684K10114K45438j459198j090317j177140k172088o16379k262192
2325.1G76443176r50927N60455J250610J40381J97754J858444M51737L98178l87726
2333.8G79962082m39911k662048k209626J14441j303024n98297m09164J268844R47876
2342.5G74671173J553269J426010K41623J438064P46079J706161j15738k515716k635422
2351.2G76515503k658234j403656o92901o17066m16565J331635K89841j006241J25122
2359.8G71467438n43595p23419j518097Q8425n73196n13611Q61358j75781J298218
$$ y = [784681320, 784558182, 785154266, 786430740, 787250061, 788228836, 788716583, 789664459, 789148560, 787957077, 787006912, 785452881, 784197845, 782574158, 782019196, 781278534, 781667404, 782280731, 782982254, 784764938, 784975052, 785220490, 783761292, 782670975, 781493835, 779321747, 778705368, 776443176, 775492249, 776052704, 777303314, 777443695, 777641449, 779499893, 779951630, 780349808, 779962082, 779522171, 776860123, 774650497, 774764938, 773461914, 772863617, 772454453, 773723297, 774671173, 776224442, 777650452, 777892075, 779330139, 780076218, 781782379, 781666641, 779150925, 776515503, 773857269, 772453613, 771760712, 771143646, 770727081, 772058716, 772348557, 771342316, 771467438, 770923843, 770200424, 768682327, 768770752, 768197556, 767683945, 768545303, 768369522, 769667740]
2368.5G69667740K507400K175064J647492K346344J726379K23923j144104j017151
2376.2G78133087M0894m97361N43671R59473P67441J244201J551972J779403J126099
2384.9G85648880N50842m40597l49045o43997j524964q56704r94873o29349L2043K62680
2394.6G81054916O92826J238174J300049N30319K38114l99018o44455j017456j481704
2403.2G81511765j112748q23745m81339j79596O72836P69043O51093Q17718M23584
2411.9G82248611K58408q6136n16128j392670j623306j177597o84281l43475k31552
2420.6G76451874M74472M79431R40475J202317L32641j19323o56510j229172j645431
2429.3G76230774j304321p34177o66122n28489M36478Q89206M07791O88324N53970
$$ y = [769667740, 772175140, 774350204, 775997696, 778344040, 780070419, 780294342, 779150238, 778133087, 778173981, 777676620, 778220291, 779179764, 779947205, 781191406, 782743378, 784522781, 785648880, 786199722, 785759125, 785410080, 784766083, 783241119, 782384415, 781389542, 780760193, 780792236, 781054916, 781747742, 782985916, 784285965, 784816284, 785054398, 784655380, 784010925, 782993469, 781511765, 780399017, 779575272, 779093933, 778914337, 779587173, 780356216, 781007309, 781825027, 782248611, 782507019, 782420883, 781904755, 780512085, 778888779, 777711182, 777026901, 776683426, 776451874, 776926346, 777405777, 778346252, 779548569, 779881210, 779761887, 779105377, 777876205, 776230774, 774926453, 774192276, 773526154, 772997665, 773434143, 774323349, 774731140, 775419464, 775973434]
2438G75973434K19727k37579q04215j156082j268082j028137j312866q78830m57153
2446.6G69050217J21231O74667P60422J223373N97077N111n04989o40717p16476j267166
2456.3G69302750j506882j578522l26843J35040M1275M65088Q47321J072235L69644
2465G68821106J70135k32009p94144j297073j401062j116562j267319n51148O714M22058
2474.6G62760696P37992Q16955O55518N12390M56848q32596r70001p50046j401291
2483.3G61986465j479949r91135l03192J69449P27462O95572Q51212Q12835N60456
2492G63029175J95770q12225r23081j072693r08584j129990j355896j96152O66886
2500.6G57493210Q60748J57776M73099J224136Q13141J38473o45370j136169j247025
$$ y = [775973434, 776193161, 775955582, 775151367, 773995285, 772727203, 771699066, 770386200, 769507370, 769050217, 769171448, 769846115, 770606537, 771829910, 772426987, 772432098, 771927109, 771286392, 770569916, 769302750, 767795868, 766217346, 765890503, 766025543, 766066818, 766531906, 767379227, 768451462, 768821106, 768991241, 768759232, 767965088, 766668015, 765266953, 764150391, 762883072, 762331924, 762338638, 762760696, 763498688, 764315643, 764971161, 765483551, 765940399, 765107803, 764137802, 763387756, 761986465, 760506516, 759515381, 759212189, 759381638, 760109100, 760804672, 761655884, 762468719, 763029175, 763224945, 762412720, 761489639, 760416946, 759508362, 758378372, 757022476, 756826324, 757493210, 758353958, 758511734, 758984833, 760208969, 761022110, 761160583, 760515213, 759379044, 758132019]
2509.3G58132019j013489j048584m67071l17154l75290R47571J100845N84717M61731
2518G58005295L32413j07880o55747j072845j447372j028290n75028m40521m36554
2526.7G52573471K31857P39975O74134R30938O36902K40402n09948r01184j093827
2535.4G53522720j469116j228180j252975p94449k29O55746R60999Q82797M33274n2796
2545G51657791M7684j20850l25165j260681j558456j135788j447525q62808r308O08978
2554.6G45593872P65915N80292L44772J95465K7695l05939j05896p21283j473312j802292
2564.3G43099289j339951k72293N5466M15497M86679O25610N30167M32892j0147o81992
2573.9G43341217o29501j290131j191864r16519p23724l21122k35138M19999O11343
$$ y = [758132019, 757118530, 756069946, 755602875, 755285721, 754910431, 755858002, 756958847, 757543564, 758005295, 758337708, 758229828, 757574081, 756501236, 755053864, 754025574, 753450546, 753010025, 752573471, 752805328, 753545303, 754219437, 755150375, 755787277, 756027679, 755517731, 754616547, 753522720, 752053604, 750825424, 749572449, 748778000, 748777771, 749433517, 750394516, 751277313, 751710587, 751657791, 751705475, 751584625, 751259460, 749998779, 748440323, 747304535, 745857010, 744994202, 744984894, 745593872, 746359787, 746940079, 747284851, 747480316, 747508011, 747202072, 747096176, 746374893, 744901581, 743099289, 741759338, 741487045, 741542511, 741958008, 742444687, 743070297, 743600464, 744033356, 744023209, 743341217, 742711716, 741421585, 740229721, 739313202, 738589478, 738268356, 738033218, 738453217, 739064560]
2582.6G39064560Q67996M62113j70441k48413l13263n86853j266098q88596r02862
2591.3G36018143o40488k00424k84653N28412O58875M46548J30920J13755L34625j70822
2600.9G36934891q42362j115036j007995j101380o64062k95258K76642P52106L97644
2609.6G33335190J79825Q0032N22003l1738r65805j192932j396408j083374o36063
2618.3G28810730o19888q17719K3194N11550O16913O58798L4638j13297p67669j217118
2627.9G27120132j359405j422806j263885q93097n73883o91223L85208M37469j9684
2636.6G21718826P6294o9504J16654q18939j039810q40531j193848j269149j037445
2645.3G15642548n39475m63638L6545L04107N40619L16162l51867n16358j017532r76639
$$ y = [739064560, 739932556, 740394669, 740224228, 739975815, 739662552, 739075699, 737809601, 736921005, 736018143, 735377655, 735177231, 734892578, 735420990, 736079865, 736526413, 736657333, 736771088, 737105713, 736934891, 736092529, 734977493, 733969498, 732868118, 732204056, 731908798, 732185440, 732937546, 733335190, 733515015, 733595047, 734117050, 734085312, 733119507, 731926575, 730530167, 729446793, 728810730, 728190842, 727373123, 727396317, 727907867, 728524780, 729183578, 729218216, 729104919, 728337250, 727120132, 725760727, 724337921, 723074036, 722180939, 721607056, 720915833, 721301041, 721738510, 721718826, 721795120, 721725616, 721842270, 721023331, 719983521, 719142990, 717949142, 716679993, 715642548, 715103073, 714639435, 714675980, 714980087, 715520706, 715836868, 715485001, 714968643, 713951111, 712974472]
2654.9G12974472r99756j171493j296616q94165p9803l9902l6698j77612J31226K68097
2664.6G08677750J87301j00021r90372j024627j052399j295242j083222m88434o24466
2673.3G02206268m33349P83539P56988K73743r0180k39029m09317p18841r72214j250381
2682.9F99907227r87778r08127m15421k26058k98157L27987L22266O7673Q9340L4866
2692.5F97913818l96347n54809p90863j239701j348724r12247k62680p33947m42124
2701.2F91232376M00543M86374K08130k65808k4567j74179q85162j637268j357346
2709.9F87983093j031646j332551l29666L91846K67105m04816l24401M22287L20053
2718.6F85961304O5078q09707r68094p78198j055680q98666q45566p44934j50833M77676
$$ y = [712974472, 711974716, 710803223, 709506607, 708612442, 708532639, 708492737, 708456039, 708278427, 708409653, 708677750, 708865051, 708765030, 707774658, 706750031, 705697632, 704402390, 703319168, 702830734, 702206268, 701772919, 702556458, 703313446, 703587189, 703497009, 703257980, 702848663, 702129822, 701157608, 699907227, 698919449, 698011322, 697595901, 697369843, 697071686, 697399673, 697721939, 697789612, 697878952, 697913818, 697517471, 696962662, 696171799, 694932098, 693583374, 692671127, 692408447, 691674500, 691232376, 691632919, 692119293, 692327423, 692061615, 692037048, 691862869, 690977707, 689340439, 687983093, 686951447, 685618896, 685289230, 685681076, 685948181, 685543365, 685218964, 685641251, 685961304, 686026382, 685216675, 684248581, 683470383, 682414703, 681516037, 680670471, 679925537, 679774704, 680252380]
2728.2F80252380J28708J80054L90015k27051l55148m11606q87375j164322r97238
2736.9F76908417q47855l67813k09885p3700M32358K73056J45340j86310R0714J43433
2746.5F76307755m63944n39474j083222j079483p11212o19507m92096K42539P31124
2755.2F72292480K35138J02082l5706K91901r0637q56095q80279r98230p78733q67614
2764.9F68414307n85556l63846N0049N05523N28107R43680L31268j89819p57447q14666
2774.5F68061600n27725j132279q39233p79877o51550l29972o5460L76358K34451L5859
2784.2F64382172j31073N4016m60511j011276j196747j580581j058426p25098q42438
2792.8F57430038m30297Q1329k70996l5477N03998j58539p02743j248322j088715o68258
$$ y = [680252380, 680381088, 680561142, 680951157, 680724106, 680368958, 679957352, 679069977, 677905655, 676908417, 676060562, 675692749, 675482864, 675409164, 675841522, 676114578, 676259918, 676073608, 676164322, 676307755, 675843811, 675304337, 674221115, 673141632, 672430420, 671810913, 671318817, 671561356, 672292480, 672527618, 672629700, 672593994, 672885895, 672795258, 671939163, 671058884, 670060654, 669281921, 668414307, 667828751, 667464905, 667514954, 668020477, 668548584, 669492264, 669823532, 669633713, 668876266, 668061600, 667533875, 666401596, 665562363, 664782486, 664130936, 663800964, 663735504, 664111862, 664346313, 664382172, 664251099, 664305115, 663844604, 662833328, 661636581, 660056000, 658997574, 658272476, 657430038, 656999741, 657081070, 656810074, 656774597, 657278595, 657120056, 656417313, 655168991, 654080276, 653412018]
2802.5F53412018j034088j485215j600647o82525k1668l10897n32074k28119o2714
2811.2F47454071o95038j129303n00412l98636j508941j954651j606751r76753j144752
2819.8F37538834j267319n21584k36358J03836o05469j136971r14955j448135j457748
2828.5F30054131j317978j441689j905403j418190m33846o48613q78257r32160n54847
2837.2F20523148o17638j350861j801796k075309j944008j786843j936721j730767
2844.9F07279205j258239j685372j845360j466446j227035j424942j728058q03566
2852.6E95840187j095695j387215j007271j820488j779365j490326j016503q50181
2860.3E85393143j174546q59489q03337q17795j204071j845970k002640j808014k334328
$$ y = [653412018, 652377930, 650892715, 649292068, 648609543, 648587875, 648276978, 647744904, 647516785, 647454071, 646759033, 645629730, 645129318, 644730682, 643221741, 641267090, 639660339, 638683586, 637538834, 636271515, 635749931, 635513573, 635617409, 635011940, 633874969, 632960014, 631511879, 630054131, 628736153, 627294464, 625389061, 623970871, 623537025, 622888412, 622010155, 621077995, 620523148, 619905510, 618554649, 616752853, 614677544, 612733536, 610946693, 609009972, 607279205, 606020966, 604335594, 602490234, 601023788, 599796753, 598371811, 596643753, 595840187, 594744492, 593357277, 592350006, 590529518, 588750153, 587259827, 586243324, 585393143, 584218597, 583359108, 582555771, 581737976, 580533905, 578687935, 576685295, 574877281, 572542953]
2869E72542953k887840k246513j843834j951485k140198k214126j837349j235085j667785
2877.7E54518738k005158j458206j861763j821632j795426j982307j502953j356582
2885.4E40734711r75266o79512l41263o11267n08766L46909k37007k17400K08969k96020
2895.1E37424088n96505n99708p15866o70090k94228l37562m28772j33972J45683k44637
2904.7E33548431o08520p82662q19549n89562j278610j376533j289368j596298j555977
2913.4E23651352j492462p97882p70493j078453j480408j485748j065559j736183j774178
2922.1E11969986j405067j123734j257782j071548j40000l42827l30925Q1559K62527
2930.7E06642189L31345R24720J340638Q73375J013526Q17032Q82378J590042J834145
$$ y = [572542953, 569655113, 567408600, 565564766, 563613281, 561473083, 559258957, 557421608, 556186523, 554518738, 552513580, 551055374, 549193611, 547371979, 545576553, 543594246, 542091293, 540734711, 539759445, 539079933, 538738670, 538127403, 537618637, 537965546, 537728539, 537511139, 537720108, 537424088, 536827583, 536227875, 535512009, 534841919, 534547691, 534210129, 533781357, 533647385, 533793068, 533548431, 532939911, 532157249, 531337700, 530748138, 529469528, 528092995, 526803627, 525207329, 523651352, 522158890, 521361008, 520590515, 519512062, 518031654, 516545906, 515480347, 513744164, 511969986, 510564919, 509441185, 508183403, 507111855, 506971855, 506629028, 506298103, 506379662, 506642189, 506973534, 507898254, 509238892, 510112267, 511125793, 511942825, 512825203, 514415245, 516249390]
2939.4E16249390J833725K105102K471886K316513K579155K430420K177810K691880
2947.1E34855881K443542J821175J779098J879006J805496K210236K397613K436524
2954.8E51628571K709808K415962K395020K619857K588997K090950J654549J985397
2962.6E70089111J928101J687660J769638J541977J970368K538909J979676J639366
2970.3E85144806J909828K189865J645737J223106J772270J437645R94454J165199
2978E97482910J233025J218490J228257J263313J703644K009964J310577J220627R70650
2986.7F09641457O50863R48944O57006N68771L29628N21164O32439N40771Q95043P52334
2996.3F16138420R69887N53818J89590M81720J08490k44789l72162n73044q46100l48358
$$ y = [516249390, 518083115, 520188217, 522660103, 524976616, 527555771, 529986191, 532164001, 534855881, 537299423, 539120598, 540899696, 542778702, 544584198, 546794434, 549192047, 551628571, 554338379, 556754341, 559149361, 561769218, 564358215, 566449165, 568103714, 570089111, 572017212, 573704872, 575474510, 577016487, 578986855, 581525764, 583505440, 585144806, 587054634, 589244499, 590890236, 592113342, 593885612, 595323257, 596317711, 597482910, 598715935, 599934425, 601162682, 602425995, 604129639, 606139603, 607450180, 608670807, 609641457, 610292320, 611241264, 611898270, 612467041, 612796669, 613317833, 613950272, 614491043, 615386086, 616138420, 617108307, 617662125, 617851715, 618333435, 618441925, 618197136, 617824974, 617251930, 616405830, 616057472]
3006F16057472J99280J79024J35460p7820k29988q6403o0959j81274j48354j020851
3015.6F14765587j544762j104660o63185n63164j035003o72951n37834k52648j56860
3024.3F08234520o92101m10385q72421j228828j366425j088600r64737j425552q81615
3033E99303856j002693r23500o57883m98505m18243q67882r17129j245842j348076
3041.6E91424103j537400j414299j117057j154518j375466j546478o97861o15806l59688
3050.3E81605530q04138j319848k06451j076240j818619j816979j762390j042595j048851
3059E70709419j103592j068382o92978o43043q40187j010399j083107j025582j458587
3067.7E61783562j299172j362915j302223j277580j843720r40780l14255r91669r48829
$$ y = [616057472, 616256752, 616435776, 616571236, 616493416, 616263428, 616177025, 616116066, 615934792, 615786438, 614765587, 613220825, 612116165, 611452980, 610889816, 609854813, 609181862, 608644028, 608391380, 608234520, 607542419, 607132034, 606259613, 605030785, 603664360, 602575760, 601611023, 600185471, 599303856, 598301163, 597377663, 596719780, 596221275, 595803032, 594935150, 594018021, 592772179, 591424103, 589886703, 588472404, 587355347, 586200829, 584825363, 583278885, 582581024, 581965218, 581605530, 580801392, 579481544, 579275093, 578198853, 576380234, 574563255, 572800865, 571758270, 570709419, 569605827, 568537445, 567844467, 567201424, 566361237, 565350838, 564267731, 563242149, 561783562, 560484390, 559121475, 557819252, 556541672, 554697952, 553757172, 553442917, 552451248, 551502419]
3076.4E51502419r44024j171608j006164j367531j162186j150779j699524j286011
3084.1E41714592r29909o26907j152611j501732r76257j074753j018295q50487q48198
3092.7E32735443j263580j044388r14192j435890j162644j401100j356468q80852j028824
3101.4E22247505j313476p79610o06079j188088o82411j144638j376495p54814j173516
3110.1E13228378j528625j473732p77703p54966q34809r98764j264915o53610p10678
3118.8E04230576q64449j405640j659240j218796j226692j262360j148186n95398n53970
3127.5D94295845q46329j044845r14307n36232p16324j240120j574936r04388r15909
3136.1D85602455j278992r22508q88290j057091j310348q42209n00031o56166q16688
$$ y = [551502419, 550558395, 549386787, 548380623, 547013092, 545850906, 544700127, 543000603, 541714592, 540784683, 540157776, 539005165, 537503433, 536527176, 535452423, 534434128, 533583641, 532735443, 531471863, 530427475, 529513283, 528077393, 526914749, 525513649, 524157181, 523276329, 522247505, 520934029, 520154419, 519548340, 518360252, 517677841, 516533203, 515156708, 514401894, 513228378, 511699753, 510226021, 509448318, 508693352, 507858543, 506859779, 505594864, 504941254, 504230576, 503366127, 501960487, 500301247, 499082451, 497855759, 496593399, 495445213, 494849815, 494295845, 493449516, 492404671, 491490364, 490954132, 490237808, 488997688, 487422752, 486518364, 485602455, 484323463, 483400955, 482512665, 481455574, 480145226, 479303017, 478802986, 478146820, 477330132]
3144.8D77330132q94814n80444q97942j255798j172791j109733j131592j061516q35991
3153.5D68389511m48761k93960q20694j067009j166191p73888m46968q32939q32253
3162.2D61706848r18083q52127q31604j148682j197357r46350p25060n76934n47829
3170.9D53962822o56586m35409n27230m38613p54052j215286r52797j282768j096459
3179.5D46603622r72824o41632k10876m72260k45743n28297r56993j067810n57137
3188.2D40950050n08003j053009q54797p40662m35753q60939r19571l90892n19256
3196.9D34667168n77927l68156Q621n72777o29654p42340j176720r94911j008530m68978
3206.5D28135796n98336k04391p4005r04045p68624n09453J08986n27610r70917k87819
$$ y = [477330132, 476435318, 475854874, 474956932, 473701134, 472528343, 471418610, 470287018, 469225502, 468389511, 467940750, 467646790, 466826096, 465759087, 464592896, 463819008, 463372040, 462539101, 461706848, 460788765, 459936638, 459105034, 457956352, 456758995, 455812645, 455087585, 454510651, 453962822, 453306236, 452870827, 452343597, 451904984, 451150932, 449935646, 448982849, 447700081, 446603622, 445630798, 444989166, 444778290, 444306030, 444060287, 443531990, 442574997, 441507187, 440950050, 440442047, 439389038, 438534241, 437793579, 437357826, 436496887, 435577316, 435186424, 434667168, 434089241, 433721085, 433729706, 433156929, 432527275, 431784935, 430608215, 429613304, 428604774, 428135796, 427537460, 427333069, 427259064, 426355019, 425586395, 425076942, 425185928, 424658318, 423687401, 423399582]
3216.2D23399582m62494q73833j212005o17295l21006p96585o16494K9450o5689l16277
3225.8D18147354j36337o88057p37763o42395r56001p46002l37410l55263o12831j49917
3235.5D12785378j9646m58374o75278m58755k60010l51258m98886n26771m63905r62449
3245.1D08110046o57730p86018r03282L11279N08537P6294r76295j007729l14064m27093
3254.8D03933945k58522l78342l40576m61197k60925m64974p60650j82343k13203O4964
3264.4D00678177j15242l12882j58729j74217l01972q82492o88095j84593j14212j077461
3274C96668282p30362J95274k61383J10969k30445l90931j79596l76701l5248j53083
3283.7C94616776k40059m38576n30739p12471o50558L8032K27585k04887p65419m49639
$$ y = [423399582, 422937088, 422063255, 420851250, 420233955, 419912949, 419116364, 418499870, 418529320, 418463631, 418147354, 418011017, 417322960, 416585197, 415942802, 414986801, 414240799, 413903389, 413548126, 412935295, 412785378, 412765732, 412307358, 411632080, 411173325, 410913315, 410562057, 410063171, 409536400, 409072495, 408110046, 407452316, 406666298, 405763016, 406074295, 406582832, 406659126, 405682831, 404675102, 404361038, 403933945, 403675423, 403297081, 402956505, 402495308, 402234383, 401769409, 401008759, 400826416, 400613213, 400678177, 400562935, 400250053, 400091324, 399917107, 399615135, 398732643, 398044548, 397859955, 397745743, 396668282, 395937920, 396133194, 395871811, 395982780, 395752335, 395361404, 395181808, 394805107, 394769859, 394616776, 394376717, 393938141, 393407402, 392694931, 392044373, 392082405, 392309990, 392105103, 391339684, 390890045]
3293.3C90890045q6670J90163l75023j151657m59709j02043n4894m5624k03132l61061
3303C88240395k65313k24037m70848n9967N1117l40576p03926n04799j98860m45328
3312.6C85077858n57861k18315j7167m40559j67770j45989m45556o20804p54853j02043
3322.3C81606941m85649m55627n54390q72040K64893J56669l96767m58183j54381k79197
3331.9C78372269q87528p21321k5329N80558o15234q64716l8795m80042k54898k53486
3341.6C74811478n54695m56238p29599o41213N6839L6164n54238n30205l05709k65923
3351.2C70866661l33710n03006p80410m33846j25236l14789l60298n81627j40114j80969
3360.8C67112656p41616n69114k99187M7569l40576q20579q30842p69119k23198M10195
$$ y = [390890045, 390803375, 390993538, 390618515, 389466858, 389007149, 388905106, 388850212, 388804588, 388601456, 388240395, 387975082, 387751045, 387280197, 387220230, 387271347, 386930771, 386226845, 385722046, 385523186, 385077858, 384519997, 384301682, 384284515, 383843956, 383676186, 383530197, 383084641, 382463837, 381708984, 381606941, 381121292, 380665665, 380111275, 379239235, 379504128, 379660797, 379264030, 378805847, 378651466, 378372269, 377484741, 376763420, 376738091, 377318649, 376703415, 375838699, 375799904, 375319862, 375064964, 374811478, 374256783, 373800545, 373070946, 372429733, 372486572, 372522736, 371968498, 371438293, 371132584, 370866661, 370532951, 370029945, 369249535, 368815689, 368690453, 368375664, 368015366, 367433739, 367293625, 367112656, 366371040, 365801926, 365502739, 365550308, 365209732, 364389153, 363558311, 362789192, 362565994, 362976189]
3370.5C62976189J08947m56543j56402k92740k58713l49502r67751k87208j0758o16302
3380.1C59689217m20189j30501k62871k9793j14517k38953m2724n07507l17994k72598
3389.8C57351570p14531p4959N7183p56188l68118L48892l85856n05982J53313o8894
3399.4C55036430M692K14234r3231n23186n87006j41105K78434N7946r2659j13449
3409.1C54041100l71514k36130o9351K35062J10283k34719j43432r690J94207l06435
3418.7C53209381m49943j37215J44043O01463O2943k69203j06698r4108K73361l4637
3428.3C53199387k17209M65851j85585n55268J32485K99377K64816l59535R6817N77202
3438C53718338L79601L35502R3994L74909m98772m96K55814j95923Q86917n04303k04887
$$ y = [362976189, 363085136, 362628593, 362472191, 362179451, 361920738, 361571236, 360603485, 360316277, 360305519, 359689217, 359269028, 359138527, 358875656, 358845863, 358731346, 358492393, 358449669, 357942162, 357624168, 357351570, 356637039, 356562080, 356619263, 355863075, 355494957, 355843849, 355457993, 354952011, 355105324, 355036430, 355041122, 355255356, 355162125, 354638939, 354051933, 353910828, 354189262, 354247208, 354154549, 354041100, 353669586, 353433456, 353364105, 353599167, 353709450, 353474731, 353331299, 353321609, 353515816, 353209381, 352759438, 352622223, 352766266, 353367729, 353430672, 353161469, 353054771, 352960663, 353234024, 353199387, 352982178, 353448029, 353262444, 352707176, 352839661, 353139038, 353403854, 353044319, 353141136, 353718338, 354097939, 354433441, 354527435, 354902344, 354403572, 354403076, 354658890, 354462967, 355349884, 354845581, 354640694]
3448.6C54640694J068496O51970J72234p0114L40881J43700O82373L54881J11275L32184
3458.2C58428574l25585Q6060j38397N56564R25293Q45871J101951p1067K2316J69296
3467.9C61600876o5766L85666J027756N23796k36206m5090m02336Q04520J264038o6032
3477.5C64791222j16539N20172Q66890O97250J8692O7291J417885M30145n43785M68941
3487.2C68618164K66190M94079J090126J202050M45861j64146j86768M14353J002426
3495.8C73182335j18828J67236Q17223P78236O22940P25708N67437q56591Q4916P88803
3505.5C76759415Q98285J185989J071548L26119m47044J018905N67780L02314O52733
3514.2C82336044J24665O28242Q18787J192550M85955j67885P06749J141472l03498
$$ y = [354640694, 355709190, 356361160, 356533394, 356463280, 356804161, 356947861, 357630234, 357985115, 358096390, 358428574, 358102989, 358189049, 358050652, 358607216, 359532509, 360378380, 361480331, 361409264, 361431580, 361600876, 361535110, 361920776, 362948532, 363472328, 363236122, 363191032, 362788696, 363593216, 364857254, 364791222, 364674683, 365194855, 366061745, 366758995, 366777687, 366844978, 368262863, 368693008, 368149223, 368618164, 368884354, 369378433, 370468559, 371670609, 372116470, 371952324, 371765556, 372179909, 373182335, 373063507, 373230743, 374047966, 374826202, 375449142, 376174850, 376742287, 375885696, 375970612, 376759415, 377657700, 378843689, 379915237, 380241356, 379794312, 380813217, 381380997, 381683311, 382336044, 382460709, 383088951, 383907738, 385100288, 385586243, 385418358, 386125107, 387266579, 386963081]
3522.9C86963081r90905J437034J701699Q68339J27373J2283L84026P42912Q18443
3531.5C92064285L71361Q75244P93991J285553p63m23317J639519O04286O96602R07211
3541.2C98813972P02401P84797J222191M54140l96271J605988n24445R21364K227745
3549.9D05811882K094841J924591k355919M04740J106605Q21190J545448P2861J766434
3558.5D13192673J833000O30417m62418K100754J862450N50727M008484m06761p36618
3567.2D22572708q25271o70853L767090J424331J566506K131042J691551L48130P71484
3575.9D32776718J836853M88701K286263J082916P03468J524429J719971K034798J311149
3584.6D45765266M806939J739883k527237J81542j531792L929634M127464K196160
$$ y = [386963081, 385972176, 387409210, 389110909, 389979248, 390106621, 390118904, 390502930, 391245842, 392064285, 392435646, 393310890, 394104881, 395390434, 395389671, 394966354, 396605873, 397210159, 397906761, 398813972, 399516373, 400301170, 401523361, 401977501, 401581230, 403187218, 402662773, 403584137, 405811882, 407906723, 409831314, 407475395, 407880135, 408986740, 409807930, 411353378, 411426239, 413192673, 415025673, 415656090, 415193672, 417294426, 419156876, 419707603, 423716087, 423309326, 422572708, 421747437, 421076584, 424843674, 426268005, 427834511, 429965553, 431657104, 432005234, 432776718, 434613571, 435102272, 437388535, 438471451, 439174919, 440699348, 442419319, 444454117, 445765266, 450572205, 452312088, 449784851, 449966393, 448434601, 452364235, 456491699, 458687859]
3592.3D58687859j09063J253243L921432j561317K238731L755379M84924K740746J180839
3601D72592773J151391K382469J064682J881904L955574K320137j753845L109818p89872
3609.6D85915031Q33512Q805122Q14705k312241L617669j257515M959068N354309k23236
3618.3E06506424O7100k480888J472168L780670K987290K186355K590485K965050L330955
3627E23405609O987686l673401j1997909O833038O192932N036774j564j538887K752495
3635.7E33996773L213577K066193N12809K482109L476487K703437K56806N13267L296166
3644.4E52517624L929329N264854l090629l849221N519677j323433l460884J339836
3652.1E56847153P077751M797249M501457M020576j0024681K842522N920639J009293
$$ y = [458687859, 458578796, 459832039, 463753471, 462192154, 464430885, 468186264, 468671188, 471411934, 472592773, 473744164, 476126633, 477191315, 479073219, 483028793, 485348930, 483595085, 486704903, 485915031, 486748543, 495553665, 496368370, 494056129, 497673798, 496416283, 501375351, 506729660, 506506424, 506573524, 504092636, 505564804, 509345474, 512332764, 514519119, 517109604, 520074654, 523405609, 530393295, 526719894, 514721985, 521555023, 527747955, 532784729, 532783165, 531244278, 533996773, 537210350, 539276543, 539789352, 542271461, 545747948, 548451385, 548708191, 549221458, 552517624, 556446953, 561711807, 558621178, 554771957, 560291634, 558968201, 555507317, 556847153, 563924904, 568722153, 573223610, 577244186, 567219505, 570062027, 575982666, 576991959]
3659.8E76991959R61151P94563K911072J575393J382027J552010J163902N365257L745652
3668.5E96442986k14577j962815p623252M545478J0108071R171982n539284k0742149
3676.2E84186440O571311J0202294N003853k958412J326522L636437J910820J144638
3683.9F11023903K66342J641007M480323M259949j2114448q69370R749146o425858
3691.6F12010994O68945O214791J758995J962661K01073J72577J572266Q00857L136292
3700.3F28499451K584800p325935j246109O258965J460914K11983J583671L942261
3708F35970001L384247q355408M793167L334465j4139862N947648N326995L76702J037445
3716.7F37675400L294296J813202m453926J076088O667175m836273l913231O644402
$$ y = [576991959, 577953110, 578747673, 581658745, 583234138, 584616165, 586168175, 587332077, 592697334, 596442986, 596228409, 594265594, 586642342, 591187820, 601295891, 610467873, 604928589, 584186440, 590757751, 600960045, 605963898, 603005486, 604332008, 607968445, 609879265, 611023903, 611290245, 612931252, 617411575, 621671524, 609557076, 608687706, 618436852, 612010994, 612679939, 618894730, 620653725, 622616386, 622817459, 622990036, 624562302, 625363159, 628499451, 631084251, 623758316, 622512207, 628771172, 630232086, 630444069, 632027740, 635970001, 639354248, 630998840, 635792007, 639126472, 624986610, 630934258, 636261253, 636637955, 637675400, 640969696, 642782898, 638328972, 639405060, 646072235, 641235962, 637322731, 643967133]
3724.4F43967133P58056j252746l183060R93042M638214K347183N900116n375747n926896
3733.1F42865295R645234j678086r663620J616898L452148J137848L512116L059005
3740.8F53946838l517532M782715J1963196j5148163j4293633J3194695P587890O701355
3748.5F65217361o711196j0917511J2657013p572251n807342P218704N781021K939758
3756.2F62805557n425567M383926M653320j0186233o9733N499954J665116L00293L385162
3764.9F67011795l400879m051666M672089N443572j466674j0679016L252639M160233
3772.6F64942093O21414J450501M8675J053619Q04749K798920j080628q239898L206329
3781.3F65605774K786331J874695K981033l500366r81979K351532J173019K00577p64923
$$ y = [643967133, 644725189, 643472443, 640289383, 641282425, 645920639, 648267822, 654167938, 648792191, 642865295, 652510529, 650832443, 641168823, 642785721, 646237869, 647375717, 650887833, 653946838, 650429306, 655212021, 667175217, 652027054, 637733421, 650928116, 658516006, 665217361, 658506165, 647588654, 660245667, 652673416, 646866074, 654084778, 659865799, 662805557, 657379990, 661763916, 666417236, 656231003, 656161270, 661661224, 663326340, 663626633, 667011795, 663610916, 659559250, 664231339, 669674911, 668208237, 657529221, 660781860, 664942093, 665563507, 667014008, 667062683, 668116302, 668921051, 671719971, 670639343, 662399445, 665605774, 668392105, 670266800, 673247833, 669747467, 668765488, 671117020, 672290039, 672490616, 671725693]
3790F71725693K67639L95965N41001K91672K455291L405686n828247l966675L988190
3798.7F73276215N408477M990616r138565r498520M259110M687118O457978L549270
3806.4F83991699j4405060q47091Q150558K436829J33056J67847j25122J980667N990906
3815.1F87474289l259354j4529266P192764O651383M613266J43814k0559006M104614
3822.8F71832504O484909K651825L024063o62689l583755J708908K146606K544632
3830.5F86147003P22122q659057M078827P558899p774964O18439R147034r570389k421951
3839.2F79845963P778091o524963J516037O893539m124680l884964K899628K042236
3846.9F86440887J294022K571335m16565K791367O198654o397324m07486j8939133
$$ y = [671725693, 671993332, 672389297, 672930298, 673221970, 675677261, 679082947, 673254700, 669288025, 673276215, 678684692, 683675308, 674536743, 665038223, 669297333, 673984451, 680442429, 683991699, 669586639, 668739548, 676890106, 679326935, 679459991, 679627838, 679502716, 681483383, 687474289, 684214935, 669685669, 676878433, 683529816, 688143082, 688286896, 667727890, 671832504, 678317413, 680969238, 683993301, 683330612, 679746857, 681455765, 683602371, 686147003, 686869125, 678210068, 682288895, 689847794, 682072830, 682691269, 691838303, 682267914, 679845963, 687624054, 681099091, 682615128, 689508667, 685383987, 681499023, 684398651, 686440887, 687734909, 690306244, 689889679, 692681046, 698879700, 692482376, 692074890, 673135757]
3854.6F73135757M272919J1367188k168579j786881K282791M012070L788757o720123
3862.3F88183899Q25500O518403q233109m370193N638351O475677O789551q770523
3870F93057556r822311M504242O737365J842270j2286834K349166N328141P96509L600311
3878.7F96106415M707413q170090p324677P434693J679306J593857L766784j4995804
3886.4F84797897J891785M948654K178803N382843j771546q549270K548294L473892
3894.1F94901352j138840J470871J554642L372726L78266j1244355O585541J340637
3901.8F97220840o201553N473175l336868j733322O85653J539307K838745R3765N42908
3910.5F97122650o9656n16815n45044K39410J933136R64661m771576k484665N488891
$$ y = [673135757, 677408676, 688775864, 686607285, 684820404, 687103195, 691115265, 694904022, 688183899, 689009399, 695527802, 687294693, 682924500, 688562851, 695038528, 701828079, 693057556, 683235245, 687739487, 694476852, 696319122, 684032288, 686381454, 691709595, 692506104, 696106415, 700813828, 692643738, 685319061, 692753754, 694433060, 696026917, 699793701, 684797897, 686689682, 691638336, 693817139, 699199982, 697428436, 688879166, 691427460, 694901352, 693762512, 695233383, 696788025, 700160751, 700539017, 689294662, 695880203, 697220840, 691019287, 696492462, 693155594, 691422272, 692107925, 693647232, 696485977, 696579742, 697122650, 697052994, 696536179, 695991135, 696230545, 698163681, 699128342, 694356766, 691872101, 697360992]
3919.2F97360992k17971l508377L154754K273789J256561l039475l486862K153931
3926.9F95947342J771240O92749j298446l7003J832046k685546j119156J837387N43518
3935.6F97484131M91562M29382p42798m58755Q77990K209702j17035n063019J89591
3944.3F95300751K441330J745529J666641k311478N19410k32468k683182K355728M82865
3953F99285126j147309O15082J075134N3788j185990N23758J55716N39551O08444n39932
3962.6F99983368N06744n86395o13327M43802M10538K00729j012039o8894J323014
3971.3G00587540r2926l88184M94614O59332N35278q94851k08207R45435l36456n69229
3980.9G00732346j36872n31845m79050K12784J03531P50122Q46939k35595O9122l59345
$$ y = [697360992, 697143021, 693634644, 696789398, 699063187, 700319748, 697280273, 693793411, 695947342, 697718582, 698411331, 697112885, 697075882, 698907928, 696222382, 695103226, 696940613, 697484131, 697975693, 698405075, 697662277, 697203522, 698081512, 700291214, 700174179, 695111160, 695300751, 697742081, 699487610, 701154251, 698842773, 699362183, 699129715, 696446533, 698802261, 699285126, 698137817, 698752899, 699828033, 699881821, 698695831, 699219589, 699375305, 699914856, 700523300, 699983368, 700490112, 699903717, 699290390, 699734192, 700144730, 700345459, 699333420, 699264526, 700587540, 700494614, 700106430, 700601044, 701260376, 701795654, 700900803, 700692596, 701638031, 701301575, 700732346, 700595474, 700063629, 699584579, 699797363, 699900894, 700651016, 701497955, 701262360, 701331482, 700972137]
3990.6G00972137K03782Q70208J19553k28577o77185l51486k41013M01535P50657K62985
4000.2G02082596
$$ y = [700972137, 701175919, 702046127, 702165680, 701937103, 701259918, 700908432, 700667419, 701068954, 701819611, 702082596]
##END=$$ End of the data block
