##TITLE=$$ Begin of the data block
##JCAMP-DX=5.00 $$ ACD/SpecManager v 10.08
##SPECTROMETER/DATA SYSTEM=Varian
##DATE=20 Nov 2012 14:22:28
##DATA TYPE=INFRARED SPECTRUM
##DATA CLASS=XYDATA
##ORIGIN=
##OWNER=
##NPOINTS=3735
##FIRSTX=399.26403809
##LASTX=4000.35498047
##MAXX=4000.35498047
##MINX=399.26403809
##MAXY=79.37592316
##MINY=27.26364326
##XFACTOR=1.0000000000
##YFACTOR=0.000000100000000
##FIRSTY=54.33731461
##DELTAX=0.96440572
##XUNITS=1/CM
##YUNITS=TRANSMITTANCE
##XYDATA=(X++(Y..Y))
399.3 543373146 511202545 508913345 509968185 519254189 529741631 529556808 526037407 518523712
407 518523712 519139557 525066795 520645142 508861084 504761429 503330803 499925957 504995842 513913155
415.7 513913155 525369568 535414200 535658150 524749794 527524796 528753204 520766754 509378777
423.4 509378777 504965439 509615173 511033287 502900810 503045082 511959877 527051620 537231407
431.1 537231407 532143707 526046677 522907639 518274612 510300293 501507835 498583183 498573151 500331268
439.8 500331268 506062126 510549240 515279999 515935516 517834816 530733757 535760880 532980766
447.5 532980766 532239647 523124275 516025352 514596825 511308975 511030922 519943886 530680199 539052429
456.2 539052429 544459953 545514946 543685417 538202858 527678223 519960098 515709953 512114410
463.9 512114410 510795326 513596497 516933899 520687599 523889236 525127411 524154701 524325371 519507294
472.6 519507294 512489166 509135895 499825554 495983505 497122688 494509926 494663391 501497459 507733307
481.2 507733307 506472473 508198051 514856033 520335274 513771973 501024513 498049469 497104759
489 497104759 495634499 491748009 495433617 501903687 501770554 505206642 506814690 506683769 505508690
497.6 505508690 506220322 504263992 495667648 489468765 485657730 486363258 484212265 485970497 491240883
506.3 491240883 494141388 497316818 494968758 492149048 489998550 485329170 479464302 474074631
514 474074631 471587944 468068008 465399513 465655212 466337624 467521858 471376495 473029366 472698402
522.7 472698402 471622124 468038139 464434242 457543449 453560448 451462326 451293793 453614655 455041504
531.4 455041504 461028175 466650887 470736618 472920418 473665504 476682358 478145294 478746185 477699738
540.1 477699738 475293312 473668289 474737167 479691849 485032120 488598442 491519623 496567574
547.8 496567574 499675293 498332481 494772644 491093292 487962799 482161102 476275673 473104210
555.5 473104210 472237968 473375244 476585922 480350266 482652245 482514381 480205803 476894722 471650887
564.2 471650887 467100525 460921783 453002472 449061661 444384041 441987724 441277199 442788963 445683212
572.9 445683212 448233681 451987610 453271065 453986435 451572952 448426399 446739655 446611900 449314499
581.5 449314499 450113106 453584175 460398827 468435898 475391502 480883865 484860535 487214355 487713852
590.2 487713852 484750443 482231598 479432259 476862679 475452919 474491463 477251282 481447372 486971741
598.9 486971741 491431770 492997856 493179817 491692963 489463539 485224686 481133080 478175240 475636444
607.6 475636444 474955215 477302933 480978317 484697914 489573135 493699036 497932510 499091148 497169571
616.3 497169571 495680923 493458366 491750183 489186172 488158913 489766083 492805824 498263359
624 498263359 504892426 511711273 516528511 520123749 522021904 521641235 519419022 514806900 510070152
632.7 510070152 507645874 507313766 508382339 512239456 517098160 522468872 528590736 532432632 533039131
641.3 533039131 531791687 529698753 525993690 521898270 518978462 516113167 515558586 517170982 520949898
650 520949898 526132965 531484604 536422119 539425774 541290169 540639153 536198654 531122398 527098961
658.7 527098961 523697586 521476250 523437195 526548195 529354591 533656425 539403458 545416222
666.4 545416222 545872536 531461601 536526031 538987732 536922913 533421936 530106049 529740219 531422043
675.1 531422043 535469780 540984039 545858459 550733337 555815392 558151588 556416397 553837051
682.8 553837051 549529419 543787613 540396156 538880882 538522644 539474487 543317986 549264870 554323921
691.5 554323921 557988472 560203476 560466385 557682037 552357140 546444702 540519180 535474472 532040749
700.2 532040749 531071205 532295151 534781723 538009415 541434746 544975090 546827087 545185051 542289963
708.8 542289963 539073830 534602890 530772438 528373451 528486519 531694641 536258202 542703667 549572601
717.5 549572601 555473824 560429611 564376717 566426430 566226654 564783783 562426567 560119705 559593086
726.2 559593086 561349258 565369263 571485329 578862114 586207390 593060417 598730850 601116104
733.9 601116104 599557495 596345558 591908875 587160759 583386078 582226524 584109535 586965599
741.6 586965599 590968628 596406059 602199364 606285782 607300568 605316505 600256386 593169632
749.3 593169632 584941444 577920761 572641258 568688545 567899780 569158058 571019783 573121033 574183235
758 574183235 575871773 576700478 573801384 569505348 563275337 555426140 551028175 549681358 548909950
766.7 548909950 550940781 556086349 562868462 570499687 577822914 584054298 588481941 590230942
774.4 590230942 589971771 588850822 587318573 586396332 587598495 591521263 596567001 603062668 612273560
783.1 612273560 621945534 629489098 634210777 636455460 635361595 632306442 628483925 624779968
790.8 624779968 621178741 619498253 621901321 626536140 634523201 643866806 651212158 657498550
798.5 657498550 661424484 661562805 658413086 654702301 650017853 645415878 642108688 641384964 643933792
807.2 643933792 648069916 654973145 662996140 670443497 674795074 674799347 671770172 666595230 661544876
815.9 661544876 653939438 647057953 644009018 643701019 647401276 653055420 658982162 663752060 666821289
824.6 666821289 667735062 666008987 661387482 653736038 644849396 636014671 628805923 624397507 623539734
833.3 623539734 624752350 627172775 631624756 635517082 636433640 634994774 632176361 626540718 618777008
841.9 618777008 610889740 603194084 597029533 594434700 594886513 596902199 600474396 604648476 607530060
850.6 607530060 608349609 607091293 603998032 599055367 592037849 583563271 576421356 571031761 568491325
859.3 568491325 569563103 572705154 578441658 586336365 593615265 599321518 604149361 607947922
867 607947922 609550095 609628983 608985023 609675331 612652817 618297043 626130295 633875618 642632065
875.7 642632065 650473328 655228195 657079773 656831284 653924026 647256546 640629807 633963814 628071175
884.4 628071175 624062843 622335281 622854881 623105431 624430847 625849571 625321426 622840462 617832603
893 617832603 611096382 603252678 595273552 589375305 585308228 582134476 581035843 581740189 583486977
901.7 583486977 584661789 584467545 583552361 579954796 573773994 566573486 559255371 552560272 545897827
910.4 545897827 539503708 535074272 532577438 530584297 528945274 528046417 525960655 522087860 517750702
919.1 517750702 512379494 506918297 501863976 497849731 495386009 493461151 493404846 495141525 498499527
927.8 498499527 502288666 505451851 508026085 509309273 508937035 507649460 506204987 503811188 501999168
936.4 501999168 502045250 503228683 505514832 509499855 514740219 519709740 524967003 528768501 529704704
945.1 529704704 527948341 523925781 517550964 509394722 502899055 497037468 491642494 487329788
952.8 487329788 482873192 479896660 475617180 469477234 462751961 455774269 447684364 437562675
960.6 437562675 427778778 417827988 409013824 400294037 392587051 386330528 379454269 373600998
968.3 373600998 367166939 361061783 354030190 346381226 338128319 329131851 320973511 312732639
976 312732639 306566525 299643364 293779774 289565048 286595955 285013294 282666416 281965847 280395870
984.7 280395870 279092293 276972370 275321674 275238380 274228878 273749752 272636433 273309803 273474541
993.3 273474541 273986492 275566196 277486458 280316925 281753025 283856640 283935089 283461704 282515564
1002 282515564 282093945 282636089 281479664 282302074 282753277 283901787 284412632 285240822 286928978
1010.7 286928978 286613464 286918964 286363258 286570759 285047207 283566570 283262959 282996349 284283829
1019.4 284283829 284458447 286653118 288438702 291319160 294460163 296066494 297857285 297997570 299029064
1028.1 299029064 298914280 299980888 300299454 300125313 301629105 302313919 304809952 306621151 309581280
1036.7 309581280 311561012 312424164 312821293 311718979 311139812 309126434 309314842 308417492 307295780
1045.4 307295780 307328110 307828197 310017490 311385880 314558754 316227589 318620338 320286903 320599251
1054.1 320599251 321930466 322929687 325994186 327002525 329952354 332957726 334941788 339132957
1061.8 339132957 344295044 351574783 356559601 361111565 364427185 366315384 365957031 362661858
1069.5 362661858 359104729 353880157 349958916 344980316 341309586 339461823 338363304 338858948
1077.2 338858948 337851791 337954063 337009735 337395363 337496872 336827354 336072121 335106506 337868767
1085.9 337868767 339321747 341793137 344559364 348373337 352983246 356022568 359866142 361937599
1093.6 361937599 364408722 364734001 363998947 363958321 364588852 365689201 365312157 366971855 367976151
1102.3 367976151 371046295 374456940 375335808 375441628 374995613 375498276 373715172 373307076 373735199
1111 373735199 375167465 376996918 378114090 382082672 384749222 388184319 391273155 393966293 396180611
1119.7 396180611 396373215 396680260 394977913 393748779 392278328 391979637 393568535 395528107 398084679
1128.4 398084679 400920982 405915985 408919907 411168251 413363571 414110794 413729248 412285843 411884537
1137 411884537 410344315 407937927 405151062 404076767 403473167 401635818 400199890 398332176 397526245
1145.7 397526245 393631973 388958054 385005989 380405350 377553711 374378815 372542000 370709076
1153.4 370709076 370853195 371934395 372635727 373895340 374153595 375493660 375535965 375696907 375146866
1162.1 375146866 374337120 373978500 373733292 376036606 378370285 382664719 387114029 392475777 398619308
1170.8 398619308 404199600 410286255 414357643 418288002 421859512 425954742 429528809 433325424
1178.5 433325424 438445625 443386726 450911865 458875656 466898079 474415970 481044426 487313042
1186.2 487313042 491812820 494645844 495735893 496189270 496317368 497349854 499485855 501938858 505587502
1194.9 505587502 509752274 514399796 518545456 520972481 521372070 521329079 520535469 517824860 515846176
1203.6 515846176 514797554 514249992 514758644 517000313 520535469 524497681 529834633 535128746 539185333
1212.3 539185333 541493034 542219353 541849632 540699768 539519424 538437271 538700256 540646057 543675842
1220.9 543675842 547629280 552083397 556238213 558946152 559980202 559525070 557746353 554736366
1228.6 554736366 550194740 545819702 542817307 541180077 541062508 542612419 544988365 547237320
1236.4 547237320 549860306 552010956 552142868 550846100 549009018 546308632 542629509 539291039
1244.1 539291039 537178268 536728592 537738342 540241432 543956299 548065300 552172241 555377235
1251.8 555377235 556850243 556955833 555474129 553158531 550981560 548965378 547201309 546802864 548233643
1260.5 548233643 551052094 554901161 558861542 562239494 564870071 566149063 565945435 564167938
1268.2 564167938 562007179 559705429 557643738 556661758 557427788 559970589 563416481 567075119 570178947
1276.9 570178947 572822075 574564590 574449768 572751808 569979630 566660423 563110733 560447006
1284.6 560447006 558779297 558380699 559713020 562682457 565759659 568009186 570251427 570837212 569658318
1293.3 569658318 567493629 564076996 560090637 556004677 552830505 550870590 550375214 551053772 552930336
1301.9 552930336 555531960 557330818 558496246 558388062 556682892 553464241 549770012 546409187
1309.7 546409187 542814674 540188408 538998985 538932762 540073395 542045822 544220467 545823975 546853371
1318.3 546853371 546730461 545156631 542498207 538997879 535092506 531411362 528799171 526902313
1326 526902313 525815010 526069946 526498375 526581573 526350288 525838966 524305763 521336136 517770920
1334.7 517770920 514081841 510373154 507114716 505262794 504274025 504257545 506440735 508616982 511043663
1343.4 511043663 513250504 514897881 515219116 514155197 512436714 509771271 507376289 505500641
1351.1 505500641 504356384 503937645 504273682 506079865 508586197 510966034 512160568 512662125 512313919
1359.8 512313919 510908241 508581314 505292244 501057014 499050407 498666801 498621979 499846497 501508102
1368.5 501508102 503465652 506041565 507487335 508945465 509018402 507092056 505624161 504820709 503563538
1377.2 503563538 501598167 501623268 502364883 504598885 507536697 510226784 513083611 515807724 518600349
1385.8 518600349 519348831 519082146 518960114 518664131 517820854 516999550 517783279 518742218 520084305
1394.5 520084305 522220345 524977837 527039108 527985229 527484436 526259689 525433311 522737083 519959908
1403.2 519959908 517242279 513702736 512670631 513145599 514343834 515555801 517423782 518567085
1410.9 518567085 519448318 519203911 517320938 514836311 512235718 510133476 507479515 506293907 502381821
1419.6 502381821 503144264 506934662 509262810 511708412 512724495 514090843 514979630 514255905 514078598
1428.3 514078598 512397423 509304962 507395515 508103447 508579216 509723434 513090744 515801849 517947960
1437 517947960 519249191 522346420 523592758 523333435 522369576 520116425 519036751 517661972 517863121
1445.6 517863121 518349571 519283257 520266800 522103348 525166245 525964661 526954193 526466637 525582237
1454.3 525582237 523276672 518428574 511400490 506470718 509611816 510060158 512964478 514888344
1462 514888344 517728615 521789589 522003937 525089760 526869049 528511009 528559875 529510803 531672935
1470.7 531672935 531079979 533305321 535877724 543610191 548804398 555223732 561478539 566554909
1478.4 566554909 571562042 574212265 577063522 576998520 578202057 578938141 579773636 582545547 584172173
1487.1 584172173 588723717 593426285 601314659 604340096 607523079 611169701 612647820 614370117
1494.8 614370117 612780075 609159393 609859810 609657059 609954834 613536873 618278999 621875992 627139931
1503.5 627139931 630874329 633450127 628432312 625488052 630656815 630370789 631163864 631296463 630873146
1512.2 630873146 630239449 633367767 636970634 639805984 644274750 645073395 650254517 653178787 650331802
1520.8 650331802 647669983 644573364 646371155 645863724 643573303 643807526 646747208 649409561 653646011
1529.5 653646011 658940887 661817780 665013657 663887939 660500793 660918198 659403229 658289337
1537.2 658289337 656803284 652790985 645684738 653151627 657667007 660956573 665946350 667622681
1545 667622681 668661041 669885254 669761200 667637482 662398376 657550735 657592468 658471298 658834991
1553.6 658834991 657226486 659984207 665372543 668381653 658050919 651275024 657810974 663324890
1561.4 663324890 663206406 661433105 658542938 653227234 652479935 653764725 656011734 657943954 656361465
1570 656361465 658959579 661731415 661643219 660028610 658911514 654539948 644186859 645077972 644751358
1578.7 644751358 643816071 644371719 646209717 648686981 650461960 651827240 652831345 652179794 650242310
1587.4 650242310 647612839 644382706 640528336 637554245 635214729 634638634 635293732 636288071 637957573
1596.1 637957573 639423828 640425873 640537338 639376297 636818581 633517570 630156097 626403427
1603.8 626403427 623580933 621169434 619731483 619102097 620332451 621268616 621283264 622467003 622042236
1612.5 622042236 620366440 617733459 616037827 612154617 599968834 600415344 600194092 600108566 600024033
1621.1 600024033 601725464 602569427 601014671 602615547 603038521 602823143 599124832 595203934 593525734
1629.8 593525734 590971794 588995209 587204285 588372002 590283203 588844604 588911324 591700630 592938614
1638.5 592938614 593846054 594280548 592870407 591882858 589894600 589897652 590229797 587063599 586760597
1647.2 586760597 588255997 592631645 596320000 600612450 604042015 599347153 594175224 599850769
1654.9 599850769 603162193 603892441 603669624 603262367 604256516 606856194 610455589 614326553 616763039
1663.6 616763039 620530357 623680534 625961761 627693214 628418007 624806938 624672966 626274834 626615639
1672.3 626615639 629856949 633148041 634569054 637764435 643399658 648447418 652593307 656143112
1680 656143112 656684265 658334808 659728470 653710098 646439667 653818817 659524765 663456879 666912079
1688.6 666912079 670925217 675514755 679745255 683598480 685795670 687458115 686037369 678857880
1696.4 678857880 682000122 684569473 688336105 687004471 682923813 689699173 695125427 700244293
1704.1 700244293 703452759 705284882 704937057 705334473 705501175 703516464 701043472 700354233 701283188
1712.8 701283188 702256165 702994614 704834747 709422531 713967743 712266693 715109711 717255783 717669067
1721.4 717669067 716351929 713701477 711049881 710264664 710294724 710592804 712936859 716060638 718353348
1730.1 718353348 720909500 724509583 727099152 723506088 718602829 720669479 721743011 719692154
1737.8 719692154 719197769 716876602 715929947 721095581 725169754 727576065 729962463 733037949 734400864
1746.5 734400864 734017334 733177109 730873718 731707230 728258820 726285706 729483337 731716919 735062714
1755.2 735062714 739105148 741477432 743216476 745686417 747437057 748792877 745296173 742314682
1762.9 742314682 742612991 741617279 741142426 742034454 743722839 743802643 747214355 752814026 755415878
1771.6 755415878 754895706 753611298 755496597 755009537 751313553 750348206 748712311 748738861 748802338
1780.3 748802338 748831482 751755219 755614853 759067535 760804749 761592331 762177277 761744537 759871826
1788.9 759871826 758422089 755942535 753168640 749830856 750317917 754862289 757913818 760149231
1796.7 760149231 763426514 766441727 767422714 765956650 765817184 763345032 760729446 758987122 757722855
1805.3 757722855 758358765 759100876 760338745 762646637 766334686 768424301 769956055 771447296 770981293
1814 770981293 769905853 767347641 764703903 762002411 761192322 761491165 762341614 764632492 766851807
1822.7 766851807 770371170 773150787 773282089 773616028 774224854 773490677 769621582 763946915 763605728
1831.4 763605728 764286728 763858566 764895935 767483444 770461273 773344955 774771500 776183548 776227570
1840.1 776227570 775756531 774221878 772387695 769497833 763056717 764615555 766363907 767292404 769141464
1848.7 769141464 771935272 774933929 776927795 778563538 778239517 776818008 774683914 772316360
1856.4 772316360 770193405 767974014 767187119 767241211 768943710 770903473 773326569 775845413 777470169
1865.1 777470169 778856277 778376923 777859802 774645920 770641861 769935760 769332657 768947372 769074936
1873.8 769074936 770818253 773030777 775704880 778154831 779928970 780879898 780256500 778976517 776310196
1882.5 776310196 774292908 772176971 770280228 770084076 770745239 773696060 776216507 777215652 779386749
1891.2 779386749 781651917 782134781 781933823 780694885 777571869 775307617 773042145 771983643 771890793
1899.8 771890793 772606659 774457703 776402359 779210815 781325607 782628250 782851562 781888885 780243607
1908.5 780243607 778053665 775580902 773302689 772652054 772319946 773487091 775432510 777743683 780895844
1917.2 780895844 781292496 782058182 782976913 782169724 780895538 778045044 775743713 774376602 773538818
1925.9 773538818 773457947 774505234 776304626 778570328 781186600 783069229 784259338 783585052 782457962
1934.6 782457962 780997925 778589096 776094208 774378052 774073944 773973541 775749893 777804184 778525085
1943.2 778525085 781013031 783701553 784647217 784133911 783005981 781036224 778776398 776612625 775026398
1951.9 775026398 774441757 774902039 776658096 778422470 780619202 782841568 784574051 785457535 784814758
1960.6 784814758 783400726 781406326 779641342 777872086 776450119 775574188 775274200 776881104 779384460
1969.3 779384460 781984634 783688049 785087814 785588455 784993515 783763809 781700821 779945221 777825851
1978 777825851 776383972 776248932 776847763 778280334 780083771 782387924 784221268 785541840 786117935
1986.6 786117935 785637665 783759918 781693192 780537720 778515091 776274490 775886383 777191696 778959198
1995.3 778959198 780877762 782938919 784622955 786106720 785874710 784882050 783406525 781194000 779083862
2004 779083862 777389908 776562119 776343613 777259216 778634644 780563431 782625961 783934708 784762115
2012.7 784762115 784449997 783409729 781512375 779375000 777111816 775686798 775295334 775065689 776075974
2021.3 776075974 777396851 779044189 780754547 782135239 782963409 782166748 780858154 779053879 777330170
2030 777330170 775357513 773721085 773140640 773101959 774010696 775188522 777001724 778691864 780005646
2038.7 780005646 780411911 779473877 778389969 776845245 775031891 772693710 771399460 771185074 771465378
2047.4 771465378 772606354 773924866 775933990 777584152 778840942 779239578 778538818 777403793 775369949
2056.1 775369949 773521957 771918716 771055832 770637283 771121521 772731934 774586258 776785965 777892990
2064.7 777892990 778508911 778605881 777845917 776666718 774962463 773419266 771813965 770626602 770383453
2073.4 770383453 771596146 773436508 775162277 776786804 777938766 779164352 779336548 778531876 776905060
2082.1 776905060 774921188 773481064 772095947 771412888 771507568 772322769 773704300 775586166 777515564
2090.8 777515564 779155045 780014267 779482346 778599930 777078476 775578461 773867187 772232895 771884079
2099.5 771884079 772289429 773561554 774793396 776503143 778532104 779780502 780252533 780099869 779460983
2108.1 779460983 777365952 775390930 774022827 772905045 772499695 772818069 773992004 775350189 777295837
2116.8 777295837 779078140 780168610 780704498 780413437 779255905 777388535 775539169 773542786 772863770
2125.5 772863770 773040543 773244400 774278946 775774384 777650986 779075470 780274200 780776825 780242157
2134.2 780242157 779118652 777661438 776364746 774464417 773138428 772991867 773745422 774983978 776498489
2142.9 776498489 778471985 779817810 780933609 781343002 780456696 778862000 777260437 775783539 774335632
2151.5 774335632 773561935 773416748 774209976 775490417 777212753 778792191 779844284 780940247 781281815
2160.2 781281815 781011353 779599304 777960434 776581039 775355453 774929276 774795456 775637894 776747208
2168.9 776747208 778385849 780401917 781740417 782665787 782870865 782627792 781399155 779843750 778165817
2177.6 778165817 777131119 777235718 777482681 778576050 779811783 781394043 783197708 784555130 785444260
2186.3 785444260 785656433 785237350 783684769 782108917 780380325 779243240 779396591 780104294 781268997
2194.9 781268997 782471161 784347153 785897369 786921387 787384109 786746979 785750504 784650040 783880920
2203.6 783880920 782660065 781802444 781617813 781759033 782852859 784316330 786044006 787745667 789027328
2212.3 789027328 789480896 789270630 788079758 786672592 785695267 784224548 783460922 783482895 784231110
2221 784231110 785230408 786706390 788860703 790138016 791081390 791077728 790400009 789433899 788013000 786863937
2230.6 786863937 785722885 784745102 784338760 785424881 786933289 788466873 790248489 791453629 792216644
2239.3 792216644 792120361 791322021 789686203 788176193 787008209 785867157 785478897 785914383 787114182
2248 787114182 788116302 789333725 790578461 791940536 793025742 792796097 792043457 790466690 789173279
2256.7 789173279 787903290 786753922 786243362 786178436 787253952 788516083 790079041 791359253 792576828
2265.3 792576828 793093414 792333755 791766129 790662766 789486389 788075867 787330399 787508011 787836151
2274 787836151 788630676 789824219 791499939 792396317 793289490 793759232 793503265 792748184 791294556
2282.7 791294556 790356598 788667984 787655029 787286072 787720032 789291992 790462875 792142639 793055878
2291.4 793055878 793383102 793100586 792555618 791897659 790244675 789407272 788361893 787351379 786516876
2300 786516876 786741257 788028336 788991241 790137329 790874252 791675949 790969009 789693298 788947525
2308.7 788947525 787567749 786089249 784190674 783593063 783393555 783919220 784441452 785037842 786533661
2317.4 786533661 786787643 787280121 786729355 785624847 783792648 781419678 779733963 777524948 777591324
2326.1 777591324 777553711 777843628 778461227 778748169 779988022 781520081 783097229 782300949 781525192
2334.8 781525192 779102478 776605682 776035538 774394302 774308548 774578247 775579605 775910797 776955338
2343.4 776955338 778389969 778722000 780782318 782454529 784061661 783776169 781211472 778650742 776532898
2352.1 776532898 775079498 773384476 771842880 770659714 771773224 774371872 774029465 772165070
2359.8 772165070 770997925 770415573 769754868 770061264 769562149 769644852 770908508 771313095 772314224
2368.5 772314224 774311676 777013779 778743286 779838638 781197739 781726761 780985489 780631332 780469360
2377.2 780469360 779501266 779572601 780820923 782151718 783334732 785139999 786839371 787767563 788468246
2385.9 788468246 788310394 787985458 786792221 785176849 784437408 783525772 782855606 782713318 783170547
2394.6 783170547 783982468 785384064 786652222 786850128 786976700 786696472 786170807 785277557 784003906
2403.2 784003906 782671509 781615524 781253967 781191177 781873856 782545319 783300247 784492111 785258865
2411.9 785258865 785220490 784458542 783685989 782512360 781082306 779756470 779056473 779062958 779194870 779658127
2421.6 779658127 780318375 781259232 781784821 782073975 782252731 781674652 780238190 778367081 777133026
2430.2 777133026 776054687 775275650 774771729 774912567 775847168 776663589 777854996 778571854 778654099
2438.9 778654099 778165283 777473373 776749496 775102158 773238907 771691818 771070862 771048965 771421356
2447.6 771421356 771904526 772622986 773856812 774581833 775028152 774455566 773654327 772733841 771110077
2456.3 771110077 769817734 768383942 767665100 767787933 768487167 769349136 770188065 770958176 771003113
2465 771003113 771206970 770874634 770245056 769171371 767467346 766245728 765194855 764661102 764509048
2473.6 764509048 765190277 766292648 767064896 767652130 767974854 768225708 767646637 766465607 765142059
2482.3 765142059 764229431 763192902 762025604 761814423 761960373 762472687 762940826 763741684 764452362
2491 764452362 764699631 765064011 764640198 763927307 763012543 762035751 760847015 759619675 759171982 759443283
2500.6 759443283 760370636 760895920 761799850 763001099 763346710 763257751 762871552 762114868 760768433
2509.3 760768433 759361420 758113708 757580566 757595825 757593689 757957077 758952713 760368729 761103821 761557159
2519 761557159 761225891 760265884 759446030 757980118 756549072 755492783 755131912 754995651 755183563
2527.6 755183563 755741959 756118469 757129440 758170395 758873901 758343048 757043991 756112823 754922943
2536.3 754922943 753785858 752584915 751640549 751311417 751676483 752422562 753234482 753563690 753103790
2545 753103790 753150253 753414612 753242340 752017212 750831451 750175171 748736496 747741318 747393417 747874374
2554.6 747874374 748899841 749546051 749931564 750190506 750538635 750088654 749396820 748604736 747220383
2563.3 747220383 745675659 744419785 743931122 743724060 744052963 744962006 745857162 746202545 746380844
2572 746380844 746419525 745774460 745126495 743981171 742818756 741939468 741032028 740629959 740507736 741008453
2581.6 741008453 741781311 742517929 743064575 742975540 742465134 741884155 741175613 740193863 739315720 738355179
2591.3 738355179 737870712 737729874 737534561 737886810 738417816 739117661 739737473 739918823 739777908 739533157
2600.9 739533157 738772964 737397537 736205978 735318909 734839935 734547043 734744186 735280533 735930710
2609.6 735930710 736485901 736341095 736529846 736647110 735914154 734682388 733642273 732742004 731651001
2618.3 731651001 730877762 730283356 730564194 731062775 731581879 732269669 732034454 731563416 730741501 729798737
2627.9 729798737 728566360 726884766 725639801 724908218 724379578 723796616 723994827 724269562 724564056
2636.6 724564056 724986038 724870987 724752502 723858871 722824326 722127914 721138535 719966583 718751221
2645.3 718751221 717826843 717526703 717974701 718219299 718301544 718417587 718340836 717848206 716986618 716166306
2654.9 716166306 714837875 713733215 712673569 711463013 710991440 711245193 711573029 711182556 711210175
2663.6 711210175 711476517 711610336 711667252 710806427 709588699 708344574 707443161 706634521 705774384
2672.3 705774384 705324326 705304718 705539017 705939178 706384583 706261597 706163712 705641403 704804687 704122086
2681.9 704122086 702615509 701338348 700883102 700914459 700642395 700301971 700706100 700962448 701063080
2690.6 701063080 701109924 700902100 700220413 699433746 698785248 697887344 696716156 695626602 695361710
2699.3 695361710 695134811 694815903 694909744 695195770 695499191 695351410 695046692 694465408 693564377 692439957
2708.9 692439957 691139755 690056000 689184341 688529663 688287506 688668976 688898163 688865128 688965836
2717.6 688965836 688992233 688678284 687760391 686795349 686165619 685775833 685040207 683923035 682930069 682725983
2727.3 682725983 683223419 683321991 683468552 683701324 683810806 683477173 682697983 681822433 680546875 679927216
2736.9 679927216 679491882 678829269 678217163 677987595 678610077 678975067 679437180 679759369 679797821 679853973
2746.5 679853973 679338531 678406219 677293549 676400223 675189896 674208755 673906631 674331055 675353851
2755.2 675353851 675614166 675811691 676015244 676014481 675756989 674840469 673908997 673020401 672217789 671336212
2764.9 671336212 670810471 670683899 670535812 670999832 672151108 672978516 672854843 672519531 672034225
2773.5 672034225 671466370 670830383 669900360 668869553 667571335 666616821 666415710 666717911 667087326
2782.2 667087326 667541962 667853546 667824326 667577438 666724548 665930557 664884415 663563919 662507095
2790.9 662507095 661635895 661138687 660612030 660618820 660681839 660488892 660561218 660269470 659610291 658671112
2800.5 658671112 657594757 656296997 655116348 654065399 652892990 651874542 650981903 650968475 651265717
2809.2 651265717 650717926 649975510 649652405 649061050 648206711 647553253 646140060 644011383 642277756
2817.9 642277756 641338425 640540848 639874191 639455490 638875465 638645248 638346939 637369118 635970078
2826.6 635970078 634911880 633614311 631730995 630302544 628901062 627853012 626920891 626045456 625467987
2835.3 625467987 624528198 623814087 622924767 621596680 619926682 618114052 616326141 614687347 612868690
2843.9 612868690 610435486 608725281 606928978 605229187 604051476 602750397 601831093 600205650
2851.7 600205650 598937035 597935143 596315079 594748459 593017769 591744232 590540695 589409752
2859.4 589409752 588117828 586741486 586038895 585357742 584572601 583505249 581774139 579487190 577652588
2868.1 577652588 575570107 572688026 570510330 568463554 566089554 563982697 562158279 560231361
2875.8 560231361 558438988 556887245 555084038 553370323 551834412 550253220 548039017 545952721
2883.5 545952721 544592857 543036194 541772919 541177177 541056824 540701828 540156937 539985771 539764214
2892.2 539764214 539663925 539513664 538996086 538277321 537814522 537387161 536722298 536236725 536015663 536243591
2901.8 536243591 536324425 535804482 535228767 535042953 534616470 533970108 533252487 531723175 530360947
2910.5 530360947 528904724 527457504 526544495 525406151 524558067 523172569 521300926 519731216 518288345
2919.2 518288345 516901321 515376930 514041367 512346497 510729446 509736748 509144058 508671799 507832832
2927.8 507832832 507425117 507853622 508735542 509238930 509684715 510673256 511610451 512600670 513906288
2936.5 513906288 515392113 516577148 517894859 519834099 522287292 525132828 527829437 530229301
2944.2 530229301 532697029 535374680 537480316 539272156 541129532 543010483 545029297 546674538
2952 546674538 548527641 550888596 553656425 556294136 558915596 561801567 564061890 566564980 568951263
2960.6 568951263 570669785 572616577 574463234 575993462 577532806 579321022 581613045 584203835
2968.3 584203835 586188736 588129578 590240707 592056808 593846169 595100937 596373596 597814980
2976.1 597814980 599149094 600628166 601658478 602614212 604157753 605828133 607493019 609343834
2983.8 609343834 610973816 612370071 613178749 613824158 615069962 615853767 616399727 616916580 616986465
2992.5 616986465 617225113 617801666 618673592 619791107 620538025 620685425 621041985 621631775 621905670
3001.1 621905670 621648026 621306343 621231537 620922012 620537033 620249786 620075035 620043411 620282860 620510750
3010.8 620510750 620539970 620411606 619679451 619164238 618630981 617782059 616986923 615996246 614835052 613739281
3020.4 613739281 613801003 613965607 613345222 612660637 612069588 611599197 610578537 609370918 607738113
3029.1 607738113 605921364 604750137 603908691 603212395 602289658 601327095 600375595 600028152 599878502
3037.8 599878502 599352303 598672218 597255249 595918312 594413948 592679329 591540031 590476227 589006233
3046.5 589006233 587864380 587575607 586797333 585970116 585246506 584339714 583681107 582365799 580810356
3055.1 580810356 579288597 577695122 576058846 574775238 573987465 572927246 571912270 571187439 570708733
3063.8 570708733 569772835 568878670 568215561 566615944 564851303 563312225 562306137 561257935 559592323
3072.5 559592323 558428116 557590065 556627426 555807877 555173721 554361458 552885933 551009102 549808388
3081.2 549808388 548771706 547259407 545920181 544953079 544299240 543290100 542309380 541324158 540238037
3089.9 540238037 539398117 538005257 536890602 535789833 534466019 533328819 531651382 530140610
3097.6 530140610 529011803 527934303 526579094 525518608 525139885 524589920 523812065 522893677 521841164
3106.2 521841164 520530014 519212570 518132553 517262268 515749283 513723526 512562141 511761703 511334267
3114.9 511334267 510659447 509327278 508574829 507960548 506857376 505568886 504373817 502811775 501378403
3123.6 501378403 500318756 499250031 498344917 497399979 496939583 496320305 495092087 494301758 493965187
3132.3 493965187 492892838 491402817 490428963 488878899 487635651 486871300 485685768 484641457 483437500
3141 483437500 482642250 482133827 481349678 480564384 479995499 479492378 478560944 477271690 475967712 474959641
3150.6 474959641 473534851 472338104 471861305 471481819 471132431 469956551 468916664 468162498 466972809
3159.3 466972809 466157188 465547066 464666405 463553543 462505836 461692505 461380272 460473213 458922539
3168 458922539 458145638 457729378 457594604 457220917 456182594 455138664 454328575 453390541 452300568
3176.6 452300568 451292305 450259743 449768410 449085464 448020096 447195511 446758499 446898155 446537476
3185.3 446537476 445708694 444748688 443806610 443153534 442409172 441416054 440503082 439992981 439060936 438145523
3195 438145523 437664795 437407608 436898270 435963821 435634308 434898529 434295998 434096184 433188095 432129784
3204.6 432129784 431367645 431322594 430891495 430233192 429697914 428764153 428257179 427922859 427528992 426758804
3214.3 426758804 425917740 425452118 425044708 424502678 423624306 422768593 421995201 421492615 421461945 421317482
3223.9 421317482 420252037 419504128 419412727 418639755 418142395 417690010 417273140 417072639 416270332 415149040
3233.5 415149040 414244766 414420280 414406471 413721085 413488312 413309898 412838669 412112007 411624451 411490822
3243.2 411490822 411252022 410344276 409645233 409225845 408515511 408408813 408258476 407751389 407148247 407008820
3252.8 407008820 407030869 406035156 405124207 404632263 404279671 403782616 403326797 403162384 402855797 402677040
3262.5 402677040 402522392 402801971 402886620 402259026 401871681 401367531 400610352 399813614 398970528 398594551
3272.1 398594551 398721504 398513184 397959251 397368050 397054939 397429924 397650642 397347260 396618767 396267433
3281.8 396267433 396362381 395701485 395220642 395309105 394983521 394572525 394307213 394029045 394087067 393852921
3291.4 393852921 392902336 392345238 392375755 392219963 391561813 390923347 390575638 390530167 390500488 390157967
3301 390157967 390032806 389947510 389695053 389246368 389029236 389158707 388806229 388202858 387412529 386606827
3310.7 386606827 386172485 386071854 385924911 385772934 385692444 385077400 384528389 384314957 384487648 384458694
3320.3 384458694 383983994 383682327 383018417 382453918 381513557 380675774 380604134 380565567 380451431 379470558
3330 379470558 379334106 379668465 379108696 378882599 378602180 378268166 377367630 376363640 375944481 375615425
3339.6 375615425 375838966 375807381 375242844 374790764 374398460 373730621 373213615 372812004 372276306 372454720
3349.3 372454720 372326927 371637497 371351433 370892067 370359688 370179863 370031548 369465485 368774185 368624458
3358.9 368624458 368882790 369075317 368446236 367109680 366552734 366306343 365728836 365322189 364710884
3367.6 364710884 364375000 364211273 363717194 363312531 363231506 363152008 362631378 362441826 362417564 362386932
3377.2 362386932 362141800 361263618 360798912 360251389 359573174 359364166 359395447 359275169 358740692 358739586
3386.9 358739586 358806267 358214149 357601891 357477036 357549934 357518158 357390900 357129021 357265472 356786423
3396.5 356786423 355634232 355612450 356130333 356332512 356236115 355954933 355378876 354789238 354595909 354659462
3406.2 354659462 354813004 354498711 354120865 354501801 354987183 354666977 354153061 354290428 354557419 354515305
3415.8 354515305 354247208 354101448 354220848 354078979 353787651 353645096 353417969 353508568 353812141 354082031
3425.5 354082031 354468765 354480247 354204865 354206009 354346695 353965683 353809319 354052010 353750877 353812332
3435.1 353812332 354023705 354159012 354365425 354589310 355199738 355313492 355153046 354940338 355231705 355687828
3444.7 355687828 355980225 356413841 355654755 356212273 357081718 356539421 356803894 357487373 357856941 357656097
3454.4 357656097 358052559 359026642 359558868 360160866 359917870 359505234 359579811 359986725 360585175 360892525
3464 360892525 361157951 361602287 362102394 362140846 362893791 363764839 363690872 363666725 363513908 363727074
3473.7 363727074 364242554 364444771 364731026 365559196 366413460 366412048 366675491 367335358 367096939 367103729
3483.3 367103729 368247719 368782387 368698997 369452324 370190048 370383492 370895348 371573830 372009583 372719345
3493 372719345 373222733 373460388 373796883 373728218 374085770 374582062 375097961 375903320 376607513 376971626
3502.6 376971626 376658974 377005806 377831078 378804092 379938431 380837631 381093292 380811043 381632919
3511.3 381632919 382171783 382086220 382651939 383547058 384050407 384049644 384889030 385795975 385946236 386569519
3520.9 386569519 388108063 389170952 388330536 388155556 389426918 390406342 390722389 391297150 391874161
3529.6 391874161 392805367 393686447 394019814 394815750 395236588 395908356 395887680 395579910 397495384 398930969
3539.2 398930969 399118080 398986931 399635582 401248665 403035278 403623428 403705406 404971161 404533310
3547.9 404533310 405433311 407101631 408701363 410317879 409073410 410067787 411148834 412103691 413606071
3556.6 413606071 413746185 415058861 415755234 416567078 417802734 420049858 421116180 421131859 425269890
3565.3 425269890 425652771 424024200 422233620 421006889 425582352 428427734 429696083 430945435
3573 430945435 432720299 434166946 435079536 436360931 436946945 439819603 441219444 441248856 442772942
3581.7 442772942 444481201 446289597 447854309 452129593 453359947 451377335 452082481 451102676 454802971
3590.4 454802971 458487701 461481285 462338715 462801933 465917931 464453354 466887779 470034409 470379143
3599 470379143 473635330 474330597 474623070 477270050 479502258 481394882 484687843 487019539 486505775
3607.7 486505775 490272675 488042679 488688698 497781563 498528404 496444168 500170593 499302483 503878326
3616.4 503878326 508367691 507606049 508326187 506544800 508133354 512292519 515023766 517144012 520102425
3625.1 520102425 522884102 526154060 533692131 531784668 519962692 524300842 529168015 535021095
3632.8 535021095 535909805 534296417 537214470 540519257 542677689 542690010 544180374 547045059 550230484
3641.5 550230484 551454506 552091866 555015335 558507805 563618774 560583801 558161736 564576302
3649.2 564576302 562324104 559184189 560024490 566906242 571671371 575680389 580515938 571571579
3656.9 571571579 573107414 578455658 580163269 581646347 582149239 584523849 585957108 587663918
3664.6 587663918 589467926 590924797 596042023 598430595 597202492 595854721 589232674 593717041
3672.3 593717041 603492393 612542229 607853813 588384819 594508057 604034767 608895950 606264534
3680 606264534 607109718 610419846 612583504 613975029 613914070 614901810 620189552 626554413 614192467
3688.7 614192467 611634140 620847397 614788704 616573677 622486992 623304634 624527321 624531860 625664406
3697.4 625664406 627697678 628644409 631820679 633290329 625726929 624964142 630594826 632471924 634087448
3706.1 634087448 635656662 638987885 642206650 634131851 639227715 641625977 627088623 633245659
3713.8 633245659 638362083 638932915 640162430 643510742 644979858 640775375 642742004 649824219
3721.5 649824219 645559387 641147079 647119598 647907791 646910706 643610916 644286575 648854675 650931625
3730.2 650931625 656989899 651856003 644934921 654761276 653184433 642807236 645230103 649262161
3737.9 649262161 650618439 654703140 658085480 653600845 658277664 670959167 656464539 642206268
3745.6 642206268 653880234 659966431 666777344 662912598 653366547 664933090 655947723 649388046
3753.3 649388046 656835175 662833633 666222992 660636215 664020996 668828583 659338226 659333878 664498978
3762 664498978 665798492 666427078 669263840 665131683 661661758 666537628 672174454 671144485 660586014
3770.7 660586014 663324661 667489166 668307419 669707718 670019684 670713959 671154709 674536819 674006958
3779.4 674006958 665608521 668412323 671022339 672756958 675353241 671635742 670567932 672830658
3787.1 672830658 674297867 675125809 675140152 675701904 675507278 675501022 675679703 678278427 682500839 677487030
3796.7 677487030 673108215 676561737 681918335 687603302 677606583 666671906 671526489 676253510
3804.4 676253510 682616043 686843719 673935471 671726074 678365326 680625000 681340103 682499237
3812.2 682499237 682806931 684581070 690920334 688994522 674814606 680776215 686958008 692383728
3819.9 692383728 692188416 668531494 673813629 681909637 684530869 687283859 686998672 682646484
3827.6 682646484 683484039 686303787 690449295 691422958 681134262 685085907 693242493 685380707
3835.3 685380707 684975204 693234253 683232269 681441803 690097351 684083023 684588928 691174011
3843 691174011 688303680 685207977 687888184 689169464 690134430 692837372 692498627 695403824 701480484
3851.7 701480484 694512253 691584702 673226242 679377213 691161346 689644928 687898941 690388641
3859.4 690388641 694048157 697044144 690328979 691379471 698290024 689817505 685415421 691181183
3867.1 691181183 697351532 703915863 695617905 685607986 689599457 696800461 698801804 686425629
3874.8 686425629 689272690 694353027 694707794 697956085 702518387 695113220 688666687 696058426
3882.6 696058426 697457962 698729019 702058945 688455811 691055374 695501099 696767807 701517181
3890.3 701517181 699243469 690328751 693803024 697353439 695600815 697451935 699296646 702300949
3898 702300949 702455444 692343979 699117279 699728394 692697830 697122955 694497681 694403992 695962982
3906.7 695962982 697904892 700166779 699735947 700138168 699423752 698975983 699156189 699092865 700716934
3915.3 700716934 701930542 697078018 694729996 700668640 700660400 696731186 699670639 701706924 702382965
3924 702382965 699044495 695967865 698988037 701277008 701876144 700286484 700388870 702681427 699314423
3932.7 699314423 697615204 699595947 700195923 701136551 701675873 700542755 700262375 701483231 704026566
3941.4 704026566 704333267 698812790 698139954 699976120 701706009 703915863 701832657 702699585 702474976
3950.1 702474976 698971939 701054535 701666031 700837479 701396942 702013245 701982422 700909348 701414337
3958.7 701414337 701765900 703361588 704445190 702737274 702909317 703230057 702915192 702550354 702635651
3967.4 702635651 703348770 702185593 701482849 702913132 703450470 703333359 703581085 703402786 703587341
3976.1 703587341 703875046 704758301 705499191 704380112 703675079 703743744 703414230 703210220 703168793 703173752
3985.7 703173752 703996811 704364243 703676147 704247360 704912872 704919281 704979935 705064468 705378418 704603043
3995.4 704603043 703560638 703655777 704569092 705046921 704879990
4000.2 704879990
##END=$$ End of the data block
