##TITLE=Rustic $$ Begin of the data block
##JCAMP-DX=5.00 $$ ACD/SpecManager v 10.08
##SPECTROMETER/DATA SYSTEM=Alpha
##DATE=20 Feb 2015 13:16:36
##DATA TYPE=INFRARED SPECTRUM
##DATA CLASS=XYDATA
##ORIGIN=
##OWNER=
##NPOINTS=1667
##FIRSTX=599.57470703
##LASTX=3997.16503906
##MAXX=3997.16503906
##MINX=599.57470703
##MAXY=0.04012042
##MINY=0.01816903
##XFACTOR=1.0000000000
##YFACTOR=1.000000000000000e-10
##FIRSTY=0.03963653
##DELTAX=2.03937006
##XUNITS=1/CM
##YUNITS=ABSORBANCE
##XYDATA=(X++(Y..Y))
599.6C96365263l75435k046637l451482k385974k304055l800317k841242j209937j557432
$$ 396365263 395989828 393943191 390491709 388105735 385801680 382001363 379160121 377950184 376392752
617.9C76392752j064688j040697k277568m33140J940169N54100j662337j906156o65821
$$ 376392752 375328064 374287367 372009799 371576659 373516828 374070928 372408591 370502435 369836614
636.3C69836614N00902k48365j659133k164058j849718p96616r99943j953579j705326
$$ 369836614 370337516 370089151 368430018 366265960 364416242 363619626 362619683 360666104 358960778
654.6C58960778n60061R36836L57964k170690k135634O1243n6177k129525k269931
$$ 358960778 358400717 359337553 359695517 357524827 355389193 355450436 355394259 353264734 350994803
673C50994803j021437K08206P6331p11828j285039j397356j263805m67785R46000J263656
$$ 350994803 349973366 350181572 350257903 349546075 348261036 346863680 345599875 345132090 346078090 347341746
693.4C47341746k31638j817719k201609j274720j29379o36205r78522m29712j190864
$$ 347341746 347110108 345292389 343090780 341816060 341686681 341050476 340071954 339642242 338451378
711.7C38451378j711994l71188Q92058L15867q38153j70916J376420J346394N91427
$$ 338451378 336739384 336368196 337260254 337576121 336737968 336567052 337943472 339289866 339881293
730.1C39881293J016558J869388J404471J10939K83607P12983n11221j535751j487062
$$ 339881293 340897851 342767239 344171710 344282649 344566256 345279239 344768018 343232267 341745205
748.4C41745205j460761j590177j253560r25660j200103j047700N3420O01970R6746
$$ 341745205 340284444 338694267 337440707 336515047 335314944 334267244 334320664 334922634 335019380
766.8C35019380L05064J509488J725740R38699J587085L157147L256462K314672K105646
$$ 335019380 335324444 336833932 338559672 339498371 341085456 344242603 347499065 349813737 351919383
785.2C51919383L084130M212857M736818M526153M607886N644411O388575O889775
$$ 351919383 355003513 359216370 363953188 368479341 373087227 378731638 385120213 392009988
801.5C92009988O492436K701730m039072j0823868j6252324k0524859k3655705k5175997
$$ 392009988 398502424 401204154 397165082 386341214 370088890 349564031 325908326 300732329
817.8C00732329k3129768j6605575q055419n2414N026273O660763P480625Q190666
$$ 300732329 277602561 260996986 252941567 252889153 257915426 264576189 272056814 280247480
834.1B80247480P958542P251036O302111N379896N461108O030090N705990M466623
$$ 280247480 288206022 295457058 301759169 307139065 312600173 318630263 324336253 328802876
850.4C28802876L188737L118366M322901M893206L595874J436994P31423J760237J711771
$$ 328802876 331991613 335109979 339432880 344326086 347921960 349358954 350090377 351850614 353562385
868.8C53562385K26088J937J162812J299940O6869m26248O4895K78167k16886j293980
$$ 353562385 353788473 353790410 354953222 356253162 356320031 355893783 355958678 356236845 356019959 354725979
889.2C54725979j562051m11906L06890O7390k50153p98181q24108Q0280J056865J662857
$$ 354725979 353163928 352752022 353058912 353126302 352876149 352077968 351253860 351334140 352391005 354053862
909.6C54053862J492650J306310J618192J686290J686923K127550K355576J889095
$$ 354053862 355546512 356852822 358471014 360157304 361844227 363971777 366327353 368216448
925.9C68216448J917555K864637K899021J505539P57388J004078P31088J72630J54823
$$ 368216448 370134003 372998640 375897661 377403200 378160588 379164666 379895754 380068384 380223207
944.2C80223207J61901k96943n10215j52551K64682M69871J46068m16189l76031k34470
$$ 380223207 380385108 380088165 379577950 379425399 379690081 380159952 380306020 379889831 379513800 379279330
964.6C79279330n12115m64581m11757q74213j006388p89463r63919j402386j597628
$$ 379279330 378767215 378302634 377890877 377016664 376010276 375220813 374256894 372854508 371256880
983C71256880j171082o03497r69730j920201k192706j658127j487247j903251j790524
$$ 371256880 370085798 369482301 368512571 366592370 364399664 362741537 361254290 359351039 357560515
1001.3C57560515j339688j551323k457351l013685k495460j941696k199672k785586
$$ 357560515 356220827 354669504 352212153 349198468 346703008 344761312 342561640 339776054
1017.6C39776054k497062j202524j013204k451577l362596k746954j503341r04650
$$ 339776054 337278992 336076468 335063264 332611687 329249091 326502137 324998796 324094146
1034C24094146j380667j727007p75047P02031J062863J77845m29041J30459R73046
$$ 324094146 322713479 320986472 320211425 320913456 321976319 322154164 321725123 321855582 322828628
1052.3C22828628R18843n9120r56767j022890p00764l00743J09822n2676n95823p85477
$$ 322828628 323747471 323688351 322731584 321708694 321007930 320707187 320817009 320764333 320168510 319383033
1072.7C19383033m95911K6487O40489Q27610M03263M56795J032017J244173J189038
$$ 319383033 318887122 318913609 319554098 320381708 320784971 321241766 322273783 323517956 324706994
1091.1C24706994J142472R70848O27153N96530J038946J030490K49148k21767k533
$$ 324706994 325849466 326820314 327447467 328043997 329082943 330113433 330362581 330140814 330138281
1109.4C30138281K30148K13162J65365K8461k66470r3020J03898m35151m94346K00532
$$ 330138281 330368429 330581591 330746956 330775417 330508947 330415927 330519825 330084674 329590328 329790860
1129.8C29790860M62495M11459N32716O87055O05807K27504n5917M1090J70767J8440
$$ 329790860 330253355 330664814 331197530 331884585 332490392 332717896 332661979 332703069 332873836 332892276
1150.2C32892276o8769l72789j221039j521483j297071j532771j737028j659356k006330
$$ 332892276 332823507 332450718 331229679 329708196 328411125 326878354 325141326 323481970 321475640
1168.6C21475640k359226k029948j593940j522377j651478j533515q95262m92595o73756
$$ 321475640 319116414 317086466 315492526 313970149 312318671 310785156 309889894 309397299 308723543
1186.9C08723543n77793k62595l54276m66499l74485o18342j091454j224447j208280
$$ 308723543 308145750 307883155 307528879 307062380 306687895 306069553 304978099 303753652 302545372
1205.3C02545372j140814j056176j080874r58051o38776K17911J258850J500268J301001
$$ 302545372 301404558 300348382 299267508 298309457 297670681 297888592 299147442 300647710 301948711
1223.6C01948711J692493K602227L084931L265962L687442L913492L742985L646836
$$ 301948711 303641204 306243431 309328362 312594324 316281766 320195258 323938243 327585079
1239.9C27585079L617778L118068K386570K121963J921393J443028J155213Q19266
$$ 327585079 331202857 334320925 336707495 338829458 340750851 342193879 343349092 344168358
1256.3C44168358P40066J238920J199729P84397R58145J410171J388155Q85986O59004
$$ 344168358 344908424 346147344 347347073 348131470 349089615 350499786 351887941 352773927 353432931
1274.6C53432931P57128O53900K51383j40444k15172j15708P9759L18251L37958L93317
$$ 353432931 354190059 354843959 355095342 354954898 354739726 354624018 354703777 355022028 355359986 355753303
1295C55753303O63101O17691L01860J43610J7136J47857N64456L96371j36607o780
$$ 355753303 356416404 357034095 357335955 357479565 357496701 357644558 358209014 358605385 358468778 358461998
1315.4C58461998K57530Q0429r5591n53541j329742j788922j860075j618191j157932
$$ 358461998 358719528 358799957 358704366 358150825 356821083 355032161 353172086 351553895 350395963
1333.8C50395963r52594j320057k128743k911910k863444k292507k154820k291277
$$ 350395963 349443369 348123312 345994569 343082659 340219215 337926708 335771888 333480611
1350.1C33480611k126619j916140k090298j903213j219362j407229k423525k717077
$$ 333480611 331353992 329437852 327347554 325444341 324224979 322817750 320394225 317677148
1366.4C17677148k305135j645051q42475m62346n69354o84709q04439o36652L09981
$$ 317677148 315372013 313726962 312884487 312422141 311852787 311168078 310363639 309726987 310036968
1384.7C10036968R73717j67135r20575L34456J364779Q80882M03635J69426J92821
$$ 310036968 311010685 310843550 309922975 310257431 311622210 312503092 312906727 313076153 313268974
1403.1C13268974Q26940J212061J533441K320670L202855L756583M272908M317947
$$ 313268974 314095914 315307975 316841416 319162086 322364941 326121524 330394432 334712379
1419.4C34712379K836883K129934J954847J762956K131425J793131J433715K011098
$$ 334712379 337549262 339679196 341634043 343396999 345528424 347321555 348755270 350766368
1435.7C50766368R16645j022443q07270j89692r5368q1658m19691p09929j37426J483374
$$ 350766368 351683013 350660570 349853300 349663608 349568240 349486582 349066891 348356962 348219536 349702910
1456.1C49702910R57101k071373j987405m38765k66842p50386P041J239814N68852
$$ 349702910 350660011 348588638 346601233 346162468 345895626 345145240 345152281 346392095 346960947
1474.5C46960947j435615k457500k150945j473650r00366J0356L10094j450032k827570
$$ 346960947 345525332 343067832 340916887 339443237 338542871 338553227 338863321 337413289 334585719
1492.8C34585719j965948p88010j225882k008229j741350K74368K643429j136512m216246
$$ 334585719 332619771 331831761 330605879 328597650 326856300 327130668 329774097 328637585 324421339
1511.2C24421339l492572j874193q46572o77631j82986n1521l68953r2461j61752R6894
$$ 324421339 320928767 319054574 318208002 317530371 317347385 317295864 316926911 316834450 316672698 316769592
1531.6C16769592J257919P96654R0822K598018L387294K6226j608804j567788j056381
$$ 316769592 318027511 318824165 318914987 321513005 324900299 324926525 323317721 321749933 320693552
1549.9C20693552j404955j728423q47392P23712j334287m542005l668144k025533j399909
$$ 320693552 319288597 317560174 316712782 317436494 316102207 311560202 307892058 305866525 304466616
1568.3C04466616j668967k246201k050400j531411k563148l529974l028698k300963
$$ 304466616 302797649 300551448 298501048 296969637 294406489 290876515 287847817 285546854
1584.6B85546854k217684k497397k881512k993234l276113l859028l874302l129822
$$ 285546854 283329170 280831773 277950261 274957027 271680914 267821886 263947584 260817762
1600.9B60817762k822671l485698l868751l529117l170296l037471k661832k413392
$$ 260817762 257995091 254509393 250640642 247111525 243941229 240903758 238241926 235828534
1617.2B35828534k666097k328959j728777j952033k027769j619402j788251j458284
$$ 235828534 233162437 230833478 229104701 227152668 225124899 223505497 221717246 220258962
1633.6B20258962p0538n58216j942068k066065j652036m88907m81512j971703r14876
$$ 220258962 220188424 219630208 217688140 215622075 213970039 213481132 212999620 211027917 210113041
1651.9B10113041l7774l143382l409162j833718q90959j132284j450628p54520k61403
$$ 210113041 210075267 206931885 203522723 201689005 200798046 199665762 198215134 197460614 197199211
1670.3A97199211j180638j507066j033470o70366l86406K3805M19970o24247j438688
$$ 197199211 196018573 194511507 193478037 192807671 192421265 192445070 192865040 192240793 190802105
1688.6A90802105j479313j404472j68923J003984O34045q662j072790p06334j87028
$$ 190802105 189322792 187918320 187749397 188753381 189387426 189378764 188305974 187599640 187412612
1707A87412612r18023j002122j17514Q63205J013913p11009j772009j164842n55963
$$ 187412612 186494589 185492467 185374953 186238158 187252071 186541062 184769053 183604211 183048248
1725.3A83048248q9649M01251M16655J025778N54304r81614m33195N31245K05003k60640
$$ 183048248 182958599 183359850 183776505 184802283 185356587 184374973 183941778 184473023 184678026 184417386
1745.7A84417386q6967K16607k24170n29326k73828o66938p13244K68872R4474k55648
$$ 184417386 184330419 184547026 184322856 183793530 183519702 182852764 182139520 182408392 182502866 182247218
1766.1A82247218J28504K53506N42421r6132q84179k16495L76851O9644k70494l77632
$$ 182247218 182375722 182629228 183171649 183075517 182191338 181974843 182351694 182421338 182150844 181773212
1786.5A81773212q2869O34901Q91481M5094m65475J37147N89993p1284n53261j99247
$$ 181773212 181690343 182325244 183216725 183261819 182796344 182933491 183523484 183452200 182898939 182699692
1806.9A82699692K75392K87275l06181n28619j17980j05016k51848M13284J068376
$$ 182699692 182975084 183262359 182956178 182427559 182309579 182204563 181952715 182365999 183434375
1825.3A83434375N61960J49607j58250n85988k22232L4012k27076p2885P87918R20128
$$ 183434375 183996335 184145942 183987692 183401704 183179472 183213484 182986408 182913523 183701441 184621569
1845.7A84621569k34172q71215o23446j32024K14632M30942N21727M36436K29031L86797
$$ 184621569 184387397 183516182 182892736 182760712 182975344 183406286 183928013 184364449 184593480 184980277
1866A84980277Q30982K89362o30841o64536m18927l70276k15768Q9109J71493J53128
$$ 184980277 185811259 186100621 185469780 184805244 184386317 184016041 183800273 183889382 184060875 184214003
1886.4A84214003N70435P82330K70158r2126j73990q7805J6484j23195j2144L80910
$$ 184214003 184784438 185566768 185836926 185744800 185570810 185483005 185499489 185376294 185364150 185745060
1906.8A85745060K67495k48309k58275K05599M91738L35053J58083R2964j3783K26199
$$ 185745060 186012555 185764246 185505971 185711570 186203308 186538361 186696444 186789408 186775625 187001824
1927.2A87001824L13223k31881n06695j65645J95093L59416M63762K55145k94596m09186
$$ 187001824 187315047 187083166 186576471 186410826 186605919 186965335 187429097 187684242 187389646 186980460
1947.6A86980460q8904K30800N16214M42490J19470n5954k75709k65166L44627M94960
$$ 186980460 186891556 187122356 187638570 188081060 188200530 188144576 187868867 187603701 187948328 188443288
1968A88443288q6222j12727K47881J64378j12466j16509r7062j26511j8105Q8923M79594
$$ 188443288 188357066 188244339 188492220 188656598 188544132 188427623 188330561 188204050 188185945 188274868 188754462
1990.5A88754462N99436q5719k98507N6252k0285k39815M5411M32339K14427j56294
$$ 188754462 189353898 189268179 188969672 189025924 189005639 188765824 188811235 189243574 189458001 189301707
2010.8A89301707l2988K54978K62037o9235k93385R5461O13853L50252k20705k87481
$$ 189301707 189268719 189523697 189785734 189716499 189423114 189518575 190132428 190482680 190261975 189974494
2031.2A89974494j24946J23587K67475J36849k5146K3786K78596J80136j40648j07102
$$ 189974494 189849548 189973135 190240610 190377459 190352313 190376099 190654695 190834831 190694183 190587081
2051.6A90587081K28267M48507O6813m29564k61012J44709J17384M8950L07038L30583
$$ 190587081 190815348 191263855 191330668 190901104 190640092 190784801 190902185 190951135 191258173 191588756
2072A91588756Q0876J14720M34518N08707P6853l01991l62843k85991j4063J83713
$$ 191588756 191669632 191784352 192218870 192727577 192804430 192502439 192139596 191853605 191839542 192023255
2092.4A92023255R4157N141l7346j0282K03196K79527J57207O3330M1947J36662J46665
$$ 192023255 192117412 192122553 192085207 192074925 192278121 192557648 192714855 192778185 192820132 192956794 193103459
2114.9A93103459L3285l3285j26381j03917J88090L14750K1383j79987O1169L80259
$$ 193103459 193136744 193103459 192977078 192873161 193061251 193376001 193397384 193217397 193278566 193658825
2135.2A93658825J88667l09106k71722J40182L00706R6634k03010j05016K75802M68027
$$ 193658825 193847492 193538386 193266664 193406846 193707552 193804186 193601176 193496160 193771962 194239989
2155.6A94239989L58410k8424m53424l98438J62404L86536K1383j45361p8231n3867
$$ 194239989 194598399 194569975 194116551 193718113 193880517 194267053 194288436 194143075 194064844 194010977
2176A94010977J17756Q0392J1921L75733L88231j55662k56393J13175K05747l520j93845
$$ 194010977 194128733 194209125 194221046 194596779 194985010 194829348 194572955 194686130 194891877 194888357 194694512
2198.5A94694512m6827L74969M99021L21958P0948l53921n61289k28230K87797M33214
$$ 194694512 194647685 195022654 195521675 195843633 195914581 195560660 194999371 194771141 195058938 195492152
2218.9A95492152L1684k87295j41058J13175K38548J50819m0606j30255m7106J01812
$$ 195492152 195523836 195236541 195095483 195208658 195447206 195598025 195557419 195427164 195380058 195481870
2239.3A95481870K34489M54150K15303m93433m57894Q2589K14447J92281J40275L3304
$$ 195481870 195716359 196170509 196385812 195892379 195434485 195517074 195731521 195923802 196064077 196097381
2259.6A96097381m0624r0450j24555l38219j63280O14152Q24407J63596n40894m14625
$$ 196097381 196056757 195966307 195841752 195503533 195340253 195954405 196778812 196942408 196401514 195986889
2280A95986889J90661L65898N65815M63780l19387m10658M1444O6906R1289J65775
$$ 195986889 196177550 196543448 197109263 197573043 197253656 196842998 196884442 196951348 197042637 197208412
2300.4A97208412O9086M6584J18390J31391j8422l37008l43733m600K05040K79825
$$ 197208412 197277498 197324082 197442472 197573863 197555441 197218433 196874700 196870100 197075140 197354965
2320.8A97354965J58474M600r3188k82805m29060n04293R3430J190734P31218n92526
$$ 197354965 197513439 197518039 197424851 197142046 196712986 196208693 196302123 197492857 198224075 197631549
2341.2A97631549L66848J564100m2282j773517j628455o47753q73972j341775j69948
$$ 197631549 197998397 199562497 199520215 197746698 196118243 195470490 194596518 193254743 193084795
2359.6A93084795J199320J498330R87426O67721J244414J142323J44206j28485r5945
$$ 193084795 194284115 195782445 196769871 197437592 198682006 199824329 199968535 199840050 199744105
2377.9A99744105q0503k5202l91900p16783m60614j26529j1642J10809K61739L30023
$$ 199744105 199663602 199638400 199246500 198529717 198069103 197942574 197930932 198041741 198303480 198633503
2398.3A98633503J41729j40369k83159j07848K75299J63671j91573J2182M28427M80488
$$ 198633503 198775232 198634863 198351704 198243856 198519155 198682826 198491253 198503435 198931862 199412350
2418.7A99412350K36611j93789l76441l2522K28733J3821k41455l7942K90517J11126
$$ 199412350 199648961 199455172 199078731 199046209 199274942 199288763 199047308 199009366 199299883 199411009
2439.1A99411009k46913q5626K08412L95682N04180P5084k96273J0561K95733O9663
$$ 199411009 199164096 199078470 199286882 199682564 200186744 200261828 199965555 199976116 200271849 200341512
2459.5B00341512j2182J20345R1642K16868J22283l20189k91131K17408N15375L42168
$$ 200341512 200329330 200449675 200541317 200758185 200880468 200560279 200269148 200486556 201001931 201344099
2479.9B01344099l7961k12584o500K51606J31782r3821O0741K43783J39921l2279l21586
$$ 201344099 201306138 201093554 201087054 201338660 201470442 201376621 201437362 201681145 201821066 201788787 201467201
2502.3B01467201n65052j53184O69696Q88630K59821m42602n12786K7101N71665N02541
$$ 201467201 200902149 200748965 201418661 202307291 202567112 202124510 201611724 201638825 202210490 202713031
2522.7B02713031k8200j10120M90118O27190N6960m00674m93135j90139M6100p3760
$$ 202713031 202684831 202574711 203064829 203692019 203748979 203348305 202855170 202665031 202711131 202637371
2543.1B02637371j60840Q1901N23496O75470N20646K50433k37692m62048j99657m5318
$$ 202637371 202476531 202558432 203081928 203757398 204278044 204528477 204290785 203828737 203629080 203583762
2563.5B03583762Q1658J08798n980J37277M359k71034j1399J80416j26418k33315J64397
$$ 203583762 203665420 203774218 203768238 203905515 203909874 203638840 203627441 203807857 203681439 203448124 203612521
2585.9B03612521M42770K96011R0897J02017K440j68494l9079p6778j29957J48677
$$ 203612521 204055291 204351302 204442199 204544216 204546656 204378162 204339083 204262305 204132348 204281025
2606.3B04281025J07716q9276j30776j18837J07176J96435J82073M28204N25936J27573
$$ 204281025 204388741 204299465 204168689 204049852 204157028 204353463 204535536 204963740 205489676 205617249
2626.7B05617249k22009J7360K51327J91890P338m54895m34220L81563O84243J78888
$$ 205617249 205395240 205412600 205663927 205855817 205863155 205408260 204974040 205355603 206039846 206218734
2647.1B06218734j05053j02874P5456L52077J15913L0677M34649M17027l3658l19294
$$ 206218734 206113681 206010807 206086263 206438340 206554253 206584930 207019579 207436606 207402948 207083654
2667.5B07083654q9333M96060P64951J22208n61327k77236J50167J92783J17329l9116
$$ 207083654 206994321 207490381 208255332 208377540 207816213 207538977 207689144 207881927 207999256 207960140
2687.9B07960140j48807j36848j57766j28709J68346K53357Q9612N4836J31447L37288
$$ 207960140 207811333 207674485 207516719 207388010 207556356 207809713 207899325 207954161 208085608 208422896
2708.3B08422896L38405K37934K11876k3358j84979o1933N7053j2238q9090K01278
$$ 208422896 208761301 208999235 209211111 209187753 209002774 208940841 208997894 208985656 208896566 209097844
2728.7B09097844N35417J52942l70275p1172N56372N68647J01086j44821N8692L34755
$$ 209097844 209633261 209786203 209415928 209344756 209901128 210469775 210570861 210426040 210484732 210819487
2749.1B10819487K76360K33986L63644J52755j63074r0506Q959j03265j4417L48706
$$ 210819487 211095847 211329833 211693477 211846232 211683158 211592652 211601611 211498346 211483929 211832635
2769.5B11832635N18356J89188k21803j83750M7553J87848L90094N70118N51976J69147
$$ 211832635 212350991 212540179 212318376 212134626 212182179 212370027 212760121 213330239 213882215 214051362
2789.9B14051362j77026J91424Q11555P72513J53166k0415K67159J0338k94093N0068
$$ 214051362 213874336 214065760 214877315 215649828 215802994 215782579 216049738 216060076 215765983 215816051
2810.3B15816051K79676K65818L51816K37003K21245N74235N82207J38004L7569L19332
$$ 215816051 216095727 216361545 216713361 216950364 217171609 217745844 218328051 218466055 218503624 218822956
2830.7B18822956M70169L96445O16238R88673M91962j6354L20654L28850l4607K87462
$$ 218822956 219293125 219689570 220305808 221294481 221786443 221770089 222090743 222419593 222384986 222672448
2851B22672448O65448K68426p2494r258J60523M74788N71348L33153M02145P39489
$$ 222672448 223337896 223606322 223533828 223524570 223685093 224159881 224731229 225064382 225466527 226206016
2871.4B26206016N74626J93100J32825l6824j74008K25827O55222M46327J360j54692
$$ 226206016 226780642 226973742 227106567 227069743 226895735 227121562 227776784 228223111 228224471 228069779
2891.8B28069779j15671K73362N95078N77681N39832K17277M9677N44283J096726O88694
$$ 228069779 227954108 228227470 228822548 229400229 229940061 230157338 230207015 230751298 231848024 232536718
2912.2B32536718k73362j35432O21005Q44542O46357K10907R5088M71603O30990J92951
$$ 232536718 232263356 232127924 232748929 233593471 234239828 234450735 234545823 235017426 235648416 235841367
2932.6B35841367k21915o2306m0996n6029M05573K10460l30713j09318K2146k60453
$$ 235841367 235619452 235557146 235516150 235460121 235865694 236076154 235745441 235636123 235658269 235397816
2953B35397816l68636k51383j6671k00830o39018o14356m67058k00179O7726l51742
$$ 235397816 235029180 234777797 234761126 234560296 233921278 233306922 232839864 232639685 232707411 232355669
2973.4B32355669p06967j11945K62931o13499j359396q67546n8393J24443m3940J48993
$$ 232355669 231648702 231536757 231799688 231186189 229826793 228959247 228900854 229025297 228981357 229130350
2993.8B29130350M24888K83029O0853K2929n8394j42753o5491r1977o1412K27895L17693
$$ 229130350 229555238 229838267 229899120 229922049 229863655 229720902 229655411 229563434 229502022 229729917 230047610
3016.2B30047610k4569k35270q0783j8552N0477K42647M34257P04583Q14460N11464
$$ 230047610 230023041 229787771 229706988 229688436 229738913 229981560 230415817 231120400 231934860 232446324
3036.6B32446324r1754k70065J32434J20700J0375K17929K58088M01493M67916M33009
$$ 232446324 232354570 232084505 232216939 232337639 232348014 232565943 232824031 233225524 233693440 234126449
3057B34126449M57633M9453l07932o0927L56286O52522O35125L02568J12057J66744
$$ 234126449 234584082 234633535 234325603 234264676 234620962 235273484 235908609 236211177 236323234 236489978
3077.4B36489978M86038O14040L07336L41535O27078N21857M8150k16644o836J62478
$$ 236489978 236976016 237590056 237897392 238238927 238866005 239387862 239436012 239219368 239212532 239375010
3097.8B39375010K92137O36597O57476M62998O08656N44414L1479k49911j02371L29558
$$ 239375010 239667147 240303744 240961220 241424218 242032874 242577288 242608767 242358856 242256485 242586043
3118.2B42586043R20929J053121N97872Q2720j13398K11727O97951P25203J82762l72640
$$ 242586043 243506972 244560093 245157965 245240685 245127287 245339014 246036965 246762168 246944930 246572290
3138.6B46572290l45465L1218L95905R19867Q56202r7844p23005l51313P08420J204963
$$ 246572290 246226825 246258043 246653948 247573815 248430017 248332173 247609168 247257855 247966275 249171238
3159B49171238O64853J04196n5656n3197L13688N25676J20122L9768P5977p9814J28895
$$ 249171238 249836091 249940287 249884631 249831434 250145122 250670798 250790920 250830688 250906665 250826851 250955746
3181.4B50955746O03422Q59723N22937j75591o41980k50190M28781N21280N27650M51710
$$ 250955746 251559168 252418891 252941828 252766237 252124257 251874067 252302848 252824128 253351778 253803488
3201.8B53803488j20476m28651J0711J49831j68216K03066O21043L83426L37623K07536
$$ 253803488 253683012 253254361 253265072 253414903 253246687 253449753 254070796 254454222 254791845 254999381
3222.2B54999381j9484K94559L31085k33631k16049N18598N38714j81216k97092J94124
$$ 254999381 254979897 255274456 255605541 255371910 255155861 255674459 256213173 256031957 255734865 255928989
3242.6B55928989N31320L73758j21649k47154J56797L74317K34004R7230k54325n26197
$$ 255928989 256460309 256834067 256712418 256465264 256622061 256996378 257230382 257327612 257073287 256547090
3263B56547090q1826O65411R91058M76092r891M6156j17588k8294N47301N29792K05562
$$ 256547090 256465264 257130675 258121733 258597825 258587934 258634090 258516502 258488208 259035509 259565301 259770863
3285.4B59770863L71281J17086n15580l87189K52799M68567k59709o58687J2368L31122
$$ 259770863 260142144 260259230 259743650 259356461 259609260 260077827 259818118 259159431 259171799 259502921
3305.8B59502921J50316K13813K62446n1390k80868j18446j56630k13254J28616L24528
$$ 259502921 259653237 259867050 260129496 260078106 259797238 259678792 259522162 259308908 259437524 259762052
3326.2B59762052L0231m32525n42681m82165l88175P5270M22243o7316p57352o42706
$$ 259762052 259792283 259359758 258817077 258334912 257946737 258022007 258444250 258376934 257619582 256976876
3346.6B56976876k40020k23536k72412k72933n69988q09264l56268J53147P3835m3903
$$ 256976876 256736856 256513320 256240908 255967975 255397987 254588723 254232455 254385602 254459437 254415534
3367B54415534l10149j043360r99235J7844K98210j22637L4012l5111q39121j012013
$$ 254415534 254105385 253062025 252062790 252080634 252378844 252256207 252290219 252255108 251415987 250403974
3387.4B50403974n58551k73083k61273m24646n35622o59693o77407k82209P3425r5628
$$ 250403974 249845423 249572340 249311067 248886421 248350799 247691106 247013699 246731490 246804915 246709287
3407.8B46709287m61638p07861p95666r03942p11288j92188n48288j068730o99404
$$ 246709287 246247649 245539788 244744122 243840180 243128892 242936704 242388416 241319686 240620282
3426.1B40620282o64816j128297j231376j241118r80086l28199j48098l80613m22374
$$ 240620282 239955466 238827169 237595793 236354675 235374589 235046390 234898292 234517679 234095305
3444.5B34095305k39312o14617j394991j111180j03190J32657o08433j282114j247656
$$ 234095305 233855993 233241376 231846385 230735205 230632015 230764672 230156239 228874125 227626469
3462.8B27626469m63445K73865k08132r22661o12457k7250J7173l71094o60289m25242
$$ 227626469 227163024 227436889 227228757 226306096 225693639 225666389 225683562 225312468 224652179 224226937
3483.2B24226937j20476j30013k9709J11759n2881q3670k1532k43932j69519m95706
$$ 224226937 224106461 223976448 223946739 224058498 224005617 223921947 223900415 223656483 223486964 222991258
3503.6B22991258j597088j499019l64595j3616k55387l46042o32927o20838j02073
$$ 222991258 221394170 219895151 219530556 219516940 219261553 218915511 218282584 217661746 217559673
3522B17559673l00165q57432m84828K53842J95615k32887l64017m57558m08274M5412
$$ 217559673 217259508 216402076 215917248 216171090 216366705 216133818 215769801 215312243 214903969 214949381
3542.4B14949381N21987L8371j123622q62554J83806m8671o05788n58384k79173L22666
$$ 214949381 215471368 215509739 214386117 213523563 213707369 213658698 213052910 212494526 212215353 212538019
3562.8B12538019J431480J912936j41207j907963j515709p87154q9407K35085o97896
$$ 212538019 213969499 215882435 215741228 213833265 212317556 211530402 211440995 211676080 210978184
3581.1B10978184j538079k39313K015457Q32751j916681j469049K06958K58852M2096
$$ 210978184 209440105 209200792 211216249 212049000 210132319 208663270 208870228 209129080 209171176
3599.5B09171176j17887p60481n44469M71957J40406q76840n99493r3113P02384R33335
$$ 209171176 209053289 208292808 207748339 208220296 208360702 207483862 206884369 206791256 207493640 208426975
3619.9B08426975o78636j660716r58070J509934J667720j298227j927465j337416m66053
$$ 208426975 207748339 206087623 205129553 206639487 208307207 207008980 205081515 203744099 203278046
3638.2B03278046M01214M02611Q19K82172J861193J612976j647454k165325M8559L21530
$$ 203278046 203679260 204081871 204082690 204364862 206226055 207839031 206191577 204026252 204074811 204396341
3658.6B04396341p74041r81409j006666p04155P68155J326203l93837L14079R72524
$$ 204396341 203622300 202640891 201634225 200930070 201698225 203024428 202630591 202944670 203917194
3677B03917194j009405j599490j290161n22044J116246K154131J09039j361128l85847
$$ 203917194 202907789 201308299 200018138 199496094 200612340 202766471 202875510 201514382 201128535
3695.3B01128535O2641n51995K7921J239926L49022q31969L7681J844503O62469j417082
$$ 201128535 201191176 200639181 200667102 201907028 202256050 201424081 201461762 203306265 203968734 202551652
3715.7B02551652r54028O09606J438130Q44858l22610j395978j662075N28730L502667
$$ 202551652 201597624 202207230 203645360 204490218 204167608 202771630 201109555 201638285 205140952
3734.1B05140952K667401o01988k799724k168770J542307P65678j964085J065749K432503
$$ 205140952 207808353 207206365 204406641 202237871 203780178 204545856 202581771 203647520 206080023
3752.4B06080023j075044k330188j248270o77556o83404K54809L86853j01663M90993
$$ 206080023 205004979 202674791 201426521 200748965 200065561 200320370 200707223 200605560 201096553
3770.8B01096553J15764p66982n02020L79775L31271N0702K51047m12632n07180N2583
$$ 201096553 201212317 200445335 199943315 200323090 200654361 200705063 200956110 200543478 200036298 200088881
3791.2B00088881l31774k32011r2965L0361K144612J111366j152847r0841q54321k405327
$$ 200088881 199757107 199525096 199432131 199462492 201607104 202718470 201565623 201474782 200620461 198215134
3811.6A98215134r70959J790933J229700M80097J851227N4259j032707m03467o29798
$$ 198215134 197244175 199035108 200264808 200744905 202596132 202650391 201617684 201214217 200584419
3829.9B00584419j95187M07193O61556J734346J224913l98588o06607p32914j361333
$$ 200584419 200389232 200796425 201457981 203192327 204417240 204018652 203412045 202679131 201317798
3848.3B01317798j332741J497585L981796j47373k886634j916494L16910J084860m34145
$$ 201317798 199985057 201482642 205464438 205317065 202430431 200513937 200830847 201915707 201481562
3866.6B01481562l68208J326837P00057n53336j489018q85948Q24146N78072R18247
$$ 201481562 201113354 202440191 203140248 202586912 201097894 200211946 201036092 201614164 202532411
3885B02532411M94457j384783n75911N71571k60845o6161J360793J311041O30021K64570
$$ 202532411 203026868 201642085 201066174 201637745 201376900 201310739 202671532 203982573 204612594 204877164
3905.4B04877164j620557k297796q08127n9642N04758J108385K34023l47104M35505
$$ 204877164 203256607 200958811 200150684 200091042 200595800 201704185 201938208 201591104 202026609
3923.7B02026609Q56500L0380j19358L37157m26657j113788l64426P73352Q63261o80759
$$ 202026609 202883109 202913489 202794131 203131288 202704631 201590843 201226417 201999769 202863030 202182271
3944.1B02182271j115017O37751P64206j87401J61361j69780j164097p13561K33688
$$ 202182271 201067254 201705005 202469211 202281810 202443171 202273391 201109294 200395733 200629421
3962.5B00629421J30664Q7563L19127M3381m7721K21785M0401m38429p33044o74930
$$ 200629421 200760085 200847648 201166775 201210156 201162435 201384220 201424621 200986192 200253148 199578218
3982.9A99578218j50949O55912Q63429J30423K1960L92870q0523
$$ 199578218 199427269 200083181 200946610 201077033 201098993 201491863 201411340
3997.1B01411340
$$ 201411340
##END=$$ End of the data block
