##TITLE=Rodrigo - Epoxido $$ Begin of the data block
##JCAMP-DX=5.00 $$ ACD/SpecManager v 10.08
##SPECTROMETER/DATA SYSTEM=Alpha
##DATE=28 Apr 2015 09:23:26
##DATA TYPE=INFRARED SPECTRUM
##DATA CLASS=XYDATA
##ORIGIN=
##OWNER=
##NPOINTS=1765
##FIRSTX=399.76428223
##LASTX=3997.64306641
##MAXX=3997.64306641
##MINX=399.76428223
##MAXY=1.00213993
##MINY=0.27259216
##XFACTOR=1.0000000000
##YFACTOR=0.000000010000000
##FIRSTY=1.00000000
##DELTAX=2.03961372
##XUNITS=1/CM
##YUNITS=ARBITRARY UNITS
##XYDATA=(X++(Y..Y))
$$ plain form
399.8 100000000 100213993 100120890 100000000 99851161 99644351 99775851 99806559 99497181 99311155 99269462
420.2 99269462 98946810 98646736 98444861 97721213 96406430 95485282 95736617 96822268 97962481
438.5 97962481 98689479 98789686 98626202 98711365 98765701 98568541 98495209 98551482 98355424 98100233 98089898
461 98089898 97976798 97638297 97354472 96994746 96372575 96091366 96520013 96966851 97055525 97080749 97072387
483.4 97072387 96843785 96631050 96576333 96388948 96039963 95826614 95708102 95478672 95269644 95165360
503.8 95165360 94916767 94505620 94156206 93751824 93090689 92264956 91222721 89614820 87106401
522.1 87106401 82984036 77266639 74167949 78036219 86041158 91938740 94115102 94563550 94521129
540.5 94521129 94209927 93860161 93654293 93417430 93087929 92861986 92707050 92421257 92120731 91962856
$$ packed form
399.8A00000000K13993r3103j20890j48839k06810J31500L0708l09378j86026m1693
420.2I9269462l22652l00074k01875p23648j314783r21148K51335J085651J140213
438.5I7962481P26998J00207j63484Q5163N4336j97160p3332N6273j96058k55191j0335
461I8089898j13100l38501k83825l59726o22171k81209M28647M46838Q8674K5224q362
483.4I7072387k28602k12735n4717j87385l48985k13349j18512k29430k09028j04284
503.8I5165360k48593m11147l49414m04382o61135q25733j042235j607901k508419
522.1H7106401m122365n717397l098690L868270Q004939N897582K176362M48448m2421
540.5I4521129l11202l49766k05868k36863l29501k25943j54936k85793l00526j57875
$$ plain form
560.9 91962856 91772592 91462910 91237849 91101652 90818089 90482378 90303540 90136778 89786917 89370233
581.3 89370233 88878012 88014036 86539453 83965647 79155558 72972357 71131283 76976228 85104740
599.6 85104740 89743996 91273808 91604888 91469401 91195863 90834504 89969087 88734984 88600403
618 88600403 89770877 90590489 90616667 90496206 90345734 90141803 89956528 89732474 89403558 89063382
638.4 89063382 88741684 88298476 87739736 87176460 86556166 85762161 84892881 83952600 82678580 80704880
658.8 80704880 77597696 72891140 67648876 66599381 74841022 82067502 83491331 82160336 79496771
677.2 79496771 75693268 71258420 67644286 64644015 59679604 51274824 41534585 34858060 32340479
695.5 32340479 31345120 31596902 35601163 45409608 59627086 73467195 83839476 90714967
$$ packed form
560.9I1962856j90264l09682k25061j36197k83563l35711j78838j66762l49861m16684
581.3H9370233m92221q63976j474583k573806m810089o183201j841074N844945Q128512
599.6H5104740M639256J529812L31080j35487k73538l61359q65417j234103j34581
618H8600403J170474Q19612K6178j20461j50472k03931j85275k24054l28916l40176
638.4H9063382l21698m43208n58740n63276o20294p94005q69280r40281j274020j973700
658.8H0704880l107184m706556n242264j049495Q241641P226480J423829j330995k663565
677.2G9496771l803503m434848l614134l000271m964411q404780r740239o676525k517581
695.5C2340479r95359K51782M004261R808445J4217478J3840109J0372281O875491
$$ plain form
711.8 90714967 94918001 97330523 98768860 99640626 100000000 99999011 99802804 99400932 98694557 97693056
732.2 97693056 96369374 94638759 92415398 89485610 85431921 79778045 72163284 62784177 53611875
750.6 53611875 49053633 53005081 64152509 76746136 86172312 91489649 93643403 93485844
766.9 93485844 91107446 85850012 77001667 66625756 62280375 69660258 83074492 93145674
783.2 93145674 97749901 99327695 99717087 99516785 98839545 97709060 95956284 93333393 90174603
801.6 90174603 87719184 86937827 87627137 89335334 91702217 93902028 95323992 96053183 96286809
819.9 96286809 96020746 95065677 92906070 88881326 83913004 81755817 84853810 90267009 94076633
838.3 94076633 95714349 96068066 95634830 94528413 92660195 90590352 89743751 90175903 90494627
$$ packed form
711.8I0714967M203034K412522J438337Q71766L59374r89j96207m01872p06375j001501
732.2I7693056j323682j730615k223361k929788m053689n653876p614761r379107r172302
750.6E3611875m558242L951448J1147428J2593627R426176N317337K153754j57559
766.9I3485844k378398n257434q848345j0375911m345381P379883J3414234J0071182
783.2I3145674M604227J577794L89392k00302o77240j130485j752776k622891l158790
801.6I0174603k455419p81357O89310J708197K366883K199811J421964P29191K33626
819.9I6286809k66063r55069k159607m024744m968322k157187L097993N413199L809624
838.3I4076633J637716L53717m33236j106417j868218k069843q46601M32152L18724
$$ plain form
856.6 90494627 90114290 88755417 86023086 82761604 80932081 81691670 84090304 86248434 87190789
875 87190789 86896908 85605824 83545744 80723631 76796836 71392655 64900702 59631360 59459996
893.4 59459996 65886778 75436169 83487129 88553149 91519004 93403244 94707364 95675528 96441078
911.7 96441078 97002524 97351903 97566926 97659093 97510219 97172695 96922547 96765745 96208131 94544905
932.1 94544905 91618109 89488435 90845484 94495213 97146058 98041052 98199558 98239923 98221397
950.5 98221397 98124498 98024851 97914279 97721219 97505736 97340494 97134984 96817136 96437645 95985866
970.9 95985866 95326108 94364983 93533278 93488431 93820000 93610722 92935532 92453533 92389810 92196530
991.3 92196530 91113156 88823432 86004788 83886611 82217467 80165082 77280915 73772079 73468781
$$ packed form
856.6I0494627l80337j358873k732331l261482j829523P59589K398634K158130R42355
875H7190789k93881j291084k060080k822113l926795n404181o491953n269342j71364
893.4E9459996O426782R549391Q050960N066020K965855J884240J304120R68164P65550
911.7I6441078N61446L49379K15023R2167j48874l37524k50148j56802n57614j663226
932.1I4544905k926796k129674J357049L649729K650845Q94994J58506M0365j8526
950.5I8221397r6899r9647j10572j93060k15483j65242k05510l17848l79491m51779
970.9I5985866o59758r61125q31705m4847L31569k09278o75190m81999o3723j93280
991.3I2196530j083374k289724k818644k118177j669144k052385k884167l508836l03298
$$ plain form
1009.6 73468781 79256940 87228668 92642426 95051587 95754963 95437062 94165593 91866702 88965732
1028 88965732 86575472 85897762 87499356 90694046 93958527 96254671 97491390 97937781 97829145
1046.3 97829145 97283399 96154302 94051480 90733051 86985439 85202521 87089843 90837818 93254030
1064.7 93254030 93124485 91064340 88811404 88582093 90421236 91739577 90915751 89329976 89612770
1083 89612770 92196923 94882470 96158504 96328849 96020871 95577145 95238703 95073575 94893539 94415724
1103.4 94415724 93342400 91246223 88062662 85675651 86787903 90762079 94378197 96207094
1119.8 96207094 96855438 97016376 96977645 96870315 96758717 96626407 96465594 96319866 96207410 96100503
1140.1 96100503 95996791 95882910 95695984 95368338 94836837 94146603 93535525 93098754 92601389 92094326
$$ packed form
1009.6G3468781N788159P971728N413758K409161P03376l17901j271469k298891k900970
1028H8965732k390260o77710J601594L194690L264481K296144J236719M46391j08636
1046.3I7829145n45746j129097k102822l318429l747612j782918J887322L747975K416212
1064.7I3254030j29545k060145k252936k29311J839143J318341q23826j585775K82794
1083H9612770K584153K685547J276034J70345l07978m43726l38442j65128j80036m77815
1103.4I4415724j073324k096177l183561k387011J112252L974176L616118J828897
1119.8I6207094O48344J60938l8731j07330j11598j32310j60813j45728j12456j06907
1140.1I6100503j03712j13881j86926l27646n31501o90234o11078m36771m97365n07063
$$ plain form
1160.5 92094326 92132306 92655921 92822617 92309123 91345417 90013516 88199550 85961270 83993196
1178.9 83993196 83725250 86003983 89107281 90466541 89733398 88137412 87080133 87407142 88608718
1197.3 88608718 89571828 89866698 89678270 89213169 88542026 87683833 86655289 85460180 84077209
1215.6 84077209 82439625 80389529 77691674 74298114 70613581 67093551 63551962 59511262
1231.9 59511262 55103284 51447982 50558633 53944498 60844564 68811327 75726080 80742168 84116983
1250.3 84116983 86681587 89041245 91157687 92742062 93743056 94353813 94759697 95018488 95131201
1268.6 95131201 95082039 94814289 94287711 93574440 92867368 92407674 92313349 92428815 92427218 92006868
1289 92006868 90999103 89703220 89265585 90478134 92329460 93386084 93401539 92720962 91612077
$$ packed form
1160.5I2094326L7980N23615J66696n13494r63706j331901j813966k238280j968074
1178.9H3993196k67946K278733L103298J359260p33143j595986j057279L27009J201576
1197.3H8608718R63110K94870j88428m65101o71143q58193j028544j195109j382971
1215.6H4077209j637584k050096k697855l393560l684533l520030l541589m040700
1231.9E9511262m407978l655302q89349L385865O900066P966763O914753N016088L374815
1250.3H4116983K564604K359658K116442J584375J000994O10757M05884K58791J12713
1268.6I5131201m9162k67750n26578p13271p07072m59694r4325J15466j597m20350
1289I2006868j007765j295883m37635J212549J851326J056624J5455o80577j108885
$$ plain form
1307.4 91612077 90327144 88988298 87929302 87933850 88796848 89527869 90329623 91629595 92772233
1325.8 92772233 93191737 92998761 92444038 91685742 90774959 89673764 88458943 87324613 86243230
1344.1 86243230 84887826 82712454 79676032 77252883 77489626 80575645 84450632 87319404 88847673
1362.5 88847673 89375037 89328575 88964885 88441485 87800586 87011003 86169994 85268891 84194583 82976294
1382.9 82976294 81668597 80069286 78050846 75853169 73532617 71260083 69479311 68053538
1399.2 68053538 66672301 64966333 62301803 58632213 54798359 52668399 54139578 58461857
1415.5 58461857 63443244 67559397 70160276 71981096 73333246 73909324 73677790 72862822 71717310
1433.9 71717310 70017290 67774171 65450501 62631094 59006232 54214555 48009077 43570209
$$ packed form
1307.4I1612077j284933j338846j058996M548Q62998P31021Q01754J299972J142638
1325.8I2772233M19504j92976n54723p58296r10783j101195j214821j134330j081383
1344.1H6243230j355404k175372l036422k423149K36743L086019L874987K868772J528269
1362.5H8847673N27364m6462l63690n23400o40899p89583q41009r01103j074308j218289
1382.9H2976294j307697j599311k018440k197677k320552k272534j780772j425773
1399.2F8053538j381237j705968k664530l669590l833854k129960J471179M322279
1415.5E8461857M981387M116153K600879J820820J352150N76078k31534q14968j145512
1433.9G1717310j700020k243119k323670k819407l624862m791677o205478m438868
$$ plain form
1450.2 43570209 44278356 48078337 49921492 48866504 50753093 56527627 64023805 69505435 71831322
1468.5 71831322 72816938 73419505 73768288 73918873 73969191 74020863 74118072 74200743 74073261 73352677
1488.9 73352677 72101378 71127838 70233142 70543528 74870384 80516315 83949798 85550195 86550909
1507.3 86550909 87148434 87498528 87795061 88171661 88766307 89467108 90165895 90717191 91049910 91265428
1527.7 91265428 91386348 91410428 91381210 91395974 91369605 91153479 90830213 90531909 90187442 89776295
1548.1 89776295 89314198 88944143 88753885 88726586 88922727 89321643 89574558 89648616 89531887 88997787
1568.5 88997787 87982923 86787170 84377092 79590607 76947767 79342109 83403307 85149556
1584.8 85149556 84367085 81980020 77592522 71924621 68868792 72199899 79619354 85744148 88527298
$$ packed form
1450.2D3570209P08147L799981J843155j054988J886589N774534P496178N481630K325887
1468.5G1831322R85616O02567L48783J50585N0318N1672R7209Q2671j27482p20584
1488.9G3352677j251299r73540q94696L10386M326856N645931L433483J600397J000714
1507.3H6550909N97525L50094K96533L76600N94646P00801O98787N51296L32719K15518
1527.7I1265428J20920K4080k9218J4764k6369k16126l23266k98304l44467m11147
1548.1H9776295m62097l70055j90258k7299J96141L98916K52915P4058j16729n34100
1568.5H8997787j014864j195753k410078m786485k642840K394342M061198J746249
1584.8H5149556p82471k387065m387498n667901l055829L331107P419455O124794K783150
$$ plain form
1603.2 88527298 89177984 89133817 88978189 88771683 88467288 88038957 87558246 87229258 86897635 86342919
1623.5 86342919 85645330 84903318 84262550 83908683 83745742 83620673 83583868 83527905 83251524 82683879
1643.9 82683879 82114941 82230920 82700825 82658195 81790298 81002188 80222338 79096419 77431023 75568372
1664.3 75568372 73900563 71707880 68460906 65357888 62869370 60538286 57410777 52529746
1680.7 52529746 44551209 33203614 27259216 29604846 37775281 47955456 58505344 68287349
1697 68287349 75925940 83078253 88015682 91320437 94088638 95836675 96855569 97575122 98259211
1715.3 98259211 99040097 99679589 99967688 100000000 99949026 99870980 99785042 99703443 99675560 99738264 99796683
1737.8 99796683 99804759 99817842 99841952 99831384 99789727 99702996 99602187 99510372 99406672 99288136 99157465
$$ packed form
1603.2H8527298O50686m4167j55628k06506l04395m28331m80711l28988l31623n54716
1623.5H6342919o97589p42012o40768l53867j62941j25069l6805n5963k76381n67645
1643.9H2683879n68938J15979M69905m2630q67897p88110p79850j125919j665396j862651
1664.3G5568372j667809k192683l246974l103018k488518k331084l127509m881031
1680.7E2529746p978537j1347595n944398K345630Q170435J0180175J0549888R782005
1697F8287349P638591P152313M937429L304755K768201J748037J018894P19553O84089
1715.3I8259211P80886O39492K88099L2312n0974p8046q5938q1599k7883O2704N8419
1737.8I9796683Q076J3083K4110j0568m1657q6731j00809r1815j03700j18536j30671
$$ plain form
1760.2 99157465 98997396 98826283 98591679 98261899 97894746 97496486 97223055 97149491 97202498 97354937
1780.6 97354937 97608697 97938091 98259193 98462820 98527271 98547840 98631108 98782802 98957282 99095190
1801 99095190 99152923 99149656 99107081 99015564 98860669 98645717 98351198 97966510 97605520 97417343 97442186
1823.4 97442186 97597015 97745651 97860849 98025531 98211569 98335224 98397601 98436350 98456454 98463416 98519433
1845.9 98519433 98622918 98726726 98815054 98885536 98942107 98990315 99030536 99052221 99045545 99000293 98942047
1868.3 98942047 98943532 98988986 98996764 98944092 98848540 98727614 98586768 98413402 98192716 97910124 97586459
1890.7 97586459 97252268 96954298 96842843 97002465 97323376 97626758 97776115 97719479 97511142 97263473
1911.1 97263473 97000259 96673924 96433562 96641225 97302169 98019445 98488325 98673457 98649955 98529959
$$ packed form
1760.2I9157465j60069j71113k34604l29780l67153l98260k73431p3564N3007J52439
1780.6I7354937K53760L29394L21102K03627O4451K0569Q3268J51694J74480J37908
1801I9095190N7733l267m2575r1517j54895k14952k94519l84688l60990j88177K4843
1823.4I7442186J54829J48636J15198J64682J86038J23655O2377L8749K0104O962N6017
1845.9I8519433J03485J03808Q8328P0482N6571M8208M0221K1685o676m5252n8246
1868.3I8942047J485M5454P778n2672r5552j20926j40846j73366k20686k82592l23665
1890.7I7586459l34191k97970j11455J59622L20911L03382J49357n6636k08337k47669
1911.1I7263473k63214l26335k40362K07663O60944P17276M68880J85132k3502j19996
$$ plain form
1931.5 98529959 98429817 98401302 98459572 98588884 98718876 98776221 98754066 98688447 98578125 98373163 98048770
1954 98048770 97642362 97252077 97030216 97069818 97280633 97497189 97645235 97716886 97675776 97459686 97062200
1976.4 97062200 96614164 96320194 96274102 96479106 96917188 97443795 97875339 98173398 98392600 98549503
1996.8 98549503 98625976 98665249 98737890 98861259 99012476 99142462 99216622 99260390 99293983 99301469 99286467
2019.2 99286467 99258810 99192524 99099714 99069494 99106950 99124694 99104625 99088418 99084628 99078518 99085963 99117279
2043.7 99117279 99142039 99142951 99138850 99132305 99107993 99081063 99079657 99093449 99099082 99106318 99126160 99145681 99162227
2070.2 99162227 99190289 99218160 99221915 99214888 99218065 99219495 99213403 99217761 99229640 99230140 99226570 99235815 99243051 99232000
2098.8 99232000 99215609 99201268 99170113 99119860 99076587 99049467 99037862 99058217 99110687 99158448 99180794 99194664
$$ packed form
1931.5I8529959j00142k8515N8270J29312J29992N7345k2155o5619j10322k04962l24393
1954I8048770m06408l90285k21861L9602K10815K16556J48046P1651m1110k16090l97486
1976.4I7062200m48036k93970m6092K05004M38082N26607M31544K98059K19202J56903
1996.8I8549503P6473L9273P2641J23369J51217J29986P4160M3768L3593P486j5002
2019.2I9286467k7657o6286r2810l0220L7456J7744k0069j6207l790o110P445L1316
2043.7I9117279K4760R12m101o545k4312k6930j406J3792N633P236J9842J9521J6546
2070.2I9162227K8062K7871L755p027L177J430o092M358J1879N00l570R245P236j1051
2098.8I9232000j6391j4341l1155n0253m3273k7120j1605K0355N2470M7761K2346J3870
$$ plain form
2123.3 99194664 99213171 99226779 99233943 99249876 99270499 99282575 99297106 99326885 99357420 99376369 99390465 99395823
2147.7 99395823 99382329 99362338 99348336 99327564 99300730 99296081 99317533 99334472 99328870 99312347 99302685 99299401
2172.2 99299401 99295062 99289888 99276322 99250871 99228293 99212193 99189252 99160248 99134457 99106461 99071062 99039590
2196.7 99039590 99014693 98975688 98915535 98855489 98802340 98742592 98691005 98679227 98711497 98778981 98871678 98959082
2221.2 98959082 99007362 99017608 99008775 98979759 98929626 98886377 98868871 98857886 98841697 98834133 98836195 98833132
2245.6 98833132 98818678 98791361 98745984 98696369 98673964 98679274 98683119 98684859 98703665 98731357 98754901 98781365
2270.1 98781365 98803818 98799288 98776037 98760688 98748708 98725325 98702717 98688054 98665756 98633993 98610860 98598552
2294.6 98598552 98581958 98566794 98565924 98566759 98559320 98554105 98543376 98502523 98440504 98391294 98359507 98320961 98265451
$$ packed form
2123.3I9194664J8507J3608P164J5933K0623J2076J4531K9779L0535J8949J4096N358
2147.7I9395823j3494j9991j4002k0772k6834m649K1452J6939n602j6523r662l284
2172.2I9299401m339n174j3566k5451k2578j6100k2941k9004k5791k7996l5399l1472
2196.7I9039590k4897l9005o0153o0046n3149n9748n1587j1778L2270O7484R2697Q7404
2221.2I8959082M8280J0246q833k9016n0133m3249j7506j0985j6189p564K062l063
2245.6I8833132j4454k7317m5377m9615k2405N310L845J740J8806K7692K3544K6464
2270.1I8781365K2453m530k3251j5349j1980k3383k2608j4663k2298l1763k3133j2308
2294.6I8598552j6594j5164q70Q35p439n215j0729m0853o2019m9210l1787l8546n5510
$$ plain form
2321.1 98265451 98205882 98186249 98249745 98351449 98380858 98294324 98137420 97957492 97787762 97683537 97698283
2343.5 97698283 97813290 97966766 98124522 98272544 98387766 98453319 98490906 98521101 98530298 98519725 98494387
2366 98494387 98436487 98356700 98285556 98231673 98185104 98143363 98109937 98076946 98038512 98002332 97972256 97939450
2390.4 97939450 97901708 97864449 97820383 97759956 97689867 97616208 97533226 97445589 97371447 97320640 97291487 97280437
2414.9 97280437 97282392 97292000 97308522 97331488 97352940 97364694 97366822 97360528 97344631 97318029 97280771 97237331
2439.4 97237331 97192782 97146785 97101957 97060376 97013724 96951389 96867889 96766853 96659839 96561724 96483201
2461.8 96483201 96425778 96393430 96396184 96430224 96477222 96520919 96548021 96555936 96550894 96535426 96512485 96483219
2486.3 96483219 96448004 96414506 96391672 96383053 96388203 96403909 96425766 96451360 96477354 96500021 96515387 96514267
$$ packed form
2321.1I8265451n9569j9633O3496J01704K9409q6534j56904j79928j69730j04225J4746
2343.5I7698283J15007J53476J57756J48022J15222O5553L7587L0195R197j0573k5338
2366I8494387n7900p9787p1144n3883m6569m1741l3426l2991l8434l6180l0076l2806
2390.4I7939450l7742l7259m4066o0427p0089p3659q2982q7637p4142n0807k9153j1050
2414.9I7280437J955R608J6522K2966K1452J1754K128o294j5897k6602l7258m3440
2439.4I7237331m4549m5997m4828m1581m6652o2335q3500j01036j07014r8115p8523
2461.8I6483201n7423l2348K754L4040M6998M3697K7102P915n042j5468k2941k9266
2486.3I6483219l5215l3498k2834q619N150J5706K1857K5594K5994K2667J5366j120
$$ plain form
2510.8 96514267 96493411 96463817 96438098 96422404 96422666 96445400 96480095 96505666 96518880 96529490 96543717 96563244
2535.3 96563244 96583068 96593362 96591651 96586955 96586961 96589166 96592242 96600682 96609825 96613640 96620119 96635109 96647954 96649140
2563.8 96649140 96641457 96622539 96585870 96542865 96514446 96500331 96487224 96482283 96498054 96520907 96532851 96540797
2588.3 96540797 96563768 96605682 96652496 96693629 96720272 96722108 96703464 96679848 96667862 96685940 96736401 96789980
2612.8 96789980 96825773 96858853 96901804 96941006 96964610 96972722 96964431 96948129 96946651 96968079 96994567 97015333
2637.2 97015333 97035629 97058326 97084141 97112221 97134638 97143632 97148949 97172421 97214878 97255820 97284955 97302479
2661.7 97302479 97307640 97301626 97291291 97284001 97281706 97285807 97300756 97326291 97349620 97358072 97353935 97346926 97345394
2688.2 97345394 97350401 97355849 97359604 97366798 97381485 97400683 97417593 97428262 97431618 97425103 97405446 97376698 97344255
$$ packed form
2510.8I6514267k0856k9594k5719j5694K62K2734L4695K5571J3214J0610J4227J9527
2535.3I6563244J9824J0294j711m696OK205L076Q440R143L815O479J4990J2845J186
2563.8I6649140p683j8918l6669m3005k8419j4115j3107m941J5771K2853J1944P946
2588.3I6540797K2971M1914M6814M1133K6643J836j8644k3616j1986J8078N0461N3579
2612.8I6789980L5793L3080M2951L9202K3604Q112q291j6302j478K1428K6488K0766
2637.2I7015333K0296K2697K5815K8080K2417Q994N317K3472M2457M0942K9135J7524
2661.7I7302479N161o014j0335p290k295M101J4949K5535K3329Q452m137p009j532
2688.2I7345394N007N448L755P194J4687J9198J6910J0669L356o515j9657k8748l2443
$$ plain form
2714.7 97344255 97305530 97265154 97237015 97224152 97220141 97217894 97212791 97203839 97184199 97154212 97137922 97150040
2739.2 97150040 97173464 97188526 97193527 97191685 97180301 97156346 97124666 97096008 97078228 97067237 97053784 97040617
2763.7 97040617 97029579 97013265 96994877 96986985 96993655 97008443 97022712 97027457 97018445 97002512 96985430 96966195
2788.2 96966195 96942598 96911353 96870983 96817106 96746171 96674407 96626353 96610105 96616375 96626645 96623695 96601480
2812.6 96601480 96566725 96528339 96487957 96447283 96413803 96394098 96388227 96396565 96415997 96426904 96418977 96411401
2837.1 96411401 96412325 96399558 96357608 96294701 96225697 96158159 96097428 96049267 96010035 95977837 95957953 95943564
2861.6 95943564 95917314 95872802 95820248 95768267 95719796 95678949 95640177 95589924 95523530 95449710 95374608 95286047
2886.1 95286047 95174515 95059246 94959575 94870043 94799757 94766742 94744015 94696134 94629294 94552910 94457471
$$ packed form
2714.7I7344255l8725m0376k8139j2863m011k247n103q952j9640k9987j6290J2118
2739.2I7150040K3424J5062N001j842j1384k3955l1680k8658j7780j0991j3453j3167
2763.7I7040617j1038j6314j8388p892O670J4788J4269M745r012j5933j7082j9235
2788.2I6966195k3597l1245m0370n3877p0935p1764m8054j6248O270J0270k950k2215
2812.6I6601480l4755l8386m0382m0674l3480j9705n871Q338J9432J0907p927p576
2837.1I6411401R24j2767m1950o2907o9004o7538o0731m8161l9232l2198j9884j4389
2861.6I5943564k6250m4512n2554n1981m8471m0847l8772n0253o6394p3820p5102q8561
2886.1I5286047j11532j15269r9671q9532p0286l3015k2727m7881o6840p6384r5439
$$ plain form
2908.5 94457471 94346005 94233727 94124258 94017094 93917590 93823230 93722707 93617761 93518639 93420178
2928.9 93420178 93313044 93202949 93097913 93003380 92930639 92873824 92793888 92665625 92517358 92399949
2949.3 92399949 92335749 92307639 92289639 92264515 92222917 92172623 92124140 92069733 92000484 91924840 91847718 91752934
2973.8 91752934 91635913 91528803 91452861 91384357 91305399 91226691 91146749 91049725 90921181 90737629 90469003
2996.2 90469003 90094656 89616728 89072251 88546985 88148534 87921506 87820226 87750202 87582785 87181956
3016.6 87181956 86515784 85794771 85419732 85592324 86053210 86362618 86202496 85455012 84325665 83351159
3037 83351159 83132076 83889002 85189492 86296791 86984980 87634528 88349825 88736892 88573855 88015825
3057.4 88015825 87301517 86551231 85781908 85137624 84992617 85721487 87324792 89211297 90668565
$$ packed form
2908.5I4457471j11466j12278j09469j07164r9504r4360j00523j04946r9122r8461
2928.9I3420178j07134j10095j05036r4533p2741n6815p9936j28263j48267j17409
2949.3I2399949o4200k8110j8000k5124m1598n0294m8483n4407o9249p5644p7122r4784
2973.8I1752934j17021j07110p5942o8504p8958p8708p9942r7024j28544j83552k68626
2996.2I0469003l74347m77928n44477n25266l98451k27028j01280p0024j67417m00829
3016.6H7181956o66172p21013l75039J72592M60886L09408j60122p47484j129347r74506
3037H3351159k19083P56926J300490J107299O88189O49548P15297L87067j63037n58030
3057.4H8015825p14308p50286p69323o44284j45007P28870J603305J886505J457268
$$ plain form
3075.7 90668565 91487187 91802174 91721094 91350895 90969473 90955460 91398221 91959429 92277718 92273402
3096.1 92273402 92080331 91941929 92071146 92431253 92795599 93036628 93189114 93331081 93489426 93621147
3116.5 93621147 93682986 93680924 93651456 93624794 93610162 93602979 93583673 93539143 93489039 93462616 93452466 93424284
3141 93424284 93379515 93345380 93327790 93324298 93330187 93325728 93299717 93264091 93216431 93137372 93032491 92946249
3165.5 92946249 92920995 92939442 92950350 92934287 92903268 92873472 92848963 92812878 92752159 92681932 92629880 92609119
3189.9 92609119 92607749 92597878 92557192 92488366 92412615 92341900 92274523 92208278 92142761 92081070 92020756 91952896
3214.4 91952896 91880864 91810405 91736382 91656476 91574550 91491801 91412473 91349977 91294926 91207731 91088974
3236.9 91088974 90979391 90888870 90809762 90746933 90686065 90601337 90506136 90428591 90359294 90271580 90164685
$$ packed form
3075.7I0668565Q18622L14987q1080l70199l81422j4013M42761N61208L18289m316
3096.1I2273402j93071j38402J29217L60107L64346K41029J52486J41967J58345J31721
3116.5I3621147O1839k062k9468k6662j4632p183j9306m4530n0104k6423j0150k8182
3141I3424284m4769l4135j7590l492N889m459k6011l5626m7660p9059j04881q6242
3165.5I2946249k5254J8447J0908j6063l1019k9796k4509l6085o0719p0227n2052k0761
3189.9I2609119j370r871m0686o8826p5751p0715o7377o6245o5517o1691o0314o7860
3214.4I1952896p2032p0459p4023p9906q1926q2749p9328o2496n5051q7195j18757
3236.9I1088974j09583r0521p9108o2829o0868q4728r5201p7545o9297q7714j06895
$$ plain form
3259.3 90164685 90054590 89955974 89893854 89887285 89910406 89903700 89848822 89775884 89701331 89631778 89576381 89533716
3283.8 89533716 89491725 89444274 89401364 89355606 89283967 89185447 89071321 88955134 88856709 88776815 88678366
3306.2 88678366 88534772 88369381 88211167 88060969 87907034 87745470 87583399 87425923 87260199 87064850
3326.6 87064850 86844474 86616594 86381888 86136049 85873324 85577202 85234624 84839976 84380138 83856744
3347 83856744 83302033 82764089 82322627 82075459 82045621 82123715 82169521 82147723 82101035 82043457 81945902
3369.4 81945902 81790549 81580442 81329852 81065971 80805188 80548763 80301499 80068535 79848635 79635811
3389.8 79635811 79424220 79216737 79026049 78860205 78703064 78522456 78320086 78138387 77991796 77854890
3410.2 77854890 77710968 77558690 77412796 77291429 77185911 77086735 77004111 76947951 76908630 76865488 76834244
$$ packed form
3259.3I0164685j10095r8616o2120o569K3121o706n4878p2938p4553o9553n5397m2665
3283.8H9533716m1991m7451m2910m5758p1639r8520j14126j16187r8425p9894r8449
3306.2H8678366j43594j65391j58214j50198j53935j61564j62071j57476j65724j95349
3326.6H7064850k20376k27880k34706k45839k62725k96122l42578l94648m59838n23394
3347H3856744n54711n37944m41462k47168k9838P8094M5806k1798m6688n7578r7555
3369.4H1945902j55353k10107k50590k63881k60783k56425k47264k32964k19900k12824
3389.8G9635811k11591k07483j90688j65844j57141j80608k02370j81699j46591j36906
3410.2G7854890j43922j52278j45894j21367j05518r9176q2624n6160l9321m3142l1244
$$ plain form
3432.7 76834244 76830864 76812387 76751745 76692909 76682955 76718169 76767391 76821136 76891488 76978397 77079594 77203476
3457.1 77203476 77342427 77467489 77597290 77779305 77987939 78147590 78246903 78353602 78510123 78703904
3477.5 78703904 78887981 79029417 79170448 79344523 79518801 79681432 79853541 80036038 80224091 80412936
3497.9 80412936 80595690 80771571 80940336 81104279 81272584 81468463 81703138 81934202 82129806 82312363
3518.3 82312363 82503784 82708681 82904857 83078659 83266079 83490860 83733124 83974874 84202802 84420848
3538.7 84420848 84661365 84914333 85138404 85336679 85544324 85758013 85967070 86190224 86427587 86665875
3559.1 86665875 86902046 87114513 87286806 87494224 87795383 88099390 88354743 88603455 88877606 89174521
3579.5 89174521 89489037 89792138 90030587 90239227 90527058 90842849 91116500 91391152 91691780 91983503
$$ packed form
3432.7G6834244l380j8477o0642n8836r954L5214M9222N3745P0352Q6909J01197J23882
3457.1G7203476J38951J25062J29801J82015K08634J59651R9313J06699J56521J93781
3477.5G8703904J84077J41436J41031J74075J74278J62631J72109J82497J88053J88845
3497.9H0412936J82754J75881J68765J63943J68305J95879K34675K31064J95604J82557
3518.3H2312363J91421K04897J96176J73802J87420K24781K42264K41750K27928K18046
3538.7H4420848K40517K52968K24071J98275K07645K13689K09057K23154K37363K38288
3559.1H6665875K36171K12467J72293K07418L01159L04007K55353K48712K74151K96915
3579.5H9174521L14516L03101K38449K08640K87831L15791K73651K74652L00628K91723
$$ plain form
3599.9 91983503 92269170 92544687 92766833 92965162 93201458 93459326 93723863 93966591 94165844 94408536
3620.3 94408536 94707167 94962984 95105761 95169890 95346552 95607477 95829350 96010166 96164405 96306485
3640.7 96306485 96448308 96549875 96531695 96417689 96429890 96592915 96773994 96998811 97277832 97492182
3661.1 97492182 97613221 97700500 97733200 97684741 97696620 97745436 97707427 97754180 97909206 98049343 98171175
3683.5 98171175 98269755 98301125 98277348 98325402 98456252 98579490 98647404 98647165 98626608 98676389 98758507 98766398
3708 98766398 98657423 98546225 98591703 98712325 98798716 98833680 98838323 98844635 98895097 98995888 99068737 99054688
3732.5 99054688 98995441 99013329 99133438 99220157 99139649 98981422 98985356 98986685 98887110 98923761 99075478
3754.9 99075478 99169666 99204469 99269855 99341565 99361473 99354345 99339104 99352175 99412864 99466825 99474782 99449468
$$ packed form
3599.9I1983503K85667K75517K22146J98329K36296K57868K64537K42728J99253K42692
3620.3I4408536K98631K55817J42777O4129J76662K60925K21873J80816J54239J42080
3640.7I6306485J41823J01567j8180j14006J2201J63025J81079K24817K79021K14350
3661.1I7492182J21039Q7279L2700m8459J1879M8816l8009M6753J55026J40137J21832
3683.5I8171175R8580L1370k3777M8054J30850J23238O7914k39k0557M9781Q2118P891
3708I8766398j08975j11198M5478J20622Q6391L4964M643O312N0462J00791P2849j4049
3732.5I9054688n9247J7888J20109Q6719q0508j58227L934J329r9575L6651J51717
3754.9I9075478R4188L4803O5386P1710J9908p128j5241J3071O0689N3961P957k5314
$$ plain form
3779.4 99449468 99440581 99442637 99444216 99474394 99518168 99542856 99525589 99477148 99455971 99412775 99339890 99361569
3803.9 99361569 99379855 99363786 99412811 99467927 99436128 99349636 99313366 99256074 99214071 99284393 99366128 99433786
3828.3 99433786 99486405 99517459 99545634 99522501 99458283 99464184 99525064 99591792 99662131 99708784 99640137 99393862
3852.8 99393862 99294621 99458534 99595195 99615043 99560183 99533975 99548542 99511647 99470967 99484181 99516279
3875.2 99516279 99534166 99478585 99415958 99393117 99344981 99336398 99351770 99346179 99410915 99515539 99548584 99508834
3899.7 99508834 99459779 99449897 99522465 99634522 99706459 99737424 99742395 99716669 99699664 99728400 99765593 99778283
3924.2 99778283 99799800 99830294 99820966 99801272 99827516 99869245 99891829 99892920 99888176 99908400 99933392 99943978
3948.7 99943978 99968135 100000000 100014448 100019586 100024402 100020361 100017500 100029051 100041926 100046086 100041461 100029504 100017560
$$ packed form
3779.4I9449468q887K056J579L0178M3774K4688j7267m8441k1177m3196p2885K1679
3803.9I9361569J8286j6069M9025N5116l1799q6492l6270n7292m2003P0322Q1735O7658
3828.3I9433786N2619L1054K8175k3133o4218N901O0880O6728P0339M6653o8647k46275
3852.8I9393862r9241J63913J36661J9848n4860k6208J4567l6895m0680J3214L2098
3875.2I9516279J7887n5581o2627k2841m8136q583J5372n591O4736J04624L3045l9750
3899.7I9508834m9055r882P2568J12057P1937L0965M971k5726j7005K8736L7193J2690
3924.2I9778283K1517L0494r328j9694K6244M1729K2584J091m744K0224K4992J0586
3948.7I9943978K4157L1865J4448N138M816m041k861J1551J2875M160m625j1957j1944
$$ plain form
3975.2 100017560 100011277 100011170 100016391 100025415 100031865 100028646 100017762 100007737 100003529 99996829 99983269
3997.6 99983269
$$ packed form
3975.2A00017560o283j07N221R024O450l219j0884j0025m208o700j3560
3997.6I9983269
##END=$$ End of the data block
