##TITLE=$$ Begin of the data block
##JCAMP-DX=5.00 $$ ACD/SpecManager v 10.08
##SPECTROMETER/DATA SYSTEM=Varian
##DATE=21 Jan 2013 15:14:30
##DATA TYPE=INFRARED SPECTRUM
##DATA CLASS=XYDATA
##ORIGIN=
##OWNER=
##NPOINTS=3735
##FIRSTX=399.26403809
##LASTX=4000.35498047
##MAXX=4000.35498047
##MINX=399.26403809
##MAXY=79.09320068
##MINY=7.86283207
##XFACTOR=1.0000000000
##YFACTOR=0.000000100000000
##FIRSTY=74.35198975
##DELTAX=0.96440572
##XUNITS=1/CM
##YUNITS=TRANSMITTANCE
##XYDATA=(X++(Y..Y))
399.3G43519897o806716j3232346J4694977J384353N136414m88129m875793L985138
407G43317795J306686O973801j8265762J231765l219833L216019J9416656m663391
414.7G49313736O00128n201111P415772k808533j5322189P349701L713989R784393
422.4G54845886n632858l58276j1662903l607407r55887j438675P624054q55789R824219
431.1G47782364p07398l090057r598160o027755L517684o634140Q035279M559555N026703
439.8G42864075n03846m255676p313461p170258K489319l419876J2141953N023498
447.5G39855728K126084r26514q044739L301621l199845j472626n312194R567337J0719833
456.2G46614685J625824M138260j1143265j303940n050125L846665k114182K700882
$$ plain form
399.3 743519897 736713181 723480835 738175812 739560165 744696579 744208450 739332657 743317795
407 743317795 744624481 751598282 733332520 734564285 731344452 734560471 753977127 749313736
414.7 749313736 749913864 744712753 752128525 749319992 733997803 741347504 745061493 754845886
422.4 754845886 749213028 748854752 737191849 733584442 732628555 731189880 738813934 737958145 747782364
431.1 747782364 747074966 743984909 734386749 728358994 731876678 725242538 733277817 737837372 742864075
439.8 742864075 742360229 738104553 730791092 723620834 726110153 722690277 734832230 739855728
447.5 739855728 741981812 741055298 733010559 736312180 733112335 731639709 726327515 735894852 746614685
456.2 746614685 748240509 752378769 741235504 739931564 734881439 738728104 736613922 739314804
463.9G39314804J2209473M136734O149139j5569839p373581q907166o711654K860794
471.6G26108704l104172J4883041L303070K641449o985779q676681p737427p177505
479.3G13254700P167511M329223Q204193R07135J84784p254181j0329818n265961q490753
488G02706833M977112L900757O936340P719498K2201j0515594j5501404m696274q154526
496.7F87394943l644714q151703k657089M645386q40302J0692062N769043P045670
504.4G00253296N587234O397324J1267166Q174896P888718j378937r24606p375565
512.1G29889526p030487m065246j255799J52741l057022M011993n417099q100052r485550
520.8F95643005m544906J646652K889404R627838N377427O328735p19986k579346j076202
$$ plain form
463.9 739314804 751524277 755661011 761810150 746240311 738866730 729959564 723247910 726108704
471.6 726108704 723004532 737887573 741190643 743832092 736846313 728169632 720432205 713254700
479.3 713254700 720422211 724751434 732955627 733862762 734047546 726793365 716463547 711197586 702706833
488 702706833 707683945 711584702 718521042 726240540 726262741 715747147 700245743 695549469 687394943
496.7 687394943 683750229 675598526 672941437 677586823 676746521 687438583 693207626 700253296
504.4 700253296 705840530 712237854 723505020 731679916 739568634 738189697 737265091 729889526
512.1 729889526 722859039 718793793 717537994 717690735 714633713 718645706 713228607 705128555 695643005
520.8 695643005 691098099 692744751 695634155 705261993 710639420 716968155 716248169 713668823 712592621
529.5G12592621l594513J603470K355041O401139N475921Q330841M550095l263550
537.2G34451065m514236q929367k078782k029190K637558N103760R33762q26721q296967
545.9G16450882q563843q940811m308777k923813K667237J0740661Q400879O610413
553.6G20132828J729278K182160r16901L80631L271789N014267Q786163K906495L87725
562.3G43874435n444336m049072l700790m829254j437531J845551P732467R58481p79037
570.9G34170914n048752p888260o870194q437500m887161o545868k69928j616058n014343
579.6F87592850n214310q800125n172958k226639L534393O760941R972992P542343
587.3F93989487J114196j600265m475403L26233J807632N841446P565461P473831P936706
$$ plain form
529.5 712592621 708998108 710601578 712956619 719357758 724833679 733164520 737714615 734451065
537.2 734451065 729936829 721007462 718928680 716899490 719537048 724640808 725574570 724747849 716450882
545.9 716450882 707887039 698946228 694637451 691713638 694380875 705121536 713522415 720132828
553.6 720132828 721862106 724044266 723127365 723507996 726779785 731794052 740580215 743486710 743874435
562.3 743874435 738430099 734381027 730680237 725850983 724413452 726259003 733991470 734949951 734170914
570.9 734170914 729122162 721233902 714363708 705926208 701039047 694493179 694223251 692607193 687592850
579.6 687592850 682378540 673578415 668405457 666178818 669713211 676474152 686447144 693989487
587.3 693989487 695103683 693503418 689028015 689354248 691161880 697003326 704568787 712042618 719979324
596G19979324L576355J873703n335312o681289n213547l65982M473038L928756O730805
604.7G22965851K697830n39932m664307m859695m053650l876496J327439K305679M414520
613.4G15717239J104203m45176m713287r418487q347779q087463j585617L630447J2528458
622G00382538J4426040Q026658K248077m240875k665787l427811j217651L12653M399566
630.7G18243408N476151n81131j395951n825576n375214m213943k439805p52258J363449
639.4G04499130L538056k722245l713531o635742p695465o954728n340499m110260
647.1F70864716o440659O044998K1934738K2101212P623367k26898K92282k120895
654.8G20072861J034393j439896m569397j1261978j3725204r681092l935546K313690
$$ plain form
596 719979324 723555679 725429382 720094070 713412781 708199234 707833252 712306290 716235046 722965851
604.7 722965851 725663681 725123749 720459442 715599747 711546097 707669601 708997040 711302719 715717239
613.4 715717239 716821442 716376266 711662979 702244492 693896713 685809250 684223633 687854080 700382538
622 700382538 714808578 722835236 725083313 720842438 718176651 714748840 713531189 713843842 718243408
630.7 718243408 723719559 723138428 721742477 715916901 710541687 706327744 703887939 703135681 704499130
639.4 704499130 708037186 705314941 701601410 694965668 687270203 680315475 674974976 670864716
647.1 670864716 664424057 670469055 692403793 714505005 722128372 721901474 722193756 720072861
654.8 720072861 721107254 719667358 715097961 703835983 690110779 680429687 676494141 678807831
662.5F78807831J776886M492111O501083P925034Q800354J6297073K8153q409043k776260
671.2G13443222j516342r26666m78363k951661o553878j6331940k3781128l4759369
678.9F26143875m1334610m3935737m2142983l0396500j0677414J8928032M5296288
685.7E21880951N9760437N4617081L8517685K3737945J0108338L112335l902741n730743
693.4G02101288l821945N263443J0529632Q184281O911010M046326N261231L037567
701.1G41512833K290802j895447q745346j2119446j4793625j3628845j3661499l223267
708.8F75736160J0955887K2894821K4656296J3024292O151886j74179o30112M17633
716.6G53032684L735123O632309O404114O156845j475449k625885n577698n663452
$$ plain form
662.5 678807831 680584717 685076828 691577911 699502945 708303299 724600372 724628525 716219482 713443222
671.2 713443222 711926880 711000214 710521851 707570190 701016312 684684372 660903244 626143875
678.9 626143875 584809265 540873528 498730545 468334045 457656631 476584663 521880951
685.7 521880951 581641388 636258469 674776154 698514099 708622437 711734772 707832031 702101288
693.4 702101288 698279343 703542786 714072418 722256699 729167709 733214035 738475266 741512833
701.1 741512833 743803635 741908188 733162842 721043396 706249771 692620926 678959427 675736160
708.8 675736160 686692047 709586868 734243164 747267456 753419342 753245163 752615051 753032684
716.6 753032684 756767807 763400116 769804230 775961075 774485626 771859741 766282043 760618591
724.3G60618591k423401Q45032O371460M944534M833680p67594n497818p576904p446899
733G53900681k042695J503449O414108P370835P996978L241043k067108m547958p002411
741.6G64766922m034576k836228K567673M753647L649521o30722p383194j1300583
749.3G49552460j6791992j6167374j7268677j2336197M70810J0298844J0566253K957459
757.1G11281586J76468l372651k003936R40246K356339M264831L013840J488037m348678
765.7G13796082q054429j3047103j1958847p67975R645843J3684616R144364N443420
773.5G17885971r86252n911636r600906j2487336j0926590r394607n678101m608764
781.2F58291779k352829Q34198P894363J2639389Q430862N567093J219178J022796
$$ plain form
724.3 760618591 758195190 759040222 765411682 770356216 775189896 774422302 768924484 761347580 753900681
733 753900681 751857986 753361435 759775543 767146378 775143356 778384399 776317291 771769333 764766922
741.6 764766922 760732346 757896118 760463791 765217438 768866959 768236237 760853043 749552460
749.3 749552460 732760468 716593094 699324417 686988220 687459030 697757874 708324127 711281586
757.1 711281586 711458054 708085403 706081467 707021713 709378052 713642883 716656723 718144760 713796082
765.7 713796082 705741653 692694550 680735703 679967728 689613571 703298187 712442551 717885971
773.5 717885971 716899719 710988083 701387177 688899841 677973251 668578644 662900543 658291779
781.2 658291779 655938950 656773148 664667511 677306900 685737762 691304855 692524033 693546829
788.9F93546829R7046j589203l462829p078705o881943o785889l391876k115402P30286
797.6F63068314K494583J293335M01382j6098N857620N667572M085160K850647K612991
806.2F88315506L719864P06177J487960Q37250j88598o226960j1040954j3066864j5188065
814.9F49355316j4213829j7214279j2553406j360779O767807R27353j2624130j6878242
822.6E82205811m043465K0875473K8075333K2203178J4051514N992584L232879j343307
830.4F71250000r68933J17493M086837P050476R021683R038696L466950K729416j117478
839G04675140j728286q82340J177750N081939N268403M702148k72827k635574n568696
847.7G09817657l388366j61743M47158M254532M813996N221710M03595l049622n528106
$$ plain form
788.9 693546829 693643875 692054672 688591843 681513138 674631195 667845306 664453430 662338028 663068314
797.6 663068314 665562897 666856232 667257614 667241516 673099136 678766708 682851868 685702515 688315506
806.2 688315506 692035370 692741547 694229507 695066757 694878159 688651199 677610245 664543381 649355316
814.9 649355316 635141487 617927208 605373802 604013023 610780830 611708183 599084053 582205811
822.6 582205811 578162346 599037819 627113152 649316330 663367844 669360428 672593307 671250000
830.4 671250000 670281067 670398560 674485397 681535873 690557556 699596252 703063202 705792618 704675140
839 704675140 702946854 702064514 703242264 708324203 713592606 718294754 718021927 715386353 709817657
847.7 709817657 706429291 706267548 706714706 710969238 715783234 721004944 721408539 718358917 712830811
856.4G12830811n885849l433457k584991R11789p13196o53534k206421l549957k890015
865.1F91825180k351608J063385Q07266L981171N540466Q394852R678268O721268N021210
873.8G30681458P45773K952347K734756M374313O704865O091919M971313k61383k048645
882.4G56946716n390091l408126l053895j614303L577347M813690N048447j558152
890.2G55361633k451248l635864m547806k339630K13013M998397M349366N541763J282425
898.8G58772049k465820m852982o881943l375625j003189L903961L786621M307632
906.5G52190704J264115l379059m540558p680893n361557m723358j108246l45840l170624
915.2G23144684o925430j3367310j7130051k3460769k4772034k3834686j8330994q527069
$$ plain form
856.4 712830811 706944962 703511505 700926514 701838303 701125107 700471573 698265152 694715195 691825180
865.1 691825180 689473572 690536957 691344223 695325394 700865860 709260712 718938980 725660248 730681458
873.8 730681458 731427231 734379578 737114334 741488647 748193512 754285431 759256744 758995361 756946716
882.4 756946716 751556625 748148499 745094604 743480301 747057648 751871338 756919785 755361633
890.2 755361633 752910385 749274521 744726715 742387085 742600098 747598495 751947861 757489624 758772049
898.8 758772049 756306229 751453247 744571304 741195679 740192490 744096451 747883072 752190704
906.5 752190704 753454819 750075760 745535202 737854309 732492752 727769394 726661148 726315308 723144684
915.2 723144684 716219254 702851944 685721893 662261124 637489090 613654404 595323410 586796341
922.9E86796341J960030J2719345J7705383J9021378J4355201J1163788J0276566R077072
930.7F83075104J0393448J0407028J2267074R224244N652847J948318P5302N09797
938.4G33553162O80618M667969M102401M936905L127747j25504k507171n332718m096756
947.1G39006653l151703J412125K455444L154449J763382k258758l906861o608581
954.8G31866150n192566m951782j555863k78320k32239K14539m165421n866546q825684
963.4G01012268q494797q263168o893311m411544J768798J0169068N437698j10855
971.2F90214157o028290q637771p848206p869568l753051j383744L086014N241928
978.9F63021469P313461P310028N894242P277527O243896R210663Q679733P814255
$$ plain form
922.9 586796341 588756371 601475716 619181099 638202477 652557678 663721466 673998032 683075104
930.7 683075104 693468552 703875580 716142654 725366898 731019745 732968063 733043365 733553162
938.4 733553162 734233780 738901749 743004150 747941055 751068802 750943298 748436127 743103409 739006653
947.1 739006653 735854950 737267075 739722519 742876968 744640350 742381592 738474731 731866150
954.8 731866150 726673584 721721802 720165939 719887619 719655380 719869919 715704498 709837952 701012268
963.4 701012268 692517471 684254303 677360992 672949448 674718246 684887314 690325012 690214157
971.2 690214157 684185867 675548096 667699890 659830322 656077271 654693527 657779541 663021469
978.9 663021469 670334930 677644958 683539200 690816727 697060623 706271286 714951019 722765274
986.6G22765274M751053J00937k279740o193237m664993l834152R6283R22317m46472
995.3G11217270j040192n746307q316193j1230545j0722351j1025543r202118q024368
1003F45909653j0256043j1729622j4817772j3983268j3092308j0256615p340317l810615
1010.7E60623093K748413Q805999J4991417J6979294J7429276J4700508J1264267R243393
1018.4F56785660Q488464J1055222Q920440Q444138N134582J909409j215057m260254
1026.1F95262604k843476l357620P94068J616363K720108J683884j776047l502502
1033.8F90597382o916199m782028n060654j452103k33459j40000J316376k836838m233474
1042.5F66259003p659073n515671l562698p65686K245559L66822J63421l032684m329529
$$ plain form
986.6 722765274 727516327 727617264 725337524 719144287 714479294 710645142 710741425 711663742 711217270
995.3 711217270 710177078 704430771 696114578 684884033 674161682 663136139 653934021 645909653
1003 645909653 635653610 623923988 609106216 595122948 582030640 571774025 564433708 560623093
1010.7 560623093 563371506 572177505 587168922 604148216 621577492 636278000 647542267 656785660
1018.4 656785660 665274124 676329346 685249786 693693924 698828506 700737915 699522858 695262604
1026.1 695262604 692419128 689061508 689855576 691471939 694192047 695875931 694099884 690597382
1033.8 690597382 683681183 678899155 673838501 672386398 672152939 672012939 673329315 670492477 666259003
1042.5 666259003 658599930 653084259 649521561 648755875 651001434 651368256 651531677 648498993 644169464
1051.2F44169464r565430j0188484q606491p840729l707542l529701j409264n407524
1058.9E93914299p897530q865738j2345657j3881874j5248222j3186455j3436852j5022926
1066.6D94029045j9991531k0876885j7828216j8067551j9147034j8700866j4855500
1073.4C64561462q777351j783333M59709l54461r04427J261215P246285J2814102J8778725
1082.1C93301926K6848106L5042114L8280411L3153420K6398048J5596504R048996
1088.8E77669525L402023l95927R36699j03378J129264q32748j3466j12953J83945
1097.5E81862984J560325K541085O079025L740425L797035J260300j880036l978004
1105.2E94983139n970383n219001n939560l181038k991829k099419m261360p520218
$$ plain form
1051.2 644169464 634604034 624415550 615809059 607968330 604260788 600731087 599321823 593914299
1058.9 593914299 586016769 577151031 564805374 550923500 535675278 522488823 509051971 494029045
1066.6 494029045 474037514 453160629 435332413 417264862 398117828 379416962 364561462
1073.4 364561462 355784111 354000778 354460487 354106026 353201599 354462814 361709099 374523201 393301926
1082.1 393301926 420150032 455192146 493472557 526625977 553024025 568620529 577669525
1088.8 577669525 581071548 580675621 581612320 581508942 582638206 581805458 581791992 581679039 581862984
1097.5 581862984 583423309 585964394 592043419 595783844 599580879 600841179 598961143 594983139
1105.2 594983139 589012756 583793755 577854195 574673157 571681328 569581909 565320549 557800331
1112.9E57800331r057312j2204628j1949882j3020783j2091637j3792991j5178681
1119.7D70504417j5443267j7110978j7109947j7007522j4746971j3010865j2091713
1126.4C63983154j3214187j4354973j3121910r952126p184486l774948K208500R266071
1134.1C13855095J6115990K1487197K3300553K3253822K2903176J9356040J2700043
1140.9D52971916P791329O922950R567871J3649674J2062721Q208656K037240k639695
1148.6E10572662p053909j1610603j3046227j4479980j3770714j5901756j6511841
1155.4D18197632j4854851j0669784m633065P33567N516471P720185J0787391J3025742
1163.1D25823288J2210655Q904762K622872k664185q611793j2417832j6769142k0854606
$$ plain form
1112.9 557800331 548743019 536538391 524588509 511567726 499476089 485683098 470504417
1119.7 470504417 455061150 437950172 420840225 403832703 389085732 376074867 363983154
1126.4 363983154 350768967 336413994 323292084 313339958 306155472 302380524 304589024 313855095
1134.1 313855095 329971085 351458282 374758835 398012657 420915833 440271873 452971916
1140.9 452971916 460763245 467686195 477254066 490903740 502966461 511175117 513212357 510572662
1148.6 510572662 503518753 491908150 478861923 464381943 450611229 434709473 418197632
1155.4 418197632 403342781 392672997 388039932 388773499 394289970 402010155 412797546 425823288
1163.1 425823288 438033943 446938705 449561577 446897392 438285599 425867767 409098625 388244019
1170.8C88244019k4723664k9167785l3397084l7397861l8791313l4572544k6597767
1177.5A63596001j8198653j0077695n728131J596031P267495J4264459K1030207K7863407
1185.3B01613121L4056549L6597023L5445461L0344143K3729096J5081520Q948212
1192C85815125O620750M267883R85756j578865l160057j395836K696877P376442J0789642
1200.7D12417717J2938576J4202347J3017349J0832481P602196O768150N870552M809494
1208.4D88458862O091919N619011N795937M376983M407273L358307K131805K783394
1216.1E23023491K019730M006652M246445M583740K688294O14128j23940j717682j138305
1224.8E38202553j705513M85916Q08182P89108k92931k917289l718720n942917n005874
$$ plain form
1170.8 388244019 363520355 334352570 300955486 263557625 224766312 190193768 163596001
1177.5 163596001 145397348 135319653 129591522 131187553 138455048 152719507 173749714 201613121
1185.3 201613121 235669670 272266693 307712154 338056297 361785393 376866913 385815125
1192 385815125 392435875 396703758 397689514 396110649 392950592 391554756 394251633 401628075 412417717
1200.7 412417717 425356293 439558640 452575989 463408470 471010666 477778816 483649368 488458862
1208.4 488458862 494550781 500169792 505965729 510342712 514749985 518108292 520240097 523023491
1216.1 523023491 525043221 529049873 533296318 537880058 540568352 541182480 541058540 539340858 538202553
1224.8 538202553 536497040 536982956 537791138 538580246 538287315 535370026 531651306 525708389 520702515
1233.5E20702515n218659m515838n137864p112350q953781j3649903j6710166k0054474
1241.2D39349480k1124916k1276284k0522041j8603744j4617425j0833396q085785
1247.9C24285889m735165n26619M172688Q887672J4582253K0181884K4569359K6642723
1255.7D18060684K4754639K0642967J4550858O735191K06795n622635n288773m048385
1263.4D69991341l259278p298088j3222389j7946625k1462936k2176590k2086907j9326744
1271.1C43211784j7267532j2858047p953530j284618M573383R380283J2717991J4219170
1278.8C44738884J5791321J7344589J8504601J8142929J7071914J6069031J3060265
1285.5D60723534J0557441Q611412O924782N190964K692871K369461l83072j061287
$$ plain form
1233.5 520702515 515483856 510968018 505830154 498717804 489764023 476114120 459403954 439349480
1241.2 439349480 418224564 396948280 376426239 357822495 343205070 332371674 324285889
1247.9 324285889 319550724 319024105 323196793 332084465 346666718 366848602 391417961 418060684
1255.7 418060684 442815323 463458290 478009148 484744339 484951134 479328499 474039726 469991341
1263.4 469991341 466732063 459433975 446211586 428264961 406802025 384625435 362538528 343211784
1271.1 343211784 325944252 313086205 305132675 303848057 308421440 317801723 330519714 344738884
1278.8 344738884 360530205 377874794 396379395 414522324 431594238 447663269 460723534
1285.5 460723534 471280975 479892387 486817169 492008133 494701004 497070465 496687393 495626106
1293.3D95626106k090111j768341l67660n77774P87735p85179l03307p39784R60464
1301.9D90742149N766220J0670281J5028686J4810181J5127030J1532936R360313O470490
1309.7E79508286J552772r1705m345551l177833n231896l367691k658653m529915m727020
1318.3E52930794r631195r722672j3288116j2997360j4378396j5817985j6057930j9949799
1326D41087341k1265182k5903931k6821976k8453483k9015808k6781082k4078579k0809479
1333.8B37957821j7001400j3545838r965953p470169m562264l242741l460083r64717
1341.5A77744656k655297j065807j444531j29680J658821K796631Q320560J0798283
1349.2A96023636J8212261K0328407K4084607K5601406K4665737K6323967K4010048
$$ plain form
1293.3 495626106 493535995 491767654 491399994 490822220 491609955 490824776 490521469 489781685 490742149
1301.9 490742149 496508369 507178650 522207336 537017517 552144547 563677483 573037796 579508286
1309.7 579508286 581061058 580969353 576623802 573445969 568214073 564846382 562187729 557657814 552930794
1318.3 552930794 543299599 533576927 520288811 507291451 492913055 477095070 461037140 441087341
1326 441087341 419822159 393918228 367096252 338642769 309626961 282845879 258767300 237957821
1333.8 237957821 220956421 207410583 197444630 189974461 185412197 182169456 178709373 177744656
1341.5 177744656 175089359 174023552 172579021 172449341 174108162 176904793 185225353 196023636
1349.2 196023636 214235897 234564304 258648911 284250317 308916054 335240021 359250069
1355.9C59250069K2684211J9447937J7008362J2200814J3540916J7972641K3212509
1362.7D85317459L1012764K0250473J4827881J0181007N314751J163292j696663m266853
1370.4E62104111o906166q722573q528137q410416j0638618j0958328j2623215j3713684
1378.1D81602974j0765648l655624J958961K990570J18904k763366J09100M386253
1385.8D73982124P923432O774292J634597k713851j0060311j4743957j8022881j4111214
1393.6D30662231j3871536p049713P88460M600220O917915N725784J215973q413696
1401.3D20575638j5907326k1771698k3913422l2821617l1191787k3104630k3231354
1408B48633804j8696422j6012650r691181p668304k136002J86329M271908Q326873
$$ plain form
1355.9 359250069 381934280 401382217 418390579 430591393 444132309 462104950 485317459
1362.7 485317459 516330223 536580696 551408577 561589584 566904335 568067627 566370964 562104111
1370.4 562104111 555197945 546475372 537947235 529536819 518898201 507939873 495316658 481602974
1378.1 481602974 470837326 467181702 469140663 472131233 472250137 469486771 469595871 473982124
1385.8 473982124 481905556 488679848 490314445 487600594 477540283 462796326 444773445 430662231
1393.6 430662231 416790695 409740982 410529442 415129662 422047577 427773361 428989334 420575638
1401.3 420575638 404668312 382896614 358983192 326161575 294969788 271865158 248633804
1408 248633804 229937382 213924732 204233551 196565247 194429245 194615574 198887482 207214355
1415.7B07214355J0823803J8111897J4553928L7803727K6477355K1291523K4651146
1422.5C60927734K4422646L2145691J9100876J5817108J0865745M713440R62868q332138
1430.2D60623970o338692p686462m796677k061119K479058P182922J3276253J0269279
1437.9D72948532n77507j523666m826889n244637m063301n810928l316536m407501
1445.6D43177567j283989k078057k673187r58443k795219j613693l989907q58307j724777
1454.3D25201988j246910k036285j1395874o093407j5091133j0716705j0646134j0880470
1462C57095070p652550p761688r500313j2064628o232167n563679o091194j652145
1469.7C00576706o00071N379353J0095977J0797425Q862190J732788j508102p793236
$$ plain form
1415.7 207214355 218038158 236150055 250703983 288507710 314985065 336276588 360927734
1422.5 360927734 385350380 417496071 436596947 452414055 463279800 467993240 468956108 460623970
1430.2 460623970 454285278 446598816 441802139 439741020 442220078 449403000 462679253 472948532
1437.9 472948532 472371025 470847359 466020470 460775833 456712532 450901604 447585068 443177567
1445.6 443177567 441893578 439815521 437142334 436183891 433388672 431774979 427785072 426926765 425201988
1454.3 425201988 423955078 421918793 410522919 404429512 389338379 378621674 367975540 357095070
1462 357095070 349442520 341680832 332180519 320115891 313883724 308320045 302228851 300576706
1469.7 300576706 299976635 305355988 315451965 326249390 335111580 336844368 335336266 327543030
1477.5C27543030p176666r940110p640228l793411k34680N588836P332611R526902
1485.2C21206284J0160942J2551880J3334960N558510P068177J878204N41611P43751
1492.9C73044319L470726O769829Q959808J8135987P233314R329567P872009M090577
1500.6D38906136N53016k971267m993515o680909m457206j8696289j4800377j0449295
1508.3C76410294n97573K000809N438271J4349250K0013695J7121163K1752395K0365029
1516D76853333K5582504K4717445Q372803N672111j319732j822052j1260224q343010
1523.7E18453178j1228866k6917725k3548164j8980065k1204032n327950N197945J8835258
1531.5D35279579K3771935L0907325M3532753J5398446J2573699O684571L839683n382499
$$ plain form
1477.5 327543030 320366364 310426254 302786026 298992615 298757935 304346771 311679382 321206284
1485.2 321206284 331367226 343919106 357254066 362812576 369880753 371758957 372300568 373044319
1492.9 373044319 376515045 383284874 392244682 410380669 417613983 426943550 434815559 438906136
1500.6 438906136 439459152 436487885 431494370 424813461 420356255 401659966 386859589 376410294
1508.3 376410294 375812721 377813530 383251801 397601051 417614746 434735909 456488304 476853333
1516 476853333 502435837 527153282 535526085 541198196 539878464 538056412 526796188 518453178
1523.7 518453178 507224312 480306587 456758423 437778358 416574326 411246376 416444321 435279579
1531.5 435279579 459051514 489958839 533491592 548890038 561463737 568148308 571987991 566605492
1539.2E66605492j2181015m242211j1824913j5942917j2675132j6372338k8318329
1545.9D65048637j5561905j7266387j3619957j3600426j3120613j019440J607132O480446
1553.6C98947487J2734833J3910064R233895R181366K0118599J8577575J2382050M972191
1561.4E00058060L473434J646691J26800l726501m151230n004845p433815q872948
1569.1D76115646k9920921j3886185j3132324j5325928j4638137j3552323j3033294
1575.8C62626534m7316399j7850781k5842952k8792477l0842056l1152516k3486890
1582.6A57342463k6069966j4795170j7045240p903013p268734l859968N56106k328157
1590.3G8628321N982847Q21533O430044L673897P225075P951956O199236J0180139
$$ plain form
1539.2 566605492 554424477 550182266 538357353 522414436 509739304 493366966 465048637
1545.9 465048637 449486732 432220345 418600388 404999962 391879349 390859909 392467041 398947487
1553.6 398947487 411682320 425592384 434826279 444007645 464126244 482703819 495085869 500058060
1561.4 500058060 503531494 505178185 505304985 501578484 497427254 492422409 484988594 476115646
1569.1 476115646 446194725 432308540 419176216 403850288 389212151 375659828 362626534
1575.8 362626534 315310135 297459354 271616402 242823925 211981869 180829353 157342463
1582.6 157342463 131272497 116477327 99432087 91529074 84260340 80400372 80956478 78628321
1590.3 78628321 84611168 85432701 91862745 95536642 102761717 110713673 116912909 127093048
1598A27093048N669575J0033598O592741R183264Q077936R078388J0452957Q234844
1605.7A94416351J3550415J2778683J7099857J8358136K2467212K1212311K2754898
1612.5C22637863K2969475K0509567J6641426J5324135K7919884J0377388J1495209
1619.2D47874947J1293373J3418007J0466728J2425804J5934067P074394P759743L224525
1626.9E29471588O637917J677551L135223K314606K161751L250007r16824J746750
1634.6E49478569j6348000n035247j1473847j4758148j5289154j9941559j9862594
1641.4D46770020k2538491k0098114j7255897r876480r306374j757278J4075012J6244659
1649.1C96257057J9417763J9160080J8038788M0332260M7293053K3970031J2684670
$$ plain form
1598 127093048 132762623 142796221 149388962 158572226 166650162 175728550 186181507 194416351
1605.7 194416351 207966766 220745449 237845306 256203442 278670654 299882965 322637863
1612.5 322637863 345607338 366116905 382758331 398082466 426002350 436379738 447874947
1619.2 447874947 459168320 472586327 483053055 495478859 511412926 518487320 526247063 529471588
1626.9 529471588 536109505 537787056 540922279 543236885 545398636 548648643 547731819 549478569
1634.6 549478569 533130569 528095322 516621475 501863327 486574173 466632614 446770020
1641.4 446770020 424231529 404133415 386877518 377001038 367694664 365937386 380012398 396257057
1649.1 396257057 415674820 434834900 452873688 493205948 540499001 564469032 577153702
1655.9E77153702J6835480J5427551J4398842J5106697J0068588J1644211N828552
1662.6F66463623Q970490K165985K494049L204803J936646P002563Q64945N663910
1670.3F98767014k617112k361145k558899k847213r88236p678604K050324k777710
1678F78988419k267304n475693q504104m087448o238480q54797k5944634k85835k388954
1686.7F22941170o239662q997956j1361809r792556j0483971o313667m350701j243858
1694.4E64156990L317261L705215N623970J728211K897682l383865m452324K557106
1702.1E76150246k77748j58768m362450k691154p198639n662956k844620l657189p39173
1710.8E48557549o63033K818260L391800N284615N563011K329140Q302307Q451652
$$ plain form
1655.9 577153702 593989182 609416733 623815575 638922272 648990860 660635071 666463623
1662.6 666463623 675434113 677600098 680094147 683298950 685235596 692238159 693103104 698767014
1670.3 698767014 696149902 693788757 691229858 688382645 687394409 679715805 681766129 678988419
1678 678988419 676721115 671245422 662741318 658653870 652415390 651560593 625615959 625330124 622941170
1686.7 622941170 616701508 607703552 596341743 586549187 576065216 569751549 565400848 564156990
1694.4 564156990 567474251 571179466 576803436 578531647 581429329 578045464 573593140 576150246
1702.1 576150246 575872498 575713730 571351280 568660126 561461487 555798531 552953911 549296722 548557549
1710.8 548557549 547894516 550712776 554104576 559389191 564952202 567281342 575583649 584035301
1718.5E84035301R346009P461929J0679054J1846352J1967392J3396034R630661J0528030
1726.3F68890762Q905869R216690Q177032J0841904J1554794P532578Q700104N413437
1734G39233170P810058O87866K856751K317581L526917P025527M445038M961014J618958
1742.7G74482880K29416k513962j007538k08054j46866L351288J943207M551315N91965
1751.3G81273651j374283j548462k859649j236496j349411J569977J842193L183823
1759G79501343Q53653k71607k911071m516602K71072j087265Q00324J753616L237839
1767.7G77631302J273193j166153j99661l820343r97009k541962J703873K380905K467956
1776.4G76732101K787095J20086N43671j994248k165679m09623J481171K916107K765732
$$ plain form
1718.5 584035301 593381310 600843239 611522293 623368645 635336037 648732071 658362732 668890762
1726.3 668890762 677796631 687013321 695190353 706032257 717587051 725119629 733819733 739233170
1734 739233170 747043228 747731094 750587845 752905426 756432343 763457870 767902908 772863922 774482880
1742.7 774482880 774712296 772198334 771190796 770982742 770835876 774187164 776130371 780681686 781273651
1751.3 781273651 779899368 778350906 775491257 774254761 772905350 774475327 776317520 779501343
1759 779501343 780354996 780083389 777172318 772655716 772926788 771839523 772639847 774393463 777631302
1767.7 777631302 778904495 777738342 777538681 773718338 772721329 770179367 771883240 774264145 776732101
1776.4 776732101 779519196 779639282 780182953 778188705 776023026 775613403 777094574 780010681 782776413
1785.1G82776413L178406N84793L48587j967926j370850q89740l62320K097473O36826
1793.8G85031662L623886J240387l13492j288070j798783j182327j725998K263412
1801.5G85850677Q20160J911316J611557j53427j301651k994232j320496j063995J447754
1810.2G84807663J202087J581269J811676j8692J81808k143249j035843j370392J69449
1818.8G85185776J762085J781692K202454l78189Q3160j432876k918168j332855L96576
1827.5G85349655K150116J271362J342621l17993L44544j682053k116852j591492q75778
1836.2G83874130J625519J069107K350845Q91495n0430j663742k556534j406479l568802
1844.9G80565109K522583K261658K044754N91354m68979l15780k474976j818390j711654
$$ plain form
1785.1 782776413 785954819 786539612 786888199 784920273 783549423 782659683 782297363 784394836 785031662
1793.8 785031662 788655548 789895935 789582443 788294373 786495590 785313263 783587265 785850677
1801.5 785850677 786670837 788582153 790193710 790040283 788738632 785744400 784423904 783359909 784807663
1810.2 784807663 786009750 787591019 789402695 789384003 789565811 787422562 786386719 785016327 785185776
1818.8 785185776 786947861 788729553 790932007 790553818 790636978 789204102 786285934 784953079 785349655
1827.5 785349655 787499771 788771133 790113754 789795761 790140305 788458252 786341400 784749908 783874130
1836.2 783874130 785499649 786568756 788919601 789811096 789760666 788096924 785540390 784133911 780565109
1844.9 780565109 783087692 785349350 787394104 787985458 787516479 787200699 784725723 782907333 781195679
1853.6G81195679N43289R64355J467362J900635j0224j78833k309646j732636j709442
1862.2G80130539k63367J318436J234894K393722M38690K10267j920319k794647j607056
1870.9G79141159n27115J517792J762619K557449P55768K06757j241455k108155j738357
1879.6G80326462j421356J126937J082535K445755J645432N7373j289597k629242j303863
1888.3G80040436k514649o63833J289749K207565J514359N10635j5945l292847k178040
1896.9G76897430k016296m88052J080169J962509K494355J171036M68673k220688k144241
1905.6G77204895k377930j752777O9351J206894K820893P34329R21326r33152k088775
1914.3G75805054k339249j896973R92356N38101K116547J673736Q75855l66745k534638
$$ plain form
1853.6 781195679 781738968 782703323 784170685 786071320 786061096 785882263 783572617 781839981 780130539
1862.2 780130539 779867172 781185608 782420502 784814224 785252914 785463181 783542862 780748215 779141159
1870.9 779141159 778614044 780131836 781894455 784451904 785207672 785414429 784172974 782064819 780326462
1879.6 780326462 778905106 780032043 781114578 783560333 785205765 785263138 783973541 781344299 780040436
1888.3 780040436 777525787 776861954 778151703 780359268 781873627 782384262 782368317 779075470 776897430
1896.9 776897430 774881134 774393082 775473251 777435760 779930115 781101151 781569824 779349136 777204895
1905.6 777204895 774826965 773074188 773143539 774350433 777171326 777905655 778826981 777893829 775805054
1914.3 775805054 773465805 771568832 772561188 773099289 775215836 776889572 777765427 777398682 774864044
1923G74864044k319259j646042J30691O98090K300873K050781J082001J23748j760101
1931.7G75524826j671600k462006m22363O48117J337585J958924J272659M59900j869202
1940.3G74776840j010055k199250k364196L16772J261292K109069J256485J116944
1948.1G75263901j273804k006454k154007j679230j37558M86603K159729J425399Q93784
1956.7G72978363r92432j697311j554489k130280o39877l35159J277466J519927J545640
1965.4G69971848N35278j420288j442871j926957o51779n1422J480484J569367J136093
1974.1G69199753Q64487j098557j141586k467194j583710o04553M80271J875610J188278
1982.8G66712799J044540j051788j557236j990585j460571l40119N1499J592483J464615
$$ plain form
1923 774864044 772544785 770898743 771029434 771727524 774028397 776079178 777161179 777284927 775524826
1931.7 775524826 773853226 771391220 770968857 771616974 772954559 774913483 776186142 776646042 774776840
1940.3 774776840 773766785 771567535 769203339 769520111 770781403 772890472 774146957 775263901
1948.1 775263901 773990097 771983643 769829636 768150406 768012848 768499451 770659180 772084579 772978363
1956.7 772978363 771985931 770288620 768734131 766603851 765963974 765628815 766906281 768426208 769971848
1965.4 769971848 770507126 769086838 767643967 765717010 765065231 765013809 766494293 768063660 769199753
1974.1 769199753 770064240 768965683 767824097 765356903 763773193 763168640 763648911 765524521 766712799
1982.8 766712799 767757339 766705551 765148315 763157730 761697159 761357040 761408539 763001022 764465637
1991.5G64465637J190109j020431j217423j360168j787186o63376L9826J856613J480103
2000.1G62983704J312637L32718r35440j507645k313766j116333m49295J240844J258545
2008.8G60805969J078644O97784o75964r38873k113877j395492n61524Q92029R90753
2017.5G58779449J082612J695098k08969m99420j728134j024399l96576P859J183013
2026.2G58890533Q83942J422958q5907m16030j344071j543197o14090o00205J067200
2034.9G57661133R77020J233826K37808n74646j071014j691666r48868q06274J032715
2043.5G56050034R42611J092758Q60138l64608q21915j836166q62580j007843N0049
2052.2G54102478R94263J224212R29261m40903m92630j905365j184464o55059l586
$$ plain form
1991.5 764465637 765655746 764635315 763417892 762057724 760270538 759607162 759646988 761503601 762983704
2000.1 762983704 764296341 764629059 763693619 762185974 759872208 758755875 758306580 759547424 760805969
2008.8 760805969 761884613 762582397 761906433 760967560 758853683 757458191 756896667 757788696 758779449
2017.5 758779449 759862061 761557159 761348190 760848770 759120636 758096237 757699661 757707520 758890533
2026.2 758890533 759774475 761197433 761111526 760695496 759351425 757808228 757194138 756593933 757661133
2034.9 757661133 758638153 759871979 760109787 759535141 758464127 756772461 755823593 755017319 756050034
2043.5 756050034 756992645 758085403 758945541 758580933 757759018 755922852 755060272 754052429 754102478
2052.2 754102478 755096741 756320953 757250214 756809311 756316681 754411316 753226852 752571793 752568207
2060.9G52568207R13772N93567J049500j79367o59943j614075j249847m37698m31290
2069.6G50552826K95944N66788J113739k59628k88163j146545j478043l64151n63583
2078.2G48429184P86514N30854O88934k442m33807m63180j430741q40225j356659Q3160
2087.9G45991592P99561J153259J150818n26047r18655j522675p59506q01925N8822
2096.6G44625244P74231R72824J142883o25152p93381j680755j280060m39453J62048
2105.2G42858429Q85467N06897P37763j76773k36740j425171j614380j103897q21304
2113.9G39610291J104431P38144J191406N08728o12717j037445j639099j138687q82721
2122.6G37842331Q18329J045227Q43658K42844n67169q83560j853943j475067j130066
$$ plain form
2060.9 752568207 753481979 754075546 755125046 754945679 754285736 752671661 751421814 750984116 750552826
2069.6 750552826 750848770 751415558 752529297 752269669 751981506 750834961 749356918 748992767 748429184
2078.2 748429184 749215698 749746552 750435486 750433044 749999237 749536057 748105316 747265091 745908432 745991592
2087.9 745991592 746791153 747944412 749095230 748569183 747650528 746127853 745368347 744566422 744625244
2096.6 744625244 745399475 746372299 747515182 746890030 746096649 744415894 743135834 742696381 742858429
2105.2 742858429 743743896 744250793 744988556 744811783 744575043 743149872 741535492 740431595 739610291
2113.9 739610291 740714722 741452866 742644272 743153000 742540283 741502838 739863739 738725052 737842331
2122.6 737842331 738660660 739705887 740549545 740792389 740225220 739341660 737487717 736012650 734882584
2131.3G34882584J56097N51910J221848J194458r2697m94995j922608j216049r79309
2140G33301239l93982M65698Q40531J648712M40826j39236j352081j373826j250610
2148.6G32187271p46078O24237J036834K264710Q31909k1286j070023j952819j177445
2157.3G31977310p57675M13589J2208Q70971J019516N27268l40195j896057j649323
2166G30177612j692733o8055L06473O00739J092300O98319J28631j684799j352310
2174.7G28206177j469345n47257j04904k26212J183167R95331N40314j217652j603775
2183.4G25755844j676636j330108n3864L92151J191330L30277N07202j77994j307221
2192G23630981j515274j471710l79333j07193Q32443K91977J20392j56098j058273
$$ plain form
2131.3 734882584 735038681 735590591 736812439 738006897 737914200 737419205 735496597 734280548 733301239
2140 733301239 732907257 733372955 734213486 735862198 736303024 736163788 734811707 733437881 732187271
2148.6 732187271 731441193 732065430 733102264 735366974 736198883 736177597 735107574 733154755 731977310
2157.3 731977310 731219635 731633224 731645432 732516403 733535919 734063187 733722992 731826935 730177612
2166 730177612 728484879 728416824 728723297 729324036 730416336 731114655 731243286 729558487 728206177
2174.7 728206177 726736832 726189575 726084671 725858459 727041626 728036957 728577271 727359619 725755844
2183.4 725755844 724079208 722749100 722695236 723087387 724278717 724608994 725116196 724938202 723630981
2192 723630981 722115707 720643997 720264664 720157471 720989914 721281891 721402283 721246185 720187912
2200.7G20187912j107101j769410p52487l58352O41403O54983k34298J47705n39933
2209.4G16870422p84378j696624j289139J08490R26666P68051L57285L74679n15289
2218.1G15120163m17175j412735j060486j09100j73646N25818L65677M55475n36194
2226.8G12757797n35660r23156j850281j276169l92609Q84095J70898J23520k53448
2235.4G08704987q37632j344528j878052o14471n19638L36151K61078J3504j49460
2244.1G03971939j123962j142502j491852m01230l48968m9897L21427K37732L62625
2252.8G00335312q12760o64367j518326j372986o18362l9292P66449M33503O55288
2261.5F97164459q56247j091842j158219j293335l21884m81567K17209M06570M34570
$$ plain form
2200.7 720187912 719080811 717311401 716558914 716200562 716841965 717496948 717262650 717410355 716870422
2209.4 716870422 716086044 714389420 713100281 713208771 714135437 714903488 715260773 715635452 715120163
2218.1 715120163 714702988 713290253 712229767 712120667 711947021 712472839 712838516 713293991 712757797
2226.8 712757797 712222137 711298981 709448700 708172531 707779922 708664017 708834915 708958435 708704987
2235.4 708704987 707867355 706522827 704644775 704030304 703510666 703846817 704107895 704121399 703971939
2244.1 703971939 702847977 701705475 700213623 699812393 699463425 699413528 699734955 699972687 700335312
2252.8 700335312 699522552 698858185 697339859 695966873 695348511 695309219 696075668 696509171 697164459
2261.5 697164459 696308212 695216370 694058151 692764816 692442932 691961365 692178574 692585144 693019714
2270.2F93019714m53796q43048r84879j680908j117554m11377R13544M16565K36511
2278.8F89094772j97906j274414j102829j282120m07867n93186K11716P13806J72348
2287.5F85334320O19888j69372o35605j533356r93805j45797J59683Q77456M83628
2296.2F83997040O63147k3728p84149q84857l91693o4392k99072K54669O87790J536712
2305.8F84691467P50428j603j6555n28565N8594L8681N04837J286163Q65784L46298
2315.5F87995529M73480O7292K32467L26767j84478J034927J353073J809006J053238
2324.2F94161301J08108K26212j36261M79278K7237N24750J94855O61010K037735J155091
2333.8F99439316m37470j481094J09787p79495j22605J835251J162567J178971L78418
$$ plain form
2270.2 693019714 692565918 691722870 690737991 689057083 687939529 687528152 688441696 688858261 689094772
2278.8 689094772 688896866 687622452 686519623 685237503 684829636 684236450 684448166 685161972 685334320
2287.5 685334320 685954208 685784836 685149231 683615875 682622070 682476273 682635956 683513412 683997040
2296.2 683997040 684660187 684636459 683852310 682967453 682575760 682511368 682212296 682466965 683154755 684691467
2305.8 684691467 685441895 685440292 685423737 684895172 684953766 684992447 685497284 686783447 687649231 687995529
2315.5 687995529 688469009 688536301 688768768 689095535 688911057 689945984 691299057 693108063 694161301
2324.2 694161301 694269409 694495621 694359360 694838638 694865875 695390625 695585480 696246490 698284225 699439316
2333.8 699439316 699001846 697520752 697630539 696851044 696728439 698563690 699726257 700905228 701283646
2342.5G01283646j57624q62274j432876k366486k304001k326355K15378L599548K149735
2351.2F97798691K373810J519470o62003Q20236J565552K591400L30964J838607Q94471
2359.8G09071198p782l88413j671600n20783k312088Q5449n43747m13208r1018j798630
2369.5G01409378k233276k429657j185685k682266j466827n85556p75376l95660j071548
2378.2F88583527q36258j915665j878433k059860j571274j42365j44958J24588j60370
2386.8F79998932N3406l91693p85599r22165r98001K10953N66787P07627K23846K94113
2396.5F78958206k49710j094894p04727p70340J831J56478M84543N43518J984m01382
2406.1F76925507p06864m35257j115799n27496N1346M81567P39441L05252J69296r47265
$$ plain form
2342.5 701283646 701126022 700263748 698830872 696464386 694160385 691834030 692049408 695648956 697798691
2351.2 697798691 700172501 701691971 701029968 701850204 703415756 706007156 706338120 708176727 709071198
2359.8 709071198 709063416 708675003 707003403 706482620 704170532 704255981 703712234 703299026 703208008 701409378
2369.5 701409378 699176102 696746445 695560760 692878494 691411667 690826111 690050735 689655075 688583527
2378.2 688583527 687747269 685831604 683953171 681893311 680322037 680179672 680034714 680159302 679998932
2386.8 679998932 680052338 679660645 678875046 677952881 676954880 677165833 677732620 678440247 678664093 678958206
2396.5 678958206 678708496 677613602 676908875 676138535 676140366 676296844 676781387 677324905 677326889 676925507
2406.1 676925507 676218643 675783386 674667587 674140091 674191437 674673004 675412445 675717697 675886993 674939728
2415.8F74939728q64334q15049j60827L80020P5378M58069J61667K40326n62668o82525
2425.4F73169785j057282j191635J35574M6692M63028K32697l6850j57242l62778o34079
2435.1F70607910j051483j77536J07574J087189R34906N0736j05133n60456n19104
2443.7F70374603r27124l15017M1122N68390Q27865M34952P70111j82113o57120m56619
2453.4F70479050j8540j9607J88446M24728P477M23508p0191l50189p31659o13327
2463F69719696j56937o6452O65207K76490K81524k89001q90732q63648n98678k61231
2472.7F67816238n32379L51258K73437K34985j63726o64902m44641q72803l22876m41894
2482.3F65232697J54647J43814j33819O72378j94015j023102j063995Q1863k8839k76184
$$ plain form
2415.8 674939728 674075394 673260345 673099518 673479538 673554916 674012985 674174652 674414978 673852310 673169785
2425.4 673169785 672112503 670920868 671056442 671103134 671566162 671798859 671762009 671604767 671241989 670607910
2435.1 670607910 669556427 669378891 669486465 670573654 671508560 671559296 671454163 670893707 670374603
2443.7 670374603 669447479 669132462 669173584 669741974 670569839 671004791 671774902 671592789 670935669 670479050
2453.4 670479050 670460510 670440903 670629349 671054077 671061554 671485062 671414871 671064682 670333023 669719696
2463 669719696 669562759 669496307 670161514 670438004 670719528 670430527 669539795 668676147 668077469 667816238
2472.7 667816238 667283859 667635117 667908554 668143539 667979813 667314911 666870270 665997467 665674591 665232697
2482.3 665232697 665387344 665531158 665397339 666069717 665875702 664852600 663788605 663870468 663841629 663565445
2492F63565445L26157K58941L59040l09830j25580m73328o47277l63694k93045N30014
2501.6F62826843N48935O76193j86920o57119n84794m67376J6403k37427Q4610J69220
2511.2F62188568N79987k8229m28009j82724o63757n5314j69448J78985M88816M70352
2520.9F62379227K73361k70615P0648k95486l77579m73785K77557O84815n3711K9373
2530.5F62243805k43607o02798j032028m88587j55792P8659L67050P6218L04947l04184
2540.2F60243683l89710q31756p87659j80588j14288M76303P1716K95258J48926l94516
2549.8F58537369o86035o46058j96990o06919j59302J53733N52368j36795q69675r6054
2559.5F55845642l83377q67996j052475J69296M87290J60903M10309l22494n19562
$$ plain form
2492 663565445 663891602 664150543 664509583 664199753 664074173 663600845 662953568 662589874 662296829 662826843
2501.6 662826843 663375778 664051971 663865051 663207932 662623138 662155762 662172165 661934738 662019348 662188568
2511.2 662188568 662768555 662740326 662312317 662129593 661465836 661410522 661241074 661420059 661908875 662379227
2520.9 662379227 662652588 662381973 662452621 662157135 661779556 661305771 661583328 662268143 662214432 662243805
2530.5 662243805 662000198 661397400 660365372 659876785 659720993 659799652 660166702 660242920 660547867 660243683
2540.2 660243683 659853973 659022217 658234558 658053970 657939682 658415985 658487701 658782959 658931885 658537369
2549.8 658537369 657851334 657205276 657008286 656401367 656242065 656395798 656948166 656811371 655941696 655845642
2559.5 655845642 655462265 654594269 653541794 653711090 654198380 654359283 654769592 654447098 653927536
2568.1F53927536o03180k17819k15912P0801N75638O08291P88117J81961j58310o31714
2577.8F54325409m9667Q9492m18243j85165J45492J175232M09927k12249k52762k64435
2587.4F54763031k04315m36783K30331L7766O43463O81458J16195r6969p01142k66800
2597.1F54766235k12478K56576L63617L48892L58582Q3160j51519r26972n72357n74799
2606.7F53738937j30462K73132J03760m807k48336K45132l70865o92444j008987m58832
2616.4F51446228K12402n2871M90493l69262k00806p1945o97403q90579o98166K89230
2626F49457321j65710N5084O4163k83356o15005j012268m07868o62460n00488R4757
2635.6F46024170R87167O53153k70310l72467n99365l43094q28934k82287K08206L95203
$$ plain form
2568.1 653927536 653324356 653106537 652890625 652961426 653537064 654145355 654933472 655115433 654957123 654325409
2577.8 654325409 654275742 654365234 653946991 653761826 653907318 655082550 655492477 655280228 655027466 654763031
2587.4 654763031 654558716 654121933 654352264 654390030 655033493 655714951 655831146 655734177 655033035 654766235
2597.1 654766235 654553757 654810333 655173950 655522842 655881424 655964584 655813065 654886093 654313736 653738937
2606.7 653738937 653608475 653881607 653985367 653980560 653732224 653977356 653606491 652914047 651905060 651446228
2616.4 651446228 651658630 651605759 652096252 651726990 651526184 651454239 650756836 649866257 649168091 649457321
2626 649457321 649291611 649346695 649410858 649127502 648512497 647500229 647092361 646429901 645929413 646024170
2635.6 646024170 647011337 647664490 647394180 647021713 646422348 646079254 645250320 644968033 645176239 645571442
2645.3F45571442N93109J144J97983l78265k91138j21842m9285K57186K94648P36618
2654.9F46811600N6534k81144n59616m86145k99988m50744k74811r4986K93274p9803
2664.6F44634171M37316k01721j085434o44531p94144O7520K98996J91575l50342o21338
2674.2F41932068l85590r58862j033859j240006n30205k96211p57293p48368m21905
2682.9F35559769j19477q05664j251220j680718j103935o29158n76248l53318l65219
2691.6F28674812K8878p49360j068267j103630o03714o9161m22096J11503J46943J63879
2701.2F25109787m37202n19867l37067m74930J08910l08800J09444L42636k2354m01116
2710.9F23169441m62303m62227j149711l69606r7237L58696O16455K7046R7389J31302
$$ plain form
2645.3 645571442 646164551 646165695 646363678 645985413 645694275 645572433 645523148 645780334 646074982 646811600
2654.9 646811600 646868134 646586990 646027374 645541229 645241241 644790497 644515686 644420700 644713974 644634171
2664.6 644634171 645071487 644869766 643784332 643139801 642345657 642413177 642712173 642903748 642553406 641932068
2674.2 641932068 641546478 640587616 639553757 638313751 637783546 637487335 636730042 635981674 635559769
2682.9 635559769 635440292 634634628 633383408 631702690 630598755 629969597 629393349 629040031 628674812
2691.6 628674812 628703690 627954330 626886063 625782433 625178719 625109558 624687462 624798965 624945908 625109787
2701.2 625109787 624672585 624152718 623815651 623340721 623449631 623140831 623250275 623592911 623570557 623169441
2710.9 623169441 622707138 622244911 621095200 620725594 620628357 620987053 621603508 621630554 621727943 621859245
2720.5F21859245M82979l7079J71623L67852J23825O78596O68106N88761N26809L20702
2730.2F25751419n54733m26522j98860j34506M39720R4719K60201k66495k50816l0327
2739.8F24683800o04668o35033m86106L70826L98102M60243J94969k37121j54801k91099
2749.4F23699112j75400p09495k42196p1220l44620k55127j50642R3575o38810n92117
2759.1F20613060p38983l83339j02768o83823o8512K9030m31022r48906o68221o02951
2768.7F16013565m96635k0371K3842L94287l28598l89976o23169r61037m21982k94075
2778.4F12895851K45133J07193J47743k87895o05355k43911p00188q38890l97225L11661
2788F10634117j57623m51050l53470l13988l71856p22122k2507J9646K98271M20341
$$ plain form
2720.5 621859245 622342224 622305145 622476768 622844620 622968445 623647041 624315147 624903908 625430717 625751419
2730.2 625751419 625196686 624770164 624571304 624436798 624876518 624971237 625231438 624964943 624714127 624683800
2739.8 624683800 624079132 623444099 622957993 623328819 623726921 624187164 624382133 624145012 623990211 623699112
2749.4 623699112 623523712 622814217 622572021 622500801 622156181 621901054 621750412 621843987 621205177 620613060
2759.1 620613060 619874077 619490738 619387970 618704147 618635635 618664665 618233643 617284737 616616516 616013565
2768.7 616013565 615516930 615496559 615520401 615914688 615586090 615196114 614572945 613611908 613189926 612895851
2778.4 612895851 613140984 613248177 613395920 613108025 612502670 612258759 611558571 610719681 610322456 610634117
2788 610634117 610476494 610025444 609671974 609357986 608986130 608264008 608241501 608261147 608559418 608979759
2797.7F08979759L60604L59726j35346K05421m34188q7700N41191m9439q392L69492
2807.3F10101128O34307K16752J41296n96275p50809j54343m07524j08948O2294L7232
2816.9F09175110k89955m73633r80606j095581k23313k43415o38504q23441j49918
2825.6F04256744k22931p53593o08673m80156j5106Q5869k75765p52220j8501j17188
2835.3F01098480p31811k18888m75463o29731j150856q37555l78837m08478m3182l95699
2844.9E95827980l38058n64652n29480q90961j047744k46392n6305K04659N9471Q8310
2854.6E92506828r96284j386910n75828o66695p22809j358032j281052j848678k135086
2863.2E81535454j893730k650452k177467j894493j846276j355476n30739k45171j29890
$$ plain form
2797.7 608979759 609340363 609700089 609564743 609770164 609335976 609248276 609789467 609740028 609731636 610101128
2807.3 610101128 610735435 610952187 611093483 610497208 609746399 609592056 609184532 609075584 609137878 609175110
2816.9 609175110 608885155 608411522 607430916 606335335 606112022 605868607 605230103 604406662 604256744
2825.6 604256744 604033813 603280220 602671547 602191391 602176285 602262154 601986389 601234169 601215668 601098480
2835.3 601098480 600366669 600147781 599672318 599042587 597891731 597054176 596675339 596266861 596223679 595827980
2844.9 595827980 595489922 594925270 594395790 593504829 592457085 592210693 592154388 592359047 592418518 592506828
2854.6 592506828 591510544 590123634 589547806 588881111 588158302 586800270 585519218 583670540 581535454
2863.2 581535454 579641724 576991272 574813805 572919312 571073036 569717560 569186821 568941650 568811760
2871.9E68811760N17235J09329K64893R48333J383972J608124J674004J903190J912728
2880.6E79133568J305656L61290L59879r957j17492M8256l86811l28941k57988j07536
2890.2E79999924o40106j171799j111222o08825m61045r76028n80902k68250j53274
2898.9E74028473n31769o67801k53410L5362K02751j84326M02832M47006P2594J64719
2908.6E73716431J64337j37825r81369m86679j20659j45302q81195j348534m54597
2917.2E69324608r95178j714592j983567j384811j094627j640435j961860k567253
2925E55982285k257309k789994l321800k722130k421112j411133j67656O10581J706352
2933.6E43208084K129440J693459J875305J547852J173591J530419K443351L168335
$$ plain form
2871.9 568811760 569328995 569438324 569703217 570651550 572035522 573643646 575317650 577220840 579133568
2880.6 579133568 580439224 580800514 581160393 581150436 581032944 581081200 580694389 580365448 580107460 579999924
2890.2 579999924 579359818 578188019 577076797 576467972 576006927 575030899 574449997 574181747 574028473
2898.9 574028473 573496704 572828903 572575493 572610855 572813606 572629280 573032112 573479118 573551712 573716431
2908.6 573716431 573880768 573742943 572761574 572274895 572154236 572008934 571127739 569779205 569324608
2917.2 569324608 568329430 566614838 564631271 563246460 562151833 560511398 558549538 555982285
2925 555982285 553724976 550934982 547613182 544891052 542469940 541058807 540891151 541501732 543208084
2933.6 543208084 545337524 547030983 548906288 550454140 551627731 553158150 555601501 558769836
2941.3E58769836K797242L073158K798080J814766J218567J070976O26069J29928Q11081
2950E73109703N0888n36499p35474j061592j275329k125931j704903j937866j376495
2958.7E62406502j226235k085037j876297k983818l705482l672448l341026l507729
2966.4E40008430l155136k610855k950058k123413k113418j989022j760330j793747
2974.1E21512451j859588k081070q17604k07291K43797J47019O1035N53589j16158
2982.8E17436180N74608J427956J669845L037338N064660O800079P378616P086334
2990.5E50475616O470795N191651M060592M600372M353447L600121L554077L368721
2998.2E85675392K879372J654548J599846J829491J912422J782303J586990J902962
$$ plain form
2941.3 558769836 561567078 564640236 567438316 569253082 570471649 571542625 572168694 572298622 573109703
2950 573109703 573160591 572624092 571888618 570827026 569551697 567425766 565720863 563782997 562406502
2958.7 562406502 561180267 559095230 557218933 554235115 550529633 546857185 543516159 540008430
2966.4 540008430 536853294 534242439 531292381 529168968 527055550 525066528 523306198 521512451
2974.1 521512451 519652863 517571793 516754189 516546898 516790695 516937714 516998749 517552338 517436180
2982.8 517436180 518010788 519438744 521108589 524145927 529210587 536010666 543389282 550475616
2990.5 550475616 556946411 562138062 566198654 570799026 575152473 578752594 582306671 585675392
2998.2 585675392 588554764 590209312 591809158 593638649 595551071 597333374 598920364 600823326
3006F00823326J112442R07822J106109R98993Q69217R48067J94550m10882O59867J66206
3015.6F07375717K03018K15378j12381O37512N89447O82602K73323M55552L06816O5117
3025.2F10692101J45645m57878K55775M43687L87536l891J35688L98789m94881j36566
3034.9F11366005k95067l47328k32430j29356K14577j24741k76337n17272l21160n18761
3044.5F08818130p98988j040916r24149k65465k24228m25910j607438j493606o16303
3053.2F01421127r72976j119805p50122j14670P5951j39275m34341j4839k3232n6305
3062.9E97871513p2708m54063K64396M23890O87294K30178n1383O67953M83742L14903
3072.5F00365715K76375J087150P43790O88248J137314L18031N93376L81203L29819
$$ plain form
3006 600823326 601935768 602843590 603949699 604948692 605817909 606765976 606960526 606549644 607209511 607375717
3015.6 607375717 607578735 607794113 607681732 608319244 608908691 609591293 609864616 610320168 610626984 610692101
3025.2 610692101 610837746 610379868 610635643 611079330 611466866 611462975 611598663 611997452 611502571 611366005
3034.9 611366005 611070938 610723610 610491180 610361824 610576401 610451660 610175323 609658051 609336891 608818130
3044.5 608818130 608019142 606978226 606054077 605788612 605564384 605138474 603531036 602037430 601421127
3053.2 601421127 600448151 599328346 598578224 598463554 598539505 598400230 597965889 597951050 597927818 597871513
3062.9 597871513 597798805 597344742 597609138 598033028 598720322 598950500 598899117 599567070 600050812 600365715
3072.5 600365715 600642090 601729240 602473030 603161278 604298592 604616623 605209999 605591202 605921021
3081.2F05921021n0698L4676P79266N27535Q36296J46255q0299J11046M4899J89247
3090.8F08459244m9172L54691N49850O91452M93966L54385L58467L06816N25093N92270
3100.5F12637062M68865o9466J13602K65655Q41179P57370K87323R60846K30598J92986
3110.1F16686020P46193J020050R48486M42047P97844O66390L94745j77384J48926
3118.8F21673317Q56628O64368J15204l86009K60620L2654M9095J78070J01776K78244
3128.4F23823967l31955k71568P6217O67458L02811m9668J8692n68809k21062K77634
3138.1F23723717N64537k79923n18608k26326n34706r1247l79601n04608L2539N00489
3147.7F22286263J32789K03705L72658n55992n02777o14090k16942K15950j22567k71568
$$ plain form
3081.2 605921021 605870323 605904999 606684265 607211800 608048096 608194351 608114052 608225098 608269997 608459244
3090.8 608459244 608410072 608764763 609314613 610006065 610500031 610854416 611212883 611519699 612044792 612637062
3100.5 612637062 613105927 613036461 613150063 613415718 614256897 615014267 615301590 616262436 616493034 616686020
3110.1 616686020 617432213 618452263 619400749 619842796 620640640 621307030 621701775 621524391 621673317
3118.8 621673317 622529945 623194313 623309517 622923508 623184128 623216782 623265877 623443947 623545723 623823967
3128.4 623823967 623492012 623220444 623296661 623964119 624266930 624217262 624235954 623667145 623446083 623723717
3138.1 623723717 624288254 624008331 623489723 623263397 622728691 622637444 622257843 621753235 621785774 622286263
3147.7 622286263 622419052 622622757 622995415 622439423 621936646 621322556 621105614 621321564 621198997 620927429
3157.4F20927429k47497p7706n96962j92108J95923n2032n06478p14760l54843k85110
3167F18095856O4125p42607q67463l46412j91803N3367n01136j78414k51045n66139
3176.6F14568329r74770j059532k58293k64244l07083l84827J28326K5750j97983n07965
3186.3F10767708j233063p87010n85976m654l05633o67649n42259o11229R5139o08292
3195.9F05517082m68673j16539p91741l75862j297j19705p57447r64393m92401n9357
3205.6F01369667l31802n86739n26123m33502K47497j4915p54051p37648m71039o39992
3215.2E97121353l47710J59188O4125j33629r88960j090012n99327k56767m28848p75490
3224.9E92723923m47579m04625j63917n35584o36673k72560O0921K9983q93478m54674
$$ plain form
3157.4 620927429 620679932 620602226 620005264 619813156 620009079 619957047 619450569 618735809 618380966 618095856
3167 618095856 618159981 617417374 616549911 616203499 616011696 616065063 615563927 615385513 615134468 614568329
3176.6 614568329 613593559 612534027 612275734 612011490 611704407 611319580 611447906 611473656 611275673 610767708
3186.3 610767708 609534645 608747635 608161659 608157005 607851372 607183723 606641464 606030235 606125374 605517082
3195.9 605517082 605048409 604931870 604140129 603764267 603762970 603643265 602885818 601921425 601429024 601369667
3205.6 601369667 601037865 600451126 599925003 599491501 599738998 599724083 598970032 598232384 597761345 597121353
3215.2 597121353 596773643 596932831 596996956 596863327 595874367 594784355 594185028 593928261 593499413 592723923
3224.9 592723923 592276344 591871719 591707802 591172218 590535545 590262985 590323906 590353889 589460411 589005737
3234.5E89005737l99856l28675k1476k32354j36985l64266j49841o87294m62227J52092
3244.2E86374855J92375K71912m64020m25224o80161n10254j80626n61027k25334Q4724
3253.8E83877220m0512j10474Q5679q96759q69904l14865q51021n42450L5057N08919
3263.4E80880890m959j84670m73633o28395P7706m76189n48363l46069K4605N3253
3273.1E78374176n02815m94538l57208n34630j056022m46358n75180n96123n913j17988
3282.7E73687401l72505r10797m25911p91741o04629L6430l46680j90506l42598m2953
3292.4E69695511m47655o06651o51245r33037o87714r41772m44412m17900m47464o78559
3302E63439102m10690k05422j041565p04536r38873p12700q73451j107788q36678j024399
$$ plain form
3234.5 589005737 588605881 588277206 588255730 588023376 587886391 587522125 587372284 586684990 586222763 586374855
3244.2 586374855 586567230 586839142 586375122 585949898 585269737 584759483 584578857 584017830 583792496 583877220
3253.8 583877220 583836708 583726234 583811913 582915154 582045250 581730385 580879364 580336914 580371971 580880890
3263.4 580880890 580875931 580691261 580217628 579589233 579666939 579190750 578642387 578296318 578320923 578374176
3273.1 578374176 577871361 577376823 577019615 576484985 575428963 574982605 574407425 573811302 573805389 573687401
3282.7 573687401 573314896 572404099 571978188 571186447 570581818 570618248 570271568 570081062 569738464 569695511
3292.4 569695511 569247856 568641205 567989960 567056923 566369209 565427437 564983025 564565125 564117661 563439102
3302 563439102 563028412 562822990 561781425 561076889 560138016 559425316 558551865 557444077 556607399 555583000
3311.7E55583000k89726r74808j258964r37348m11911o5269j031380j095505j349563
3320.3E48168526r37882o31943r31282o87103p64122j067238j042823m92135j072654
3329E40541344j030693p84455j335983j310425j157799p79419j090049j037445j007996
3337.7E31007080j013870q37746j228485j232910j429176q31986p81326j394272j234398
3346.4E21022911j271934j282464j078758p43103j180038j557923j769256j363068
3354.1E10776367o52809j307640j592178j358643j072540j278191j073265q60557j733666
3362.8D99846878j310501q47702j211891j296692j262932j491585j411400j462478
3370.5D89551697j563301p62139r39941j150856j070099j111259o69632p16362j213265
$$ plain form
3311.7 555583000 555293274 554318466 553059502 552122154 551710243 551644974 550613594 549518089 548168526
3320.3 548168526 547230644 546598701 545667419 544980316 544216194 543148956 542106133 541613998 540541344
3329 540541344 539510651 538726196 537390213 536079788 534921989 534142570 533052521 532015076 531007080
3337.7 531007080 529993210 529155464 527926979 526694069 525264893 524432907 523651581 522257309 521022911
3346.4 521022911 519750977 518468513 517389755 516646652 515466614 513908691 512139435 510776367
3354.1 510776367 510123558 508815918 507223740 505865097 504792557 503514366 502441101 501580544 499846878
3362.8 499846878 498536377 497688675 496476784 495180092 493917160 492425575 491014175 489551697
3370.5 489551697 487988396 487226257 486286316 485135460 484065361 482954102 482284470 481568108 480354843
3379.2D80354843j693306j016922p86476j111679j269531j617775p11708r4109n37758
3387.8D71515579j176605r18312o51283j139794j158638j012420n37835m72831o04706
3396.5D63843155q12264n54542k90337j047592p52602q35151j113968q15125q70208
3405.2D56751366m26331L5324L13568m69436j073914o95496o64596m88815m77486m97131
3414.8D52307053o02379n01099k85911m67530K43416J42021j087494n93834j13296
3423.5D49040947j23405J02157J31950J51406n48248m18244K2240k10571J26800K7046
3433.2D48302078K4414J68572O69174N69153n87807m87251p4196O02379O53305J43585
3442.8D49983406L09525p3662L76320O16874l41529K47879Q40683L03535M58298L12690
$$ plain form
3379.2 480354843 478661537 477644615 476858139 475746460 474476929 472859154 472147446 472053337 471515579
3387.8 471515579 470338974 469420662 468769379 467629585 466470947 465458527 464920692 464447861 463843155
3396.5 463843155 463030891 462476349 462186012 461138420 460385818 459550667 458436699 457621574 456751366
3405.2 456751366 456325035 456360359 456673927 456204491 455130577 454435081 453770485 453281670 452804184 452307053
3414.8 452307053 451704674 451203575 450917664 450450134 450693550 450835571 449748077 449154243 449040947
3423.5 449040947 448917542 449019699 449151649 449303055 448754807 448336563 448358803 448148232 448275032 448302078
3433.2 448302078 448326492 448495064 449164238 449733391 449145584 448658333 448584137 449186516 449839821 449983406
3442.8 449983406 450292931 450219269 450595589 451212463 450870934 451118813 451959496 452263031 452721329 453034019
3452.5D53034019k08892N76744P91092M45938L93371N19829O48575M73099P00416N08995
3462.1D57883186N34935R94950O87751K21596M36707J053276N47294j30882L89328
3470.8D62618141R28307Q84781J020813N74760l08952j03417M30336P58362R01451
3479.5D67704582J088028R29260M10462P2937L40462J019096P48405N48974N34324
3488.1D73396530M23660P27845Q48884Q44727O50177J053772Q91952M61045P26738
3496.8D80025330P12852P44782L72352K85072K05193M95300J206856R66187P75489
3505.5D85789413O3591N80712K041321J175575l28980P36466J214523M18549P70340
3514.2D92461510J061744R54972P03621P65266R98306K47040j71127M30984J380501
$$ plain form
3452.5 453034019 452825127 453401871 454192963 454638901 455032272 455552101 456200676 456673775 457374191 457883186
3462.1 457883186 458418121 459413071 460100822 460322418 460759125 461812401 462359695 462228813 462618141
3470.8 462618141 463546448 464431229 465452042 466026802 465717850 465614433 466044769 466803131 467704582
3479.5 467704582 468792610 469721870 470132332 470205269 470545731 471564827 472313232 472862206 473396530
3488.1 473396530 473820190 474548035 475396919 476241646 476891823 477945595 478837547 479298592 480025330
3496.8 480025330 480738182 481482964 481855316 482140388 482345581 482840881 484047737 485013924 485789413
3505.5 485789413 485853004 486433716 488475037 489650612 489321632 490058098 491272621 491691170 492461510
3514.2 492461510 493523254 494478226 495181847 495947113 496945419 497192459 497021332 497452316 498832817
3522.9D98832817R34143P36466J196365Q48465O20766M88243Q12034O29158O50101
3531.5E05748558J029358P61566J206322J802864O56433j73149J069794P42836L43055
3540.2E13187637Q30231J028519J323204J469841J404342K22702M40331J80740P35588
3548.9E20823135J850510J181793J178971j90392M60014J270981J120987J559525P72552
3557.6E30028076J355324N01480J76086P45011J345940J567115L09868K419014J010399
3566.2E39458313M81453J502228q19092J502037J128578Q87451J066208J428070P79076
3574.9E47414322O00204J879044Q16460J993522J347046N87311J383324J017341J113320
3583.6E58151894O14662K653122J532936R0408J205902l77769J836128J504631K208405
$$ plain form
3522.9 498832817 499766960 500503426 501699791 502548256 503169022 503657265 504469299 505098457 505748558
3531.5 505748558 506777916 507539482 508745804 510548668 511205101 511031952 512101746 512844582 513187637
3540.2 513187637 514017868 515046387 516369591 517839432 519243774 519466476 519906807 520087547 520823135
3548.9 520823135 522673645 523855438 525034409 524844017 525304031 526575012 527695999 529255524 530028076
3557.6 530028076 531383400 531884880 532060966 532805977 534151917 535719032 536028900 538447914 539458313
3566.2 539458313 539939766 541441994 540622902 542124939 543253517 544140968 545207176 546635246 547414322
3574.9 547414322 548014526 549893570 550710030 552703552 554050598 554637909 556021233 557038574 558151894
3583.6 558151894 558766556 561419678 562952614 563043022 564248924 563871155 565707283 567211914 569420319
3592.3E69420319J212921L23562K238808K62184J456680J336937J043587K513542J208382
3601E81016922K60239L7956J030121J726761K166442J815606q2207J564865j550179
3609.6E87986526j202583M314728J479378j025620L264885N91622J880989K441787
3617.4E99731712j037178R62220N47409n112J006546J390877J344795J280823Q82415
3626F06104507N34516L439064L51372n683747J703873K746735L067512N43518j287231
3634.7F11520119k53182J025048J264457k18925P01484J316300J116028l35236n42984
3643.4F15593109J004334K140541L039322k319909k604217L326149J014671k321930
3651.1F18872070r19799K570381J477890J533851K368431l917579j98174J994934Q48732
$$ plain form
3592.3 569420319 570633240 570956802 573195610 573457794 574914474 576251411 577294998 579808540 581016922
3601 581016922 581277161 581315117 582345238 584071999 586238441 588054047 587971840 589536705 587986526
3609.6 587986526 586783943 591098671 592578049 591552429 594817314 595408936 597289925 599731712
3617.4 599731712 598694534 599656754 600204163 600199051 601205597 602596474 603941269 605222092 606104507
3626 606104507 606639023 610078087 610429459 604745712 606449585 609196320 612263832 612807350 611520119
3634.7 611520119 611266937 612291985 613556442 613337517 614039001 615355301 616471329 616136093 615593109
3643.4 615593109 616597443 618737984 621777306 619457397 616853180 620179329 621194000 618872070
3651.1 618872070 617952271 620522652 622000542 623534393 625902824 621985245 621787071 623782005 624630737
3659.8F24630737R06029j56631J94816k41508K09198J188583L01094K046356J203690
3668.5F30282364j404076N9090m248390L10478M442558N115471r35898r437294K224427
3677.1F26408730L700294K344894j614723p65838P96203L20702j21193l76740J265946
3685.8F31958275L070183M307556m640007l790703M175911l782845j111564K673416
3693.5F32860222O43425O49414l27416k66609M78668l14407Q46214J240578k844887
3702.2F32965202p56988K332649O84090k60125o85615R31473J973610l943863N55534
3710.9F33795967K260819o230317J547013K230835r46198k27012J085090R46388j678657
3719.6F32783928k95525L069954j816673k532311K811966J264344n46303k418823l10860
$$ plain form
3659.8 624630737 625536766 625380135 625574951 625333443 625542641 626731224 627032318 629078674 630282364
3668.5 630282364 628878288 628937378 624688988 624999466 629442024 634557495 633621597 624184303 626408730
3677.1 626408730 630109024 632453918 630839195 630073357 630869560 631190262 631069069 630692329 631958275
3685.8 631958275 635028458 639336014 634696007 630905304 635081215 631298370 630186806 632860222
3693.5 632860222 633503647 634153061 633825645 633559036 634037704 633723297 634569511 635810089 632965202
3702.2 632965202 632208214 634540863 635224953 634964828 634279213 635210686 637184296 633240433 633795967
3710.9 633795967 636056786 629826469 631373482 633604317 632658119 632431107 633516197 634462585 632783928
3719.6 632783928 632488403 635558357 633741684 631209373 634021339 635285683 634739380 632320557 632009697
3728.3F32009697J142769N04188L352013j261749m560662L769837j7204n388566l17001
3736.9F29233322Q32977Q85849J191521J075592k060356J105614O608963n968514j0756683
3745.6F22148285M945755L444061M045105l059234m698182P997170l606377p145920
3753.3F24070663K610283K791901K385674k609711O25267K986603n011750j388168
3761F26460762K289925N12275l6850J532441j114998l197556J409035L375969Q58726
3769.7F32089729m988746l9864J018753l92380L53394n53856O5079M68139J615296
3778.4F29635544M00238m317017N38597R95407M56391P63206j771621m73481O00853
3787.1F26828117j15928O2408L25699j36185k12974k63252r60045R07364J561584k527771
$$ plain form
3728.3 632009697 633152466 633656654 637008667 635746918 631186256 634956093 634938889 629550323 629233322
3736.9 629233322 630066299 630952148 632143669 633219261 631158905 632264519 638873482 632904968 622148285
3745.6 622148285 627094040 630538101 634583206 631523972 626825790 634822960 631216583 624070663
3753.3 624070663 626680946 629472847 631858521 629248810 629874077 632860680 627848930 626460762
3761 626460762 628750687 629262962 629226112 630758553 629643555 626445999 627855034 631231003 632089729
3769.7 632089729 627100983 627061119 628079872 627687492 628040886 627487030 627552109 628020248 629635544
3778.4 629635544 630035782 625718765 626257362 627252769 627709160 628472366 626700745 626227264 626828117
3787.1 626828117 626712189 626774597 627100296 626964111 626751137 626487885 625527840 626435204 627996788 625469017
3796.7F25469017j943169P57103K086907L767433l653183n978165J946564J212311
3804.4F23664818L191566L741722o108284l809738K719765J334305n44358L08304m7645
3813.1F24450455O69250L123856j630631p330780K189560L285446K785836n33638j0701371
3821.8F16307983K024804L607940P56989J244964k47459k726975j77078J790695K648735
3830.5F25230598K57187n500374R45435L972206l254127L50685N020256o185227j880073
3839.2F18956566M694671l164100p66869L651428j449737k972603J326408M27781l19443
3847.8F20384102O35528l74870J162186K094765k989464J215477q608895M39988O105003
3856.5F20063820p45201j864357P57141J838264K885285l027458o32286L070945l972397
$$ plain form
3796.7 625469017 623525848 624282951 626369858 630137291 626484108 620505943 622452507 623664818
3804.4 623664818 626856384 630598106 624489822 620680084 623399849 624734154 624189796 624498100 624450455
3813.1 624450455 625119705 628243561 626612930 619282150 621471710 624757156 627542992 627009354 616307983
3821.8 616307983 618332787 621940727 622697716 623942680 623695221 620968246 620791168 622581863 625230598
3830.5 625230598 625487785 619987411 620932846 624905052 621650925 622001610 627021866 620836639 618956566
3839.2 618956566 623651237 620487137 619720268 623371696 621921959 618949356 620275764 620703545 620384102
3847.8 620384102 621019630 620644760 621806946 623901711 620912247 622127724 613518829 613958817 620063820
3856.5 620063820 619318619 617454262 618211403 620049667 622934952 619907494 619275208 622346153 618373756
3865.2F18373756k759704K227287K818108K620086m439010m316902J913070K595330
3872.9F19032021K028427m214936p44667J020928r96170J691704L067817l192291l620796
3881.6F14072037L139190L82386k80228K817955o085243L49541K194023K2926K699890
3890.3F19312477q55827n020066Q11539J577835j317863J4457J228447J961174J601601
3898.9F19313774n851173J989479R73701l613815K659988j954956l13530M36707m3831
3907.6F13596344J260529j47133K80723q8272l45650n14984p08427L36304J655578
3916.3F15325012j197586k642212J920586n37949j629219J295471O97594P58095j154366
3925F12835426j422233m7455J76239Q22029j183L74794R48525j764755r58596J351967
$$ plain form
3865.2 618373756 615614052 617841339 620659447 623279533 618840523 614523621 616436691 619032021
3872.9 619032021 621060448 616845512 616100845 617121773 616125603 617817307 620885124 617692833 614072037
3881.6 614072037 617211227 617593613 617313385 620131340 614046097 614395638 616589661 616612587 619312477
3890.3 619312477 618456650 613436584 614248123 615825958 614508095 614522552 615750999 617712173 619313774
3898.9 619313774 613462601 615452080 616425781 612811966 615471954 613516998 613203468 613640175 613596344
3907.6 613596344 614856873 614709740 614990463 614902191 614556541 614041557 613333130 613669434 615325012
3916.3 615325012 614127426 611485214 613405800 612867851 611238632 612534103 613231697 613989792 612835426
3925 612835426 611413193 611365738 611541977 612364006 612362823 612737617 613686142 611921387 610962791 612314758
3934.6F12314758Q2093o4507J39465l28407l79372l95050J049576l7002k361565J67198
3944.3F10187187O90422K25411O24275r46541k20642Q698j550599Q37479O52962m56848
3953.9F10051804l0594J01165R78013j64795o71196n83344L3913K00844q51860J23901
3963.6F09187851n5046J35307K64282M692K02027n27840L7842J99852l40691l63922
3973.2F08744354M1275k10914n16854l10745n85213L243N5733q2474O0882P7820N9815
3983.8F07336922J68342L73802n12313n38521m90761j91994m9400k86293m0741p31621
3993.5F05037422p248O9390M5127O69175J12457q4305m96254
4000.2F05345764
$$ plain form
3934.6 612314758 612396851 612332344 612471809 612143402 611764030 611368980 612418556 612381554 610019989 610187187
3944.3 610187187 610877609 611103020 611727295 610780754 610560112 610568810 609018211 609855690 610508652 610051804
3953.9 610051804 610021210 610122375 611100388 610935593 610264397 609681053 609714966 609915810 609063950 609187851
3963.6 609187851 609132805 609268112 609532394 609537086 609739113 609211273 609249115 609448967 609108276 608744354
3973.2 608744354 608785629 608574715 608057861 607747116 607161903 607165146 607220879 607138405 607199287 607277107 607336922
3983.8 607336922 607505264 607879066 607366753 606828232 606337471 606145477 606096077 605809784 605769043 605037422
3993.5 605037422 605030174 605099564 605144691 605813866 605926323 605842018 605345764
4000.2 605345764
##END=$$ End of the data block
