##TITLE=Resinogum DD IRX $$ Begin of the data block
##JCAMP-DX=5.00 $$ ACD/SpecManager v 10.08
##SPECTROMETER/DATA SYSTEM=Alpha
##DATE=19 Feb 2015 09:45:16
##DATA TYPE=INFRARED SPECTRUM
##DATA CLASS=XYDATA
##ORIGIN=
##OWNER=
##NPOINTS=1765
##FIRSTX=399.76428223
##LASTX=3997.64306641
##MAXX=3997.64306641
##MINX=399.76428223
##MAXY=0.85729992
##MINY=0.04567404
##XFACTOR=1.0000000000
##YFACTOR=1.000000000000000e-9
##FIRSTY=0.75143868
##DELTAX=2.03961372
##XUNITS=1/CM
##YUNITS=ARBITRARY UNITS
##XYDATA=(X++(Y..Y))
399.8G51438677J35482M56988j985073l355145j610339L86954k46406j901269j846313
$$ 751438677 751574159 752031147 750046074 746690929 745080590 745467544 745221138 743319869 741473556
418.1G41473556k3783J05977j883924k788424r18150J122892K08080k389193k586663
$$ 741473556 741449773 741555750 739671826 736883402 735965252 737088144 737296224 734907031 732320368
436.5G32320368L6061J307845l71218j979768j031816Q51333N67437j725555k336085
$$ 732320368 732356429 733664274 733293056 731313288 730281472 731132805 731700242 729974687 727638602
454.8G27638602O4135J984000L86119j882315j369476J225233K480865J267194J32323
$$ 727638602 727702737 729686737 730072856 728190541 726821065 728046298 730527163 731794357 731926680
473.2G31926680J318395K955317K319932K25961l51965J343310K517402J184881o13690
$$ 731926680 733245075 736200392 738520324 738746285 738394320 739737630 742255032 743439913 742826223
491.5G42826223j57714J614929J595735n61475j900733p03096M60982q19981k740741
$$ 742826223 742668509 744283438 745879173 745317698 743416965 742713869 743174851 742354870 739614129
509.9G39614129k636790j203120r78827k544284l659427k586127q74460r23454k343893
$$ 739614129 736977339 735774219 734795392 732251108 728591681 726005554 725131094 724207640 721863747
528.3G21863747k449274k34366K366841L053665K298415K278626L200412L154397J461625
$$ 721863747 719414473 719180107 721546948 724600613 726899028 729177654 732378066 735532463 736994088
546.6G36994088j73867j52409N10514k58625j979053j968324N10633K748668K342463
$$ 736994088 736820221 736667812 737178326 736919701 734940648 732972324 733482957 736231625 738574088
565G38574088L56674o48499m57406j311600m084766o409109n356550j132130K984643
$$ 738574088 738930762 738282263 737824857 736513257 732428491 726019382 720662832 719530702 722515345
583.3G22515345M579484N038619N860627N701601L171146j56700j594067p43449N67138
$$ 722515345 727094829 732133448 737994075 743695676 746866822 746710122 745116055 744372606 744939744
601.7G44939744R31621J315475L156662N206584M992426K619624Q27909J401960K397776
$$ 744939744 745871365 747186840 750343502 755550086 760542512 763162136 763990045 765392005 767789781
620G67789781J254618r54926j621485p50541q52466k813518m204571k674461K40684
$$ 767789781 769044399 768089473 766467988 765717447 764864981 762051463 757846892 755172431 755413115
638.4G55413115J287699O69241J166045L351748M418493J729488l202856o180465n943894
$$ 755413115 756700814 757370055 758536100 761887848 766306341 768035829 764832973 758652508 752708614
656.8G52708614m263044j107394L655672O728232Q343518Q862257M565179K066851
$$ 752708614 748445570 747338176 750993848 757722080 766065598 774927855 779493034 781559885
673.1G81559885L080666N047857N305171L846407K917230L326357L221273J258910
$$ 781559885 784640551 789688408 794993579 798839986 801757216 805083573 808304846 809563756
689.4H09563756p00772k38657J698852J941025n4836j550794n66065J262307R80139
$$ 809563756 808862984 808624327 810323179 812264204 812209368 810658574 810092509 811354816 812334955
707.7H12334955j178503k113045m24802J665473J619756J63854l04282j38581j709163
$$ 812334955 811156452 809043407 808618605 810284078 811903834 812067688 811763406 811624825 809915662
726.1H09915662m675210n656838l332615o81400p23780k650260l569067k689242k084554
$$ 809915662 805240452 799583614 796250999 795569599 794845819 792195559 788626492 785937250 783852696
744.5G83852696l454804n527914n769968l439784k2053K438664L440559M286289N457223
$$ 783852696 780397892 774869978 769100010 765660226 765638173 768076837 771517396 775803685 781260908
762.8G81260908N437851L725767K203643K025366J721382k05040k073646j138210J554012
$$ 781260908 786698759 790424526 792628169 794653535 796374917 796169877 794096231 792958021 794512033
781.2G94512033K121807n46933l619790m820943n254566o881595q991420r012819o614923
$$ 794512033 796633840 796086907 792467117 787646174 782391608 775510013 766518593 757505774 750890851
799.5G50890851m770875n658209o720603m076957N78463K261698L63886j743257k269864
$$ 750890851 746119976 740461767 733741164 729664207 730242670 732504368 732868254 731124997 728855133
817.9G28855133k937555n949855r733260r468555l499508L013611M073798P99537n24819
$$ 728855133 725917578 719967723 710234463 700765908 697266400 700280011 704353809 705153346 704628527
836.2G04628527K454162O207406Q095265R311735J0983944J1612535R092212M034280
$$ 704628527 707082689 713290095 721385360 730697095 741681039 753293574 762385786 766420066
852.6G66420066l7074p76231p7426j437963n174279q510411j0295808j2280822j5126407
$$ 766420066 766382992 765606761 765529335 764091372 758917093 750406682 740110874 727830052 712703645
870.9G12703645j6930699j6511142j5306116j5870034j9125104k2450507k1954238
$$ 712703645 695772946 679261804 663955688 648085654 628960550 606510043 584555805
885.2E84555805j6754031q720041M51505R640694J7242432K1067917K0057976J6266406
$$ 584555805 567801774 559081733 559533238 569173932 586416364 607484281 627542257 643808663
901.5F43808663J3051867J1112273Q500517L745436k623319q598984j1757433j0919929
$$ 643808663 656860530 667972803 676473320 680218756 677595437 668996453 657239020 646319091
917.8F46319091p519126l966927q28385K348005M702032M960894L595055K278328J507103
$$ 646319091 638799965 634833038 634004653 636352658 641054690 646015584 649610639 651888967 653396070
936.2F53396070M71532p08043r08733j07646O61195R16421J012564J152038K76387
$$ 653396070 653867602 653159559 652250826 652143180 652804375 653720796 654733360 655885398 656161785
954.5F56161785k603412o029009p779181p683874o590485m988551l711880l092885
$$ 656161785 653558373 647529364 639750183 632066309 625475824 620487273 616775393 613682508
970.9F13682508j704096J343727L714800J856327m091740r103239q515954l151714
$$ 613682508 611978412 613322139 617036939 618893266 614801526 605698287 597182333 594030619
987.2E94030619K740442N557418L884793j32382k550900k107621j114606j914561l856719
$$ 594030619 596771061 602328479 606213272 606080890 603529990 601422369 600307763 598393202 594536483
1005.5E94536483m535854k987563o29962N68092K82884j88410j35243l63052j511514
$$ 594536483 590000629 587013066 586383104 586951196 587234080 587045670 586910427 586547375 585035861
1023.9E85035861k716542k294600M66645L955901N621791M586577J468480k754510
$$ 585035861 582319319 580024719 580491364 584447265 590069056 594655633 596124113 593369603
1040.2E93369603n784154m430830J598775Q748174J3267934J3713837J0934770P196009
$$ 593369603 587585449 583154619 584753394 593501568 606769502 620483339 631418109 638614118
1056.5F38614118M205883K010286j27972l001034p034600j1310398j3377965j1762559
$$ 638614118 642820001 644830287 644702315 641701281 634666681 623356283 609978318 598215759
1072.8E98215759q440018o099939m055977p17342K747357M463494M083752K262354
$$ 598215759 589775741 583675802 579619825 578902483 581649840 586113334 590197086 592459440
1089.2E92459440J81139j238585k403974m564762q563221j3714790j7274976j6395807
$$ 592459440 592640579 591401994 588998020 584433258 575870037 562155247 544880271 528484464
1105.5E28484464j1246622m965424o6758L563762O667852Q583010Q295178O525934
$$ 528484464 517237842 512272418 512205660 515769422 522437274 531020284 539315462 545841396
1121.8E45841396N643904P159412R632766R975970O659567J112044l821850o362199
$$ 545841396 551485300 558644712 568277478 578253448 584913015 586025059 582203209 575841010
1138.1E75841010o675959n615771l480077o63399J475453J572788j85728k208531k983213
$$ 575841010 569165051 563549280 560069203 559405804 560881257 562454045 562268317 560059786 557076573
1156.5E57076573k426445j875699k232253k786219k910793l483415n044341o362855
$$ 557076573 554650128 552774429 550542176 547755957 544845164 541361749 536317408 529954553
1172.8E29954553o246031m936337k831698K14696L924907P565498J0387540J1345267
$$ 529954553 523708522 518772185 515940487 516155183 520080090 527645588 538033128 549378395
1189.1E49378395R503603N343378Q11278k245843k895653r71079K499759N774498Q006096
$$ 549378395 558881998 564225376 565036654 562790811 559895158 558924079 561423838 567198336 575204432
1207.5E75204432R272516R388387P948697N236446K060175q37028k906680l862738
$$ 575204432 584476948 593865335 601814032 607050478 609110653 608273625 605366945 601504207
1223.8F01504207l768862k890527j559973l43918J4662j008570l125906m975498n188882
$$ 601504207 597735345 594844818 593284845 592940927 592955589 591947019 588821113 583845615 578656733
1242.1E78656733l946781k571941j860499j563489r16720L91245J691580K217233K259612
$$ 578656733 574709952 572138011 570277512 568714023 567797303 568188548 569880128 572097361 574356973
1260.5E74356973K627254L345310L686965L071368J338422j367986m394293o535113
$$ 574356973 576984227 580329537 584016502 587087870 588426292 587058306 582664013 576128900
1276.8E76128900o787777n273521k740979j2457J969635K938807L472507L718555L073573
$$ 576128900 569341123 564067602 561326623 561314166 563283801 566222608 569695115 573413670 576487243
1295.2E76487243J150191j705408m305065n026817l036201N35726L463090M660606
$$ 576487243 577637434 575932026 571626961 566600144 563563943 564099669 567562759 572223365
1311.5E72223365M617930M332244N046427P071436Q685112P975101M511178l87073
$$ 572223365 576841295 581173539 586219966 593291402 601976514 609951615 614462793 614075720
1327.8F14075720m188895n110741l907919k684414k549946l498733m970432n706250
$$ 614075720 609886825 604776084 600868165 598183751 595633805 592135072 587164640 581458390
1344.1E81458390m815996l304303l042996n394160j1321783j8904090k3555100k5563777
$$ 581458390 576642394 573338091 570295095 564900935 553579152 534675062 511119962 485556185
1360.4D85556185k9166817l0420810k3830712j6897500j9470870k9877305l2566935
$$ 485556185 456389368 425968558 402137846 385240346 365769476 335892171 303325236
1374.7C03325236j7980844k649397j430988n669027J430720K2718370M3928980N1301718
$$ 303325236 285344392 282694995 281264007 275594980 277025700 299744070 343673050 394974768
1391C94974768N0930888M5882642L5492390K7862370K2842765J7716944J3768673R451211
$$ 394974768 445905656 491788298 527280688 555143058 577985823 595702767 609471440 618922651
1407.3F18922651N449831K464831R9123j729489l989994p215560j0063290j4613033
$$ 618922651 624372482 626837313 626936436 625206947 621216953 614001393 603938103 589325070
1423.7E89325070k1518409k6757777k8797507k4399966j8013060j9626051k5679559
$$ 589325070 567806661 541048884 512251377 487851411 469838351 450212300 424532741
1437.9D24532741k6364803k6230633k5420428k3072391k1457106j7726332j1845738
$$ 424532741 398167938 371937305 346516877 323444486 301987380 284261048 272415310
1452.2B72415310n662858L80426N243123O505787Q043289J3086230J9404978K2931784
$$ 272415310 266752452 267132878 272376001 278881788 286925077 300011307 319416285 342348069
1468.5C42348069K7486712L5661935L7211448L1860352K8039843K7526319L0053258
$$ 342348069 369834781 405496716 442708164 474568516 502608359 530134678 560187936
1482.8E60187936L2628655L4805119L5611213L1159341K2000909J6465842J5077651
$$ 560187936 592816591 627621710 663232923 694392264 716393173 732859015 747936666
1497.1G47936666J2404442R026348O782473O309509O807387N110740L508687L072441
$$ 747936666 760341108 769367456 776149929 782459438 789266825 794377565 797886252 800958693
1513.4H00958693L003955L126562L006398K805054K436817K112985K154827J882195
$$ 800958693 803962648 807089210 810095608 812900662 815337479 817450464 819605291 821487486
1529.7H21487486J508475J336872J329541J360775J241326P07328N40257P76171P72596
$$ 821487486 822995961 824332833 825662374 827023149 828264475 828971803 829512060 830288231 831060827
1548.1H31060827N76138M24087N46336O96660M21285j78575j14978J06037J18077j52528
$$ 831060827 831636965 832061052 832607388 833304048 833725333 833546758 833431780 833537817 833655894 833503366
1568.5H33503366n57542m90487m19855q20041j138866j197815j264035j323820j569747
$$ 833503366 832945824 832455337 832035482 831215441 830076575 828878760 827614725 826290905 824721158
1586.8H24721158k059877k441168k585530k749682l148079l624678l954112m072070
$$ 824721158 822661281 820220113 817634583 814884901 811736822 808112144 804158032 800085962
1603.2H00085962m164398m514336m869581m809379m400671m918039o140053n546093
$$ 800085962 795921564 791407228 786537647 781728268 777327597 772409558 766269505 760723412
1619.5G60723412n439162p504940r816528j2609481j5227080j4188826j2106597j1058688
$$ 760723412 755284250 747779310 737962782 725353301 710126221 695937395 683830798 672772110
1635.8F72772110p559181l122449J68145L295600O710828Q273363O318808M805326
$$ 672772110 665212929 662090480 662258625 665554225 672265053 680538416 686857224 691662550
1652.1F91662550L513157N65768j166702k774536n221665p439494q251846r977997
$$ 691662550 695175707 695741475 694574773 691800237 686578572 679139078 670887232 660909235
1668.4F60909235j1506676r847999j0595798j3580859j5698612j8726825k7344347
$$ 660909235 649402559 639554560 628958762 615377903 599679291 580952466 553608119
1682.7E53608119m2356014m1554421l6389619l7728876l4921020l6000282l6956966
$$ 553608119 511252105 469697684 433308065 395579189 360658169 324657887 287700921
1697B87700921l2588720l1987265k2718131j2469352l197699J0087818K1014750K7243062
$$ 287700921 255112201 223124936 200406805 187937453 184739754 194827572 215842322 243085384
1713.3B43085384K9030562K6634216J7044753O596446K692044M723221J1580705J9883991
$$ 243085384 272115946 298750162 315794915 322391361 325083405 329806626 341387331 361271322
1729.6C61271322K7185201L7578911M0182173L2179743L2646418L3978820L0706942
$$ 361271322 388456523 426035434 466217607 498397350 531043768 565022588 595729530
1743.9E95729530K8021097K5454283K3820340K0843983J6099334J3391495J1876523
$$ 595729530 623750627 649204910 673025250 693869233 709968567 723360062 735236585
1758.2G35236585R904027Q708418P250130N829036N305588M677117M209459L569484
$$ 735236585 745140612 753849030 761099160 766928196 772233784 776910901 781120360 784689844
1774.5G84689844L041684K950311K980232K828717K686024K673567K533495K498865
$$ 784689844 787731528 790681839 793662071 796490788 799176812 801850379 804383874 806882739
1790.8H06882739K484620K303242K153874K200663K129257J976609J839399J725912
$$ 806882739 809367359 811670601 813824475 816025138 818154395 820131004 821970403 823696315
1807.1H23696315J614392J454651J342714J264215J265883J232267J160025J052261
$$ 823696315 825310707 826765358 828108072 829372287 830638170 831870437 833030462 834082723
1823.4H34082723J049816J035631R53436Q67903P61390P27117P13110P16746O50644
$$ 834082723 835132539 836168170 837121606 837989509 838750899 839478016 840191126 840907872 841558516
1841.8H41558516O07431O06120O02007N50508N12540N22435N03719M53293L87788L68297
$$ 841558516 842165947 842772067 843374074 843924582 844437122 844959557 845463276 845916569 846304357 846672654
1862.2H46672654L82483M06563L24607K70844L15487L45707L06428K25007J72556J46329
$$ 846672654 847055137 847461700 847786307 848057151 848372638 848718345 849024773 849249780 849422336 849568665
1882.6H49568665J81913K15292J92643J53303J96516K35141K25126J90795J61648J37865
$$ 849568665 849750578 849965870 850158513 850311816 850508332 850743473 850968599 851159394 851321042 851458907
1903H51458907J03772P1645M5299P7725Q7261P2539Q3863J53959J80483J51157J74225
$$ 851458907 851562679 851634324 851679623 851757348 851844609 851917148 852001011 852154970 852335453 852486610 852660835
1925.4H52660835K09212K31445K14040J57595J06215J09792J20819J09613R0360Q1182
$$ 852660835 852870047 853101492 853315532 853473127 853579342 853689134 853809953 853919566 854009926 854091108
1945.8H54091108P1645N9425K7359m1127o1095l2604l9279r3997q7678J2278J06276
$$ 854091108 854162753 854222178 854249537 854208410 854147315 854114711 854075432 853981435 853893757 853906035 854012311
1968.3H54012311J09136Q7082J41919K20954K03788J11163O8963Q0525J08362R2566
$$ 854012311 854121447 854208529 854350448 854571402 854775190 854886353 854955316 855035841 855144203 855236769
1988.7H55236769P75o1274m768Q1718R0539M0174L7849R4652J12951N3048l4035l9696
$$ 855236769 855237544 855176270 855171502 855253220 855343759 855383933 855421782 855516434 855629385 855682433 855648398 855608702
2013.1H55608702L1948K9087j18554k53200l30746k70606P3374K97129J78099R9241
$$ 855608702 855640650 855669737 855551183 855297983 854967237 854696631 854770005 855067134 855245233 855344474
2033.5H55344474J20104N6743l7431l3260R1374J61052P5757j0430L3021J10507Q1896
$$ 855344474 855464578 855521321 855483890 855450630 855542004 855703056 855778813 855768383 855801404 855911911 855993807
2056H55993807l3021q6844o795P8977K4318j23799j65224n3823L1770j6928p5519k2829
$$ 855993807 855960786 855873942 855867147 855946124 855970442 855846643 855681419 855627596 855659366 855642438 855566919 855544090
2080.4H55544090R8110J53601P3969k3186m530Q2672O6399m0889n5372P7486J88112
$$ 855544090 855642200 855795801 855869770 855846584 855842054 855924726 855991125 855950236 855894864 855972350 856160462
2102.9H56160462J33574J3471n126P3313R1434K2769j1206Q1599K23398K43485J12116
$$ 856160462 856294036 856307507 856302381 856375694 856467128 856489897 856478691 856560290 856783688 857027173 857139289
2125.3H57139289O199L8386Q6784K9266p8201q4460L4392J08480J1623r8646o4313
$$ 857139289 857145488 857183874 857270658 857299924 857221723 857137263 857171655 857280135 857291758 857193112 857128799
2147.7H57128799M6730Q9824N782r9003r0182O914J4186j01030j96219j63197l3558
$$ 857128799 857175529 857265353 857271135 857172132 857081950 857088864 857103050 857002020 856805801 856642604 856609046
2170.2H56609046M1366j6808p3433L039Q0824J1921r4592p7546J2636M4406k8372r7036
$$ 856609046 856650412 856633604 856560171 856563210 856644034 856655955 856561363 856483817 856496453 856540859 856512487 856415451
2194.6H56415451l0637R3817Q7083l7789r6083m5598N901l8802j36853j61350p1048
$$ 856415451 856384814 856478631 856565714 856527925 856431842 856386244 856392145 856353343 856216490 856055140 855984092
2217.1H55984092P510m8101j42932j24991l0041j1563j02639j77384j27434k1160q464
$$ 855984092 855991602 855943501 855800569 855675578 855645537 855633974 855531335 855353951 855226517 855205357 855196893
2239.5H55196893j12474j89066j69158j46925k03669k92182k98143k19583j71840k19405
$$ 855196893 855084419 854895353 854726195 854579270 854375601 854083419 853785276 853565693 853393853 853174448
2259.9H53174448k73168k14934r5487o2525j39654k28941k26915j54913j57416k53200
$$ 853174448 852901280 852686346 852590859 852528334 852388680 852159739 851932824 851777911 851620495 851367295
2280.3H51367295k98679k16782j17481j32739k40088k91347k13385j34587j79589k83897
$$ 851367295 851068616 850851834 850734353 850601614 850361526 850070179 849856794 849722207 849542618 849258721
2300.7H49258721l40760l33190l01778l11315l47316l13044k54154l32892n24461o11604
$$ 849258721 848917961 848584771 848282993 847971678 847624362 847311318 847057164 846724272 846199811 845588207
2321.1H45588207m52161k52425k77460m29094m97520m18067k39372j03772j67846k57969
$$ 845588207 845136046 844883621 844606161 844177067 843679547 843261480 843022108 842918336 842750490 842492521
2341.5H42492521j23084J55509J77204k05457o47545q13186p41720p06256o13987l59535
$$ 842492521 842369437 842524946 842702150 842496693 841849148 841035962 840294242 839587986 838973999 838614464
2361.9H38614464j47045q2314o2942k2650P4983J47163R8944J0133j311L3140k8670
$$ 838614464 838467419 838385105 838322163 838299513 838374496 838521659 838620603 838630736 838629425 838662565 838633895
2384.3H38633895k14160l57687l65078l27230l23474l70026l94523l19719k18213j99556
$$ 838633895 838419735 838062048 837696970 837369740 837046266 836676240 836281717 835961998 835743785 835544229
2404.7H35544229k53201k96354k84553k63750l24965m40359m77195m15563m05014n08308
$$ 835544229 835291028 834994674 834710121 834446371 834121406 833681047 833203852 832788289 832383275 831874967
2425.1H31874967n84484n15520l96609m10438n37395o24955o05464n37157n39303o28769
$$ 831874967 831290483 830774963 830378354 829967916 829430521 828805566 828200102 827662945 827123642 826494873
2445.5H26494873o61850n85914n00321m81666n25295n34892m64976m25279n13912o39081
$$ 826494873 825833023 825247109 824746788 824265122 823739827 823204935 822739959 822314680 821800768 821161687
2465.9H21161687o53147n72861n50508o35445o90401o26504n33402n40197o25491o56069
$$ 821161687 820508540 819935679 819385171 818749726 818059325 817432821 816899419 816359222 815733731 815077662
2486.3H15077662o03497n81204o63698p99596q76904q66890q60810q97348r24170q78692
$$ 815077662 814474165 813892961 813229263 812429667 811552763 810685873 809825063 808927715 808003545 807124853
2506.7H07124853p87437p77960q72671r46284r17852q43286q42094r23038r62973r09805
$$ 807124853 806337416 805559456 804686785 803740501 802822649 801979363 801137269 800214231 799251258 798341453
2527.1G98341453q67963r14037r89139j013696r43184q58486q80301r26792q53301
$$ 798341453 797473490 796559453 795570314 794556618 793613434 792754948 791874647 790947855 790094554
2545.5G90094554p23540p25389q41260q89480q49664q33392r05752j007081j017808
$$ 790094554 789371014 788645625 787804365 786914885 786065221 785231829 784326077 783318996 782301188
2563.8G82301188r39489q92997r60886j037479r94861r04083q79347r08494q95918
$$ 782301188 781361699 780468702 779507816 778470337 777475476 776571393 775692046 774783552 773887634
2582.2G73887634q03351p18355p49529q35955q61466q58903r22560j063168j185477
$$ 773887634 773084283 772365928 771616399 770780444 769918978 769060075 768137515 767074347 765888870
2600.5G65888870j196742j151800j155556j198768j223684j181304j066387r50873
$$ 765888870 764692128 763540328 762384772 761186004 759962320 758781016 757714629 756763756
2616.8G56763756q75115p60555n66721m21167m08232m84288n55634n28038m63545n40078
$$ 756763756 755888641 755128086 754561365 754140198 753731966 753247678 752692044 752164006 751700461 751160383
2637.2G51160383p48932q86381r24766j044869j288414j496494j544297j522004j548648
$$ 751160383 750411451 749525070 748600304 747555435 746267021 744770527 743226230 741704226 740155578
2655.6G40155578j588822j531064j329243j109124r95993r52661q54135o81817n79894
$$ 740155578 738566756 737035692 735706449 734597325 733601332 732648671 731794536 731112719 730532825
2673.9G30532825o33478p62403q76188r86875j094639j123249j009584p75099n45859
$$ 730532825 729899347 729136944 728260756 727273881 726179242 725055993 724046409 723271310 722725451
2692.3G22725451m01795k68757o9440J50621K50817J60336l0458j94549l16561m83453
$$ 722725451 722323656 722054899 721985459 722136080 722386897 722547233 722516775 722322226 722005665 721522212
2712.7G21522212p32720j006484j188517j224398j077712o31451J38700J038789J728714
$$ 721522212 720789492 719783008 718594491 717370093 716292381 715660930 715799630 716838419 718567133
2731.1G18567133J993656J869738J567900J248777Q91745N04435J56581j23382l65734
$$ 718567133 720560789 722430527 723998427 725247204 726138949 726643384 726799965 726676583 726310849
2749.4G26310849o84261j096547j357615j298249j068592r03904r02832j033842j256526
$$ 726310849 725626588 724530041 723172426 721874177 720805585 719901681 718998849 717965007 716708481
2767.8G16708481j625180k182901k790153l296316l764450m326761m946172n449236
$$ 716708481 715083301 712900400 710110247 706813931 703049481 698722720 693776548 688327312
2784.1F88327312n763590n992830o229341o465196o655813o754696o788075o827235
$$ 688327312 682563722 676570892 670341551 663876355 657220542 650465846 643677771 636850536
2800.4F36850536o875336o936968p132291p644594q581937r918868j1595786j3651907
$$ 636850536 629975200 623038232 615905941 608261347 599679410 589760542 578164756 564512849
2816.7E64512849j6173780j9103766k2023081k4278611k5418371k5395304k4571061
$$ 564512849 548339069 529235303 507212222 482933611 457515240 432119936 407548875
2831D07548875k3541093k2819251k2621870k2854805k3022771k2490591k1119907j9185856
$$ 407548875 384007782 361188531 338566661 315711856 292689085 270198494 249078587 229892731
2847.3B29892731j7064154j5072689j3299912j1626080r979233q594140p706061p009670
$$ 229892731 212828577 197755888 184455976 172829896 162850663 154256523 146550462 139540792
2863.6A39540792n815760l595292k75016L533289O730467Q455604Q495927P060096
$$ 139540792 133725032 130129740 129854724 133388013 140118480 148574084 157070011 164130107
2879.9A64130107M563152J601994j273736l750443n681426p036730p888452q332833
$$ 164130107 168693259 170295253 169021517 165271074 159589648 152552918 144664466 136331633
2896.3A36331633q436457q234635p853679p440180p013015o493553n799264m988060
$$ 136331633 127895176 119660541 111806862 104366682 97353667 90860114 85060850 80072790
2912.6H0072790m309073l948949l817223l770143l639918l274545k695590k040312
$$ 80072790 75763717 71814768 67997545 64227402 60587484 57312939 54617349 52577037
2928.9E2577037j427665q48796l35913k7866J8929j06316l45726o62465r53555j030381
$$ 52577037 51149372 50300576 49964663 49936797 49955726 49849410 49503684 48841219 47887664 46857283
2949.3D6857283p84096l99150K3641N72152J222164J910738K671816L612891M776682
$$ 46857283 46073187 45674037 45697678 46269830 47491994 49402732 52074548 55687439 60464121
2967.6F0464121O019935P197231Q168571Q814655R306975R758629J0136865J0667831
$$ 60464121 66484056 73681287 81849858 90664513 99971488 109730117 119866982 130534813
2984A30534813J1496112J2413933J3281718J3985381J4572471J5373737J6257450J7030224
$$ 130534813 142030925 154444858 167726576 181711957 196284428 211658165 227915615 244945839
3000.3B44945839J7895773J8782973J9511819K0153344K0574361K0374596J9500226
$$ 244945839 262841612 281624585 301136404 321289748 341864109 362238705 381738931
3014.5C81738931J8337727J7154753J5956342J4771521J3553590J2293994J1235684
$$ 381738931 400076658 417231411 433187753 447959274 461512864 473806858 485042542
3028.8D85042542J0406524R556711Q533120P521510O859243O339908N592227M779637
$$ 485042542 495449066 505005777 513538897 521060407 527919650 534259558 539851785 544631422
3045.1E44631422M297554M273474M335404M211724L984332L509581K717495J867175
$$ 544631422 548928976 553202450 557537854 561749578 565733910 569243491 571960986 573828161
3061.5E73828161J198351R32813J071572J401186J778185K110541K486647K976417
$$ 573828161 575026512 575959325 577030897 578432083 580210268 582320809 584807456 587783873
3077.8E87783873L461361L952980M443467M721999M785418M643441M177272L649473
$$ 587783873 591245234 595198214 599641681 604363680 609149098 613792539 617969811 621619284
3094.1F21619284L349602L131509K737463K210021J878202J826167J723289J396358
$$ 621619284 624968886 628100395 630837858 633047879 634926081 636752248 638475537 639871895
3110.4F39871895J207114J307249J282751J000226O28173L15130K81155M76539N94616
$$ 639871895 641079009 642386258 643669009 644669235 645297408 645612538 645893693 646370232 646964848
3128.8F46964848M94182L06845K60472L94821M00067R6261j46389q9288Q6785K66731
$$ 646964848 647459030 647765875 648026347 648421168 648821235 648917496 648771107 648681819 648768604 649035335
3149.2F49035335L37600R9659k12848j93298l4928k8789n6029P570O6102M9233M1843
$$ 649035335 649372935 649472594 649259746 649066448 649031520 649002731 648946702 648954272 649020374 649069607 649111450
3171.6F49111450N9187N6267N5790M3630q463k4975M7744J02698O7175L4690K9504
$$ 649111450 649170637 649226904 649282694 649326324 649317861 649292886 649340630 649443328 649510503 649545193 649574697
3194F49574697O378J7166N7340L4689K087L3676L8088K3901L0279n603p4029j50382
$$ 649574697 649581075 649598241 649655581 649690270 649692357 649726033 649764121 649788022 649818301 649812698 649738669 649588287
3218.5F49588287j91033j71185j80184k31028k28643j38939j30892l75390n99563n72383
$$ 649588287 649397254 649226069 649045885 648814857 648586214 648447275 648316383 647940993 647341430 646769047
3238.9F46769047m83275m12464l39389l70264n27858o05643n27144m79877n58078o53207
$$ 646769047 646285772 645873308 645533919 645163655 644635797 644030154 643503010 643023133 642465055 641811848
3259.3F41811848o32167n47886n28336n40137n14984n93066p81834q68440q76665r12130
$$ 641811848 641179681 640631795 640103459 639563322 639048338 638455272 637673438 636804998 635928333 635016203
3279.7F35016203r40621r48489r94205j051545j032472j031578j160979j331329j458883
$$ 635016203 634075582 633127093 632132888 631081343 630048871 629017293 627856314 626524985 625066102
3298F25066102j503170j418054j298368j380026j683236j900196j910448j866638j878620
$$ 625066102 623562932 622144878 620846510 619466484 617783248 615883052 613972604 612105966 610227346
3316.4F10227346j953244k023876k034544k043426k182305k354622k373278k328456
$$ 610227346 608274102 606250226 604215682 602172256 599989951 597635329 595262051 592933595
3332.7E92933595k320885k341152k475679k648830k698362k726436k760768k748072
$$ 592933595 590612710 588271558 585795879 583147049 580448687 577722251 574961483 572213411
3349E72213411k841055l021419l099322l097535l087580l120065l188848l188014l159285
$$ 572213411 569372356 566350937 563251615 560154080 557066500 553946435 550757587 547569573 544410288
3367.4E44410288l189385l217697l154814l068566l029108k947569k835810k780796
$$ 544410288 541220903 538003206 534848392 531779826 528750718 525803149 522967339 520186543
3383.7E20186543k740025k669632k581239k465666k326548k196908k112865k026260
$$ 520186543 517446518 514776886 512195647 509729981 507403433 505206525 503093660 501067400
3400E01067400j862377j696706j625031j612216j601398j580537j528441j523942j581520
$$ 501067400 499205023 497508317 495883286 494271070 492669672 491089135 489560694 488036752 486455232
3418.4D86455232j600415j574993j534879j467049j343191j212358j076699r15527
$$ 486455232 484854817 483279824 481744945 480277896 478934705 477722347 476645648 475730121
3434.7D75730121p12335n04225l68298k53737j33693k8342P7516K02984L06308L65943
$$ 475730121 475017786 474513561 474145263 473891526 473757833 473729491 473807007 474009991 474316299 474682242
3455.1D74682242M04328M73380N64933O38485O63548O88315P92682Q56280Q68172R22709
$$ 474682242 475086570 475559950 476124883 476763368 477426916 478115231 478907913 479764193 480632365 481555074
3475.5D81555074J021564J078099J049608J104683J321703J436234J386940J432270
$$ 481555074 482576638 483654737 484704345 485809028 487130731 488566965 489953905 491386175
3491.8D91386175J606882J781583J835435J841665J896172J928687J928330K013862
$$ 491386175 492993057 494774640 496610075 498451740 500347912 502276599 504204929 506218791
3508.1E06218791K191961K334058K267599K110839K183199K367914K491474K452731
$$ 506218791 508410752 510744810 513012409 515123248 517306447 519674361 522165835 524618566
3524.4E24618566K346575K438903K624393K735972K877951K999782L042162L250003
$$ 524618566 526965141 529404044 532028437 534764409 537642360 540642142 543684304 546934307
3540.8E46934307L547668L661394L626824L770470M141212M532397M807174N030691
$$ 546934307 550481975 554143369 557770193 561540663 565681875 570214272 575021446 580052137
3557.1E80052137N300522N481363N469083N627334O301821O571650O151796N997538
$$ 580052137 585352659 590834022 596303105 601930439 608232260 614803910 620955706 626953244
3573.4F26953244O191075O298125O290257O206274N927384N679309N653501N388856
$$ 626953244 633144319 639442444 645732701 651938975 657866359 663545668 669199169 674588025
3589.7F74588025M829287M537881M371941M083991L720343L303408K938569K692938
$$ 674588025 679417312 683955193 688327134 692411125 696131468 699434876 702373445 705066383
3606G05066383K702534K837181K889157K981066L185868L778518M533410M556060M210531
$$ 705066383 707768917 710606098 713495255 716476321 719662189 723440707 727974117 732530177 736740708
3624.4G36740708M114867M671692M990459M236340L768445L513455L160536K850950
$$ 736740708 740855575 745527267 750517726 754754066 758522511 762035966 765196502 768047452
3640.7G68047452K499580K120674J855671J901985J853764J309335R87053J173436
$$ 768047452 770547032 772667706 774523377 776425362 778279126 779588461 780575514 781748950
3657G81748950J219869Q77619O07550N73456N33641N24223O20782M88460M30107O58989
$$ 781748950 782968819 783846438 784453988 785027444 785561085 786085308 786706090 787194550 787624657 788283646
3677.4G88283646P25269P64668Q87990R84550J127601J106381Q40068P46488P55728
$$ 788283646 789008915 789773583 790661573 791646123 792773724 793880105 794720173 795466661 796222389
3695.8G96222389O63876N00977M07160L93211L83437L10898J75893K35319M01974L05593
$$ 796222389 796886265 797387242 797794402 798187613 798571050 798881948 799057841 799293160 799695134 800000727
3716.2H00000727P8857o2764m4167P0453J56820J53184O4909K9624J15275K45214K31087
$$ 800000727 800079584 800016820 799972653 800043106 800199926 800353110 800418019 800447643 800562918 800808132 801039219
3738.6H01039219n0843l30090j61291J33694q1182k20597Q1957J97351k2054j47104
$$ 801039219 800988376 800658286 800496995 800630689 800549507 800328910 800410867 800608218 800586164 800439060
3759H00439060n3227j9908n2273q5593p6234K1517K1935o0916n5909o4910j82688k36869
$$ 800439060 800385833 800365925 800313652 800228059 800151825 800173342 800195277 800134361 800078452 800013542 799830854 799593985
3783.5G99593985j71065r0182l7849q941l7551r2208j78695l24666k58386m7326n6565
$$ 799593985 799422920 799332738 799294889 799285948 799248397 799156189 798977494 798652828 798394442 798347116 798290551
3805.9G98290551m9055k3305j74761l37660k83957j83284k16663j09852j8358j5080
$$ 798290551 798241496 798218191 798043430 797705770 797421813 797238529 797021866 796912014 796893656 796878576
3826.3G96878576J4425n0962n2154K7418j07169k59400j43111j8775L0339M8875k3901
$$ 796878576 796893001 796842039 796789885 796817303 796710134 796450734 796307623 796288848 796319187 796368062 796344161
3848.7G96344161k71022n21779k46048P7307K4974j08242k32279k14636j33992j34706
$$ 796344161 796073139 795551360 795305312 795382619 795407593 795299351 795067072 794852436 794718444 794583738
3869.1G94583738j11520j23322q2553J3828k6226m5359m172k7061n0902p4267o9201
$$ 794583738 794472218 794348896 794266343 794280171 794253945 794208586 794204414 794177353 794126451 794052184 793982983
3891.6G93982983R000L8803l3439j29819j66535n8472J28984J64450Q8989j9788j56999
$$ 793982983 793991983 794030786 793997347 793867528 793700993 793642521 793771505 793935955 794024944 794005156 793848157
3914G93848157j56045k1517K6583m9173q2136j4722O855l4571n9903o8903Tr7394j74701
$$ 793848157 793692112 793670595 793697178 793648005 793565869 793551147 793558002 793523431 793463528 793394625 793325722 793228328 793053627
3940.5G93053627j44422J490L6776k5749o9141n3406J5557K4497r9838k21431j87159
$$ 793053627 792909205 792910695 792947471 792921722 792852581 792799175 792814732 792839229 792739391 792517960 792330801
3962.9G92330801n9902k6822j02639j20700p9810n8115p7307j53244j38700j0788K1875
$$ 792330801 792270899 792244077 792141438 792020738 791940928 791882813 791805506 791652262 791513562 791502774 791524649
3985.4G91524649r6083j88231j01209J3172J7584j7584
$$ 791524649 791428566 791240335 791139126 791152298 791169882 791152298
3997.6G91152298
$$ 791152298
##END=$$ End of the data block
