##TITLE=Renata Menger 3 $$ Begin of the data block
##JCAMP-DX=5.00 $$ ACD/SpecManager v 10.08
##SPECTROMETER/DATA SYSTEM=Alpha
##DATE=16 Sep 2014 08:23:38
##DATA TYPE=INFRARED SPECTRUM
##DATA CLASS=XYDATA
##ORIGIN=
##OWNER=
##NPOINTS=1765
##FIRSTX=399.76428223
##LASTX=3997.64306641
##MAXX=3997.64306641
##MINX=399.76428223
##MAXY=0.88071388
##MINY=0.62562937
##XFACTOR=1.0000000000
##YFACTOR=1.000000000000000e-9
##FIRSTY=0.82039070
##DELTAX=2.03961372
##XUNITS=1/CM
##YUNITS=ARBITRARY UNITS
##XYDATA=(X++(Y..Y))
399.8H20390701J296044J52409k049685K06232M462302L337920j379729j742601K772927
$$ 820390701 821686745 821839154 819789469 819995701 824458003 827795923 826416194 824673593 827446520
418.1H27446520L982425r10759k669930P86483L330231P20918k528072q09550K693594
$$ 827446520 831428945 830518186 827848256 828634739 831964970 832685888 830157816 829348266 832041860
436.5H32041860J605034k048076j744449J967251K274931j291692k434194P81416K971292
$$ 832041860 833646894 831598818 829854369 831821620 834096551 832804859 830370665 831152081 834123373
454.8H34123373M44889k603233q54611K058625J053035k066254k039969J109004J863122
$$ 834123373 834568262 831965029 831110418 833169043 834222078 832155824 830115855 831224859 833087981
473.2H33087981j249969k759278k35438J796603o58393l933489k996088j075506l838479
$$ 833087981 831838012 829078734 828843296 830639899 829981506 826048017 823051929 821976423 818137944
491.5H18137944r063304r873509m652202J951217N065978N670845Q033097R846747
$$ 818137944 809074640 799201131 794548929 796500146 801566124 807236969 815270066 825116813
507.9H25116813O033898N79178j49965J993596J254440k269209k727270Q51870K578139
$$ 825116813 831150711 831729889 831579924 833573520 834827960 832558751 829831481 830683351 833261490
526.2H33261490m70877k988100j055479J430929o14047m940212o060720m902839o777466
$$ 833261490 832790613 829802513 828747034 830177963 829563916 824623704 818562984 813660145 806882679
544.6H06882679j1409580j2561977p494092k76268M301787O444037R036839J1107802
$$ 806882679 795473099 782911122 775417030 775140762 779442549 785886586 794923425 806031227
560.9H06031227Q784533L516256J447142L504753L983974O32167j603663O22988L232062
$$ 806031227 814815760 818332016 819779158 823283911 827267885 827900052 826296389 826919377 830151439
579.3H30151439J563370j724839j373887J633227J889646j343489k857089n68628Q39650
$$ 830151439 831714809 829989970 828616083 830249310 832138956 830795467 827938378 827369750 828209400
597.6H28209400j768768m615843l343701j80483l5882k923846n214274n682290o062686
$$ 828209400 826440632 821824789 818481088 818300605 818264723 815340877 810126603 804444313 798381627
616G98381627o641388l221870R311199K3445905K2660792R594023J021027j04069k671600
$$ 798381627 791740239 788518369 797829568 821275473 843936265 853530288 854551315 854447246 851775646
634.3H51775646o890952l759027M019439O361723K610266j362681j174748J413584
$$ 851775646 844884694 841125667 845145106 851506829 854117095 852754414 851579666 852993250
650.6H52993250J536488r36389j609802R18746K552510P40051j884043k112329J764059
$$ 852993250 854529738 853593349 851983547 852902293 855454803 856194854 854310811 852198482 853962541
669H53962541K904892j85371j123488R89318J882613k28405j935661o98864Q70287
$$ 853962541 856867433 856682062 855558574 856547892 858430505 858202100 856266439 855567575 856437862
687.3H56437862o48379l921390n415618n041719m403412j543880N081415J0346592
$$ 856437862 855789483 851868093 846452475 841410756 837007344 835463464 840544879 850891471
703.7H50891471R309351L986359l71218o08980J480639J628100p63654j830161L34203
$$ 850891471 860200822 864187181 863815963 863206983 864687622 866315722 865552068 863721907 864056110
722H64056110K058089M35412j803279j057744J286984J240432j188994j980245J39535
$$ 864056110 866114199 866549611 864746332 863688588 864975572 866216004 865027010 863046765 863186300
740.4H63186300J469672l65079k480268j749516J09673m18783k777934l536761k492368
$$ 863186300 864655972 864290893 861810625 860061109 860170782 859751999 856974065 853437304 850944936
758.7H50944936l159642p653415j4889300k2664070k6008070j5712976P460832K4061144
$$ 850944936 847785294 840131879 825242579 802578509 776570439 760857463 768318295 792379439
775.1G92379439K1914244J1220753M086971L059149N401373O613910M440367J295924
$$ 792379439 814293683 825514436 829601407 832660556 838061929 844675839 849116206 850412130
791.4H50412130P71821K325594K315104M6432j105725M13537J770913M86493j628101
$$ 850412130 851183951 853509545 855824649 855871081 854765356 855178893 856949806 857436299 855808198
809.7H55808198j598298L7491O26624k56241m73439R63449J963795M46975j954556
$$ 855808198 854209900 854247391 854874015 854617774 854144335 855107784 857071579 857518554 855563998
828.1H55563998k484560k329528m962862j0656058j5924871j5954197q482456J201093
$$ 855563998 853079438 850749910 845787048 835130990 819206119 803251922 794769466 795970559
844.4G95970559P095516J1181772J4927744J4356435R355902N192221L998697K997636
$$ 795970559 803066075 814247847 829175591 843532026 852887928 858080149 862078846 865076482
860.7H65076482N48780j297474q66711K0445r27985k666950k620995j009941n90981
$$ 865076482 865625262 864327788 863461077 863481522 862553537 859886587 857265592 856255651 855664670
879.1H55664670k129673l134609k052903p26521j122415k045572j219988P97987J457632
$$ 855664670 853534997 850400388 848347485 847620964 846498549 844452977 843232989 844030976 845488608
897.4H45488608K78950n53608K07841R46045m649j459479j250089J52290M09007q02755
$$ 845488608 845767558 845213950 845421791 846367836 846363187 844903708 843653619 843805909 844214916 843412161
917.8H43412161j315177q8811J106740P00533p4148O98268K288580K466202J257658
$$ 843412161 842096984 842008173 843114913 843815446 843741298 844439566 846728146 849194348 850452006
936.2H50452006Q55446J904487K566338J595795K72393L02017J104236J014352k7478
$$ 850452006 851307452 853211939 855778277 857374072 857646465 857948482 859052718 860067070 860039592
954.5H60039592p50661p47979r86993j693249j258969J272082L642857L041268N76853
$$ 860039592 859288931 858540952 857553959 855860710 854601741 855873823 859516680 862557948 863134801
972.9H63134801n45442K02537O97732k30134j159787n68807N59807L35753q21412r23335
$$ 863134801 862589359 862791896 863489628 863259494 862099707 861530900 862090707 862426460 861605048 860681713
993.3H60681713K13205P28548k36154j144886o46114J36256m33147j577198j291394
$$ 860681713 860894918 861623466 861387312 860242426 859596312 859732568 859299421 857722223 856430829
1011.6H56430829K68757R63390J9133q74579l48806N09977J07705r39548r03248J27673
$$ 856430829 856699586 857662976 857682109 856807530 856458724 856968701 857076406 856136858 855233610 855361283
1032H55361283M41491m63247j071215l73661M03404j40548j191198j141489k63870
$$ 855361283 855802774 855339527 854268312 853894651 854298055 854157507 852966309 851824820 851560950
1050.4H51560950j61528j156807j817167j313388p89404j366198k188087j904607q91208
$$ 851560950 851399422 850242615 848425448 847112060 846322656 844956458 842768371 840863764 839972556
1068.8H39972556n70953j048863r53317J62780R75311N04792l60608l09646L50475
$$ 839972556 839401603 838352740 837399423 837562203 838537514 839042306 838681698 838372052 838722527
1087.1H38722527K70188o27637j015663m55737j59860r95159k020061k027929j474976
$$ 838722527 838992715 838365078 837349415 836893678 836733818 835738659 833718598 831690669 830215693
1105.5H30215693j637102k519905k846658k136291j637518k274156k922892k734482
$$ 830215693 828578591 826058686 823212028 821075737 819438219 817164063 814241171 811506689
1121.8H11506689l376782n822718o196380l2842Q945644J1748850O987393J826167
$$ 811506689 808129907 802307189 796110809 796077967 805023611 816772461 823759854 825586021
1138.1H25586021L96013M28736o06775k359390l381491l555119m029751n187869o258249
$$ 825586021 825982034 826410770 825803995 823444605 820063114 816507995 812478244 807290375 801032126
1156.5H01032126p149041r069085j3101637j8921376k5081515l0189156l1285048k1488130
$$ 801032126 793883085 784814000 771712363 752790987 727709472 697520316 666235268 644747138
1172.8F44747138K744675L2023370N0602913N1291525L9458454K5174141J4225483
$$ 644747138 647491813 679515183 730118096 781409621 820868075 846042216 860267699
1187.1H60267699O763279J520157j585960k590478k644121k884508l061235k414524
$$ 860267699 867030978 868551135 866965175 864374697 861730576 858846068 855784833 853370309
1203.4H53370309j338482j043916j841366k741516k929389k852261l226340l706813
$$ 853370309 852031827 850987911 849146545 846405029 843475640 840623379 837397039 833690226
1219.7H33690226l472626k663672k227426k354502k268196j590847r91583j148582
$$ 833690226 830217600 827553928 825326502 822972000 820703804 819112957 818121374 816972792
1236H16972792j664698j636267j049518q18670j243532j642346j683712j954734k885938
$$ 816972792 815308094 813671827 812622309 811803639 810560107 808917761 807234049 805279315 802393377
1254.4H02393377l939271m421175m592597n259812o491959p555187q101106q588850
$$ 802393377 798454106 794032931 789440334 784180522 777688563 770133376 762032270 753443420
1270.7G53443420r108961r051442q540094q703232j0102033j1954367j2831033j1525213
$$ 753443420 744334459 735283017 726742923 718039691 707937658 695983291 683152258 671627045
1287F71627045p470250j183749N609691J1353314J6717434K1633506K0482600Q794844
$$ 671627045 664156795 662973046 668582737 679936051 696653485 718286991 738769591 747564435
1303.3G47564435p677615j7582535j5437603o312252K406955O975651O140471L106355
$$ 747564435 739886820 722304285 706866682 700554430 702961385 709937036 716077507 719183862
1319.6G19183862J470089Q54969K428830Q735955J7284870K2243798K0892322J4706075
$$ 719183862 720653951 721508920 723937750 732673705 749958575 772202373 793094695 807800770
1336H07800770O238401j503587l875434M29093P020772J1022150J1154771Q958280
$$ 807800770 814039171 812535584 808660150 809089243 816110015 827132165 838286936 847245216
1352.3H47245216O016493L144443J096249l4392j037598k038479k459049k312243j997769
$$ 847245216 853261709 856406152 857502401 857468009 856430411 854391932 851932883 849620640 847622871
1370.6H47622871k173721k884627l029585k708375k825856l052295k457022j350522
$$ 847622871 845449150 842564523 839534938 836826563 834000707 830948412 828491390 827140868
1386.9H27140868q18491r51350j270950j323283r39965p72953j150071j831115k917111
$$ 827140868 826322377 825371027 824100077 822776794 821836829 821063876 819913805 818082690 815165579
1405.3H15165579m342556o116867q096814r445727j0073185j1604905j3016105p793903
$$ 815165579 810823023 804706156 796609342 787163615 777090430 765485525 752469420 744675517
1421.6G44675517L055275J4623940K1304667K0307004J2029648R51111j2285352k5056958
$$ 744675517 747730792 762354732 783659399 803966403 815996051 816947162 804661810 779604852
1437.9G79604852k4025559j0098398J0578334K6145280K9054403K2320688J4471531
$$ 779604852 755579293 745480895 756059229 782204509 811258912 833579600 848051131
1452.2H48051131R481370O708443M274488J955032R91702M03524j67430j71303j1087
$$ 848051131 857532501 864240944 868515432 870470464 871462166 871865690 871698260 871526957 871515870
1470.6H71515870l36051r58741j191556j099646j091182j220644j117289p19547n38469
$$ 871515870 871179819 870221078 869029522 867929876 866838694 865618050 864500761 863781214 863242745
1488.9H63242745r16779j321017j617909k007544k210319k327204k459466l185451
$$ 863242745 862325966 861004949 859387040 857379496 855169177 852841973 850382507 847197056
1505.2H47197056m865885n170763n395174o343781o868303o170154l457427K19643
$$ 847197056 842331171 837160408 831765234 825421453 818553150 812382996 808925569 809145212
1521.6H09145212L252924M487753M439652L808319L195763K169370O85156n69344j958787
$$ 809145212 812398136 816885889 821325541 825133860 828329623 830498993 831184149 830614805 828656018
1539.9H28656018k538502k131284k313971k653420k959073k968371k884388l010571
$$ 828656018 826117516 823986232 821672261 819018841 816059768 813091397 810207009 807196438
1556.2H07196438m565954o067574m538357m919708o666720r215653j2599110j1339426
$$ 807196438 802630484 796562910 792024553 787104845 780438125 771222472 758623362 747283936
1572.6G47283936j916707J4102459J5996814L826856n098760r911716j3170421j5635073
$$ 747283936 745367229 759469688 775466502 779293358 774194598 764282882 751112461 735477388
1588.9G35477388j7766357k0087719k2225916k2067964j7928123r771944J438916J2595475
$$ 735477388 717711031 697623312 675397396 653329432 635401309 625629365 627068281 639663756
1605.2F39663756K0515382K3731590K0544230J1482776r14753j4122844j8300831j6009986
$$ 639663756 660179138 683910728 704454958 715937734 715022981 700900137 682599306 666589320
1621.5F66589320j1309564j915396O161392Q615553O082833K483249J657248P163822
$$ 666589320 655279756 653364360 659525752 668141305 674224138 676707387 678364635 685528457
1637.8F85528457J4403284J8236279J6548515J1123180K954185l979444j2348176k2703766
$$ 685528457 699931741 718168020 734716535 745839715 748793900 744814456 732466280 709762514
1654.1G09762514j7497003j1576951q805811n439222k276421m43816J74105M39882
$$ 709762514 692265511 680688560 671882749 666443527 664167106 663723290 663897395 664337277
1670.5F64337277N90682N58675N42879J013934J723171L444612P147670R699940J1331260
$$ 664337277 664927959 665486634 666029513 667043447 668766618 672211230 679358900 689058840 700390100
1688.8G00390100J3574780J3630986J4412105J4734506J2952686J3083100J0684788
$$ 700390100 713964880 727595866 742007971 756742477 769695163 782778263 793463051
1703.1G93463051R020567R208977Q115590O947458O140947N792320O112158N517543
$$ 793463051 802483618 811692595 819808185 826755643 832896590 838688910 844801068 850318611
1719.4H50318611M121542L476202L279209L006995K695501K149820J861334J679957
$$ 850318611 854440153 857916355 861195564 864202559 866898060 869047880 870909214 872589171
1735.7H72589171J199543P09653K11954l5405J2338J41204K03013M77791R12845J209557
$$ 872589171 873788714 874498367 874710321 874674916 874687254 874828458 875031471 875509262 876422107 877631664
1756.1H77631664J097143P28786N24700M51505K80082r2387l90887l86298k16544k68221
$$ 877631664 878728807 879457593 879982293 880433798 880713880 880621493 880230606 879844308 879627764 879359543
1776.5H79359543l41475j19745K26080K55287P1764J11282L07738L64423J44720p7009
$$ 879359543 879018068 878898323 879124403 879379690 879451454 879562736 879870474 880234897 880379617 880302608
1796.9H80302608l5286J91271J30356j38462j74224N2690J83821o676j88827p4327
$$ 880302608 880267322 880458593 880588949 880450487 880276263 880328953 880512774 880506098 880317271 880242944
1817.3H80242944J65641J33097j38283k19166J5617Q0168j69218k97665j26064J07050
$$ 880242944 880408585 880541682 880403399 880184233 880199850 880280018 880110800 879813135 879687071 879794121
1837.7H79794121P0810j63555k84374j06692m7207l07381m73559k93851k6047m3214
$$ 879794121 879864931 879701376 879417002 879310310 879263103 878955722 878482163 878188312 878162265 878119051
1858.1H78119051k38001j85847J30951K26975j14322l92318j71721R3818p689k70069
$$ 878119051 877881050 877695203 877826154 878053129 877938807 877546489 877374768 877468586 877460897 877190828
1878.5H77190828k33292N9843J33335j13785l28481k15054k6583j86622n09143n49734
$$ 877190828 876957536 877017379 877150714 877036929 876708448 876493394 876466811 876280189 875771046 875221312
1898.9H75221312l98397m48525p85947j080275q74698j97232K63572K41876K90394
$$ 875221312 874822915 874374390 873588443 872508168 871633470 871436238 871699810 871941686 872232080
1917.3H72232080O45518P83264M57466Q8871O3121J83880J20282l4272N2929L27766
$$ 872232080 872877598 873660862 874118328 874207199 874270320 874454200 874574482 874540210 874593139 874920905
1937.7H74920905L65495O5983j66536p1466O2406l9577k14040j50741R0778J01209
$$ 874920905 875286400 875352383 875185847 875114381 875176787 875137210 874923170 874772429 874863207 874964416
1958.1H74964416j93238l52919j52767M9114q1777l11196k70665k9981O0677j04725
$$ 874964416 874771178 874418259 874265492 874314606 874232829 873921633 873650968 873620987 873681664 873576939
1978.5H73576939k27690r7692O0559m0830k69174k64645n0783k4855k75135m32432
$$ 873576939 873349249 873251557 873312116 873271286 873002112 872737467 872686684 872661829 872386694 871954262
1998.8H71954262k65121r0420k26438m49479m33147k80857l02375m97162m56512j7166
$$ 871954262 871689141 871598721 871372283 870922804 870489657 870208800 869906425 869409263 868952751 868935585
2019.2H68935585L26514K10226p2539j04129K6643k7180k84731m20094k72810j15574
$$ 868935585 869262099 869472325 869399786 869295657 869322300 869295120 869010389 868590295 868317485 868201911
2039.6H68201911k18153m13417l72887j67310j33395k99514l23951p3016J66536J45018
$$ 868201911 867983758 867570341 867197454 867030144 866896749 866597235 866273284 866200268 866366804 866511822
2060H66511822M2677J42276L18408K75493L8385r3639k0802K3067j36912k90096j74641
$$ 866511822 866554499 866696775 867015183 867290676 867329061 867235422 867214620 867237687 867100775 866810679 866636038
2082.5H66636038N9664R5189q1063j71959m9114P5757L636j23024p1823N4776N96k06470
$$ 866636038 866695702 866790891 866709828 866537869 866488755 866564512 866568148 866445124 866373301 866428077 866428673 866222203
2106.9H66222203k97725j86384q2374j79231l36647l06308j61946j57356k91825l25679
$$ 866222203 865924478 865738094 865655720 865476489 865139842 864833534 864671588 864514232 864222407 863896728
2127.3H63896728j82391n0485r2029j98663j47819J8537N1319p3552j32739l0399N3585
$$ 863896728 863714337 863663852 863571823 863373160 863225341 863243878 863295197 863221645 863088906 863058507 863112092
2149.8H63112092k8849j46806j11341J5497L7968o4373j33097o3896K9087r716j17183
$$ 863112092 863083243 862936437 862825096 862840593 862878561 862814188 862681091 862617195 862646282 862636566 862519383
2172.2H62519383j23143k9683k1219j69575k94686k38120j08242j10805k26558k42590
$$ 862519383 862396240 862366557 862345338 862175763 861881077 861642957 861534715 861423910 861197352 860954762
2192.6H60954762j22905q4698k46108l98338l30984j80722j80006k70188k36570o9798
$$ 860954762 860831857 860747159 860501051 860102713 859771729 859591007 859411001 859140813 858904243 858834445
2213H58834445M6194j4543j49191j40905l1948o6698k19345k43783j05500k9326j40488
$$ 858834445 858880639 858866096 858716905 858576000 858544052 858477354 858258009 858014226 857908726 857879400 857738912
2235.4H57738912k63154k03193o5326q7381k37286k85029j73033j11222k44677l66449
$$ 857738912 857475758 857272565 857207239 857119858 856882572 856597543 856424510 856313288 856068611 855702162
2255.8H55702162k59459r3103j27911k76268k79367j38759r9719k44558l51965k51889
$$ 855702162 855442703 855349600 855221689 854945421 854666054 854527295 854427576 854183018 853831053 853579164
2276.2H53579164r7394j13190k54869l03865k38418k56956l90053m61042m09007l54766
$$ 853579164 853481770 853368580 853113711 852809846 852571428 852314472 851924419 851463377 851054370 850699604
2296.6H50699604m43817o12557o50823n74529o01590p74979q60274p15792n74350p52569
$$ 850699604 850255787 849643230 848992407 848417878 847816288 847041309 846181035 845465243 844890893 844138324
2317H44138324j128196j198590q29935n69821p97271j044572p86185l69668l84689
$$ 844138324 843010128 841811538 840981603 840411782 839614511 838569939 837783754 837414086 837029397
2335.4H37029397o16431n74231l01957J28984R14872J131654r596j586378k464593
$$ 837029397 836412966 835838735 835536778 835665762 836580634 837712288 837702692 836116314 833651721
2353.7H33651721k393901j881599j145065m18008P2063M73737R68993J384258J486242
$$ 833651721 831257820 829376221 828231156 827813148 827885211 828358948 829327941 830712199 832198441
2372.1H32198441J390517J359343J394749J258433Q15689L06070K9922n2035j67131
$$ 832198441 833588958 834948301 836343050 837601483 838417172 838723242 838753164 838701129 838533998
2390.4H38533998l43264m13894l36945k96653m10139n01335l99172k35796k24710l27885
$$ 838533998 838190734 837776840 837439895 837143242 836733103 836231768 835832596 835596800 835372090 835044205
2410.8H35044205l42309k33352j94610l12149m18544l84450k84553k85029m00484m54783
$$ 835044205 834701896 834468544 834273934 833961785 833543241 833158791 832874238 832589209 832188725 831733942
2431.2H31733942m01974m16934n88834p38383o65366m88878m48346n23925n20527l84808
$$ 831733942 831331968 830915034 830326200 829587817 828922451 828433573 827985227 827461302 826940775 826555967
2451.6H26555967k73585k92242l33428k46465q2314m2796j65820k36392j59383j60814
$$ 826555967 826282382 825990140 825656712 825410247 825327933 825285137 825119317 824882925 824723542 824562728
2472H24562728l59296n48065n70357n09441n19931n87702n11408k98261k18451l50118
$$ 824562728 824203432 823655367 823085010 822575569 822055638 821467936 820956528 820658267 820439816 820089698
2492.4H20089698m91858m72486l96549m76659o59823p18534o18816n72383o93619p80702
$$ 820089698 819597840 819125354 818728805 818252146 817592323 816873789 816254973 815682590 814988971 814208269
2512.8H14208269o76334n44429n75721p08461p35283o36816o33537p95365r22978q77380
$$ 814208269 813531935 812987506 812411785 811703324 810968041 810331225 809697688 808902323 807979345 807101965
2533.2H07101965p64191p53284q29041q06749o12139m15266l28481k16126M0829L07023
$$ 807101965 806337774 805584490 804755449 803948700 803336561 802921295 802592814 802376688 802417517 802724540
2553.6H02724540M28617N23091P92026J193464J477241J526833J462758J433611J366496
$$ 802724540 803153157 803676248 804468274 805661738 807138979 808665812 810128570 811562181 812928677
2572H12928677J055181N74410J87456p2300l77596p62820j032352j021803p71224m16518
$$ 812928677 813983858 814558268 814745724 814673424 814295828 813533008 812500656 811478853 810707629 810291111
2592.4H10291111j907N00083R95994J229047J097978Q14616N90444L80516L7730l47197
$$ 810291111 810289204 810789287 811785281 813014328 814112306 814926922 815517366 815897882 815935612 815588415
2612.8H15588415n50807n94675o81997q56817r16957p30813m68433l21269k53677j66595
$$ 815588415 815037608 814442933 813760936 812904119 811987162 811256349 810787916 810466647 810212970 810046375
2633.2H10046375q1718j29581l79979o22392o18517n06103n32151o16252n64158m42863
$$ 810046375 809964657 809835076 809455097 808832705 808214188 807708085 807175934 806559682 805995524 805552661
2653.5H05552661m24683n26309n71608m15623k18451j84834k24233j28687P8083J79350
$$ 805552661 805127978 804601669 804030061 803614438 803395987 803211153 802986920 802858233 802936316 803115666
2673.9H03115666J41025K08854N25296R27865J253725J527845J817048K027988J957953
$$ 803115666 803256691 803465545 803990841 804918706 806172431 807700276 809517324 811545312 813503265
2692.3H13503265J641155J353204J196682J007796P09772M31835K88606K29538J10685
$$ 813503265 815144420 816497624 817694306 818702102 819411874 819843709 820132315 820361853 820472538
2710.7H20472538q7022j78516j19031r6559j78099k46286k04563j51575j70171j75655
$$ 820472538 820385516 820207000 820087969 819991410 819813311 819567025 819362462 819210887 819040716 818865061
2731.1H18865061j16408O676M4346j23442k89380k77877k15292l12567n81384p68840
$$ 818865061 818748653 818755329 818799675 818676233 818386853 818108976 817893684 817581117 816999733 816230893
2751.4H16230893p14421o09160o60836p43568o84738n55695n04612n15521m68612l62098
$$ 816230893 815516472 814907312 814246476 813502908 812818170 812262475 811757863 811242342 810773730 810411632
2771.8H10411632l15726m56929o45757o31749n25475n26726n56052m99189m44233m40478
$$ 810411632 810095906 809638977 808993220 808361471 807835996 807309270 806753218 806254029 805809796 805369318
2792.2H05369318m09782l43860l26275l77834m50850n44071n85735n29170n52058p24137
$$ 805369318 804959536 804615676 804289401 803911567 803460717 802916646 802330911 801801741 801249683 800525546
2812.6H00525546q24273p48753o16312n21183m45902k80142J2755K83718L91364L97563
$$ 800525546 799701273 798952520 798336208 797815025 797369123 797088981 797101736 797385454 797776818 798174381
2833G98174381M54307N74827N51701L31044J90437J94013O8605k68460n44190n93245
$$ 798174381 798628688 799203515 799755216 800086260 800276697 800470710 800539315 800270855 799726665 799133420
2853.4G99133420n22375m55260m86374n51701m56571k68996j99497j43170K1159M8340
$$ 799133420 798611045 798155785 797669411 797117710 796661139 796392143 796192646 796049476 796070635 796118975
2873.8G96118975j33276j99974m3571J50859K22087J41323L5465L4630J03772J00851
$$ 796118975 795985699 795785725 795742154 795893013 796115100 796256423 796291888 796326518 796430290 796531141
2894.2G96531141n9962k29657k32101k06768l22879m65929m52280k62141j19806k10523
$$ 796531141 796471179 796241522 796009421 795802653 795479774 795013845 794561565 794299424 794179618 793969095
2914.6G93969095l24726k31922m0114J31428K61486L94404M30167J21593k94447m44949
$$ 793969095 793644369 793412447 793372333 793503761 793765247 794159651 794589818 794711411 794416964 793972015
2935G93972015m21226l87430l14534k40147k94029m72069n78582m94123m54903n13374
$$ 793972015 793550789 793163359 792848825 792608678 792314649 791842580 791263998 790769875 790314972 789801598
2955.4G89801598m56274l49581k79665k14458j78873j69814j00195J09076L12209L08514
$$ 789801598 789345324 788995743 788716078 788501620 788322747 788152933 788052738 788161814 788474023 788782537
2975.8G88782537K68936K85208J74284P5460J53661K84731M67718N68270L69430J69635
$$ 788782537 789051473 789336681 789510965 789586425 789740086 790024817 790492535 791060805 791430235 791599870
2996.2G91599870J24871J14978K07186K94148L46780N47171P61807O54399K56777l1650
$$ 791599870 791724741 791839719 792046905 792341053 792687833 793235004 793996811 794651210 794907987 794876337
3016.6G94876337l1471N2094O9738L9756N424P1049J58369J02878j05143k81810k10047
$$ 794876337 794844866 794896960 794966698 795006454 795011878 795082927 795241296 795344174 795239031 794957221 794747174
3039G94747174j01090k55763n77748q47459q61764n53906j56820J35303L22342M46081
$$ 794747174 794646084 794390321 793812573 792965114 792103350 791549444 791392624 791527927 791850269 792296350
3059.4G92296350N42521O04392O41107N46873L21805K66433M43757O56962P05481M88817
$$ 792296350 792838871 793443263 794084370 794631243 794953048 795219481 795663238 796320200 797025681 797514498
3079.8G97514498L03984L31640L37124L17276L14176K16305J66118K91467M47511M44353
$$ 797514498 797818482 798150122 798487246 798804522 799118698 799335003 799501121 799792588 800240099 800684452
3100.2H00684452L06368K78354M07040M14848K28584K00271L94404M42923K84075N7042
$$ 800684452 800990820 801269174 801676214 802091062 802319646 802519917 802914321 803357244 803641319 803698361
3120.6H03698361j21832p6354J17064K20358J69814Q9824J08779J89960J55270o3360
$$ 803698361 803576529 803500175 803617239 803837597 804007411 804097235 804206014 804395974 804551244 804487884
3141H04487884k07901j25408K3961J78873K60711M9770k79307l46661k44975k07543
$$ 804487884 804279983 804154575 804178536 804357409 804618120 804667890 804388583 804041922 803796947 803589404
3161.4H03589404k37584k72573k84254k82347k85924l17752l60966l59773l32594l64185
$$ 803589404 803351820 803079247 802794993 802512646 802226722 801908970 801548004 801188231 800855637 800491452
3181.8H00491452m34637m95970n71251o70314p68959q24035q59558r78649j147210
$$ 800491452 800056815 799560845 798989594 798319280 797550321 796726286 795866728 794888079 793740869
3200.1G93740869j232803j245618j230598j193463j126230j037061j007498j063823
$$ 793740869 792508066 791262448 790031850 788838387 787712157 786675096 785667598 784603775
3216.5G84603775j207114j468956j741946j899898j891851j568854q15213J21236P88390
$$ 784603775 783396661 781927705 780185759 778285861 776394010 774825156 774009943 774131179 774919569
3234.8G74919569J102865J234055J222491J080632Q41558N69642L81291L75688M73201
$$ 774919569 776022434 777256489 778478980 779559612 780401170 780970812 781352103 781727791 782200992
3253.2G82200992N14746N03599M77672L93689K30908N9903r120k6226k08199n20646
$$ 782200992 782715738 783219337 783697009 784090698 784321606 784381509 784372389 784346163 784137964 783617318
3273.6G83617318p14660p45714p63416q62837r82642j015663r59873r22382j012922
$$ 783617318 782902658 782156944 781393528 780530691 779548049 778532386 777572513 776650131 775637209
3291.9G75637209j190960j333177j444459j481712j348197j176298j257479j653791
$$ 775637209 774446249 773113072 771668613 770186901 768838704 767662406 766404927 764751136
3308.2G64751136k024710k118826k095699k203941k450228k638400k705991k836883
$$ 764751136 762726426 760607600 758511901 756307960 753857732 751219332 748513341 745676458
3324.6G45676458l130198l421306l544331l586471l722787l953039m244030m570663
$$ 745676458 742546260 739124954 735580623 731994152 728271365 724318326 720074296 715503633
3340.9G15503633m902065n359351n952657o572544p401824q548081r646475j0166467
$$ 715503633 710601568 705242217 699289560 692717016 685315192 676767111 667120636 656954169
3357.2F56954169r616196p542908l636837J677453O655753R119272Q136213M403412
$$ 656954169 647337973 639795065 636158228 637835681 644491434 653610706 661746919 666150331
3373.5F66150331n61773m924953o508887m046500J162887O125510Q794426R108246
$$ 666150331 665588558 660663605 654154718 650108218 651271105 657396615 666191041 675299287
3389.8F75299287P690549N339205L239155J946091J003445j7524p94590r54628r06705
$$ 675299287 682989836 688329041 691568196 693514287 694517732 694500208 693705618 692750990 691844285
3408.2F91844285j038850j237929j414716j496971j460552j434743j439572j411616
$$ 691844285 690805435 689567506 688152790 686655819 685195267 683760524 682320952 680909336
3424.5F80909336j347959j311601j379966j379788j268626j400351j698375j715898
$$ 680909336 679561377 678249776 676869810 675490022 674221396 672821045 671122670 669406772
3440.8F69406772j562238j674712k245664l251851m652798o435037p879913p405042
$$ 669406772 667844534 666169822 663924158 660672307 656019509 649584472 641704559 634299517
3457.1F34299517l999770J399636O314516Q257330O598055L146529O72818P55131K696633
$$ 634299517 630299747 631699383 638013899 646271229 652869284 656015813 656688631 657443762 660140395
3475.5F60140395M889190O264627O527543O127775N519390M678130L744722L104806
$$ 660140395 665029585 671294212 677821755 683949530 689468920 694147050 697891772 700996578
3491.8G00996578K780020K553880K283454K083302K003133J773834J538635J602530
$$ 700996578 703776598 706330478 708613932 710697234 712700367 714474201 716012836 717615366
3508.1G17615366J773059J843870J721740J516700J495063J658618J818538J676560
$$ 717615366 719388425 721232295 722954035 724470735 725965798 727624416 729442954 731119514
3524.4G31119514J381814J386702J560330J678229J815200J792133J589000J647532
$$ 731119514 732501328 733888030 735448360 737126589 738941789 740733922 742322922 743970454
3540.8G43970454J897096J860559J483381J287818J473546J641095J618385J603425
$$ 743970454 745867550 747728109 749211490 750499308 751972854 753613949 755232334 756835759
3557.1G56835759J717031J814723J745343J700818J881719J964212J783788J686334
$$ 756835759 758552790 760367513 762112856 763813674 765695393 767659605 769443393 771129727
3573.4G71129727J798272J970947K158821K305925K282142K106250J960993K024829
$$ 771129727 772927999 774898946 777057767 779363692 781645834 783752084 785713077 787737906
3589.7G87737906K104282K093077K116323K199351K205491K135396K041758J958787
$$ 787737906 789842188 791935265 794051588 796250939 798456430 800591826 802633584 804592371
3606H04592371K068937K153754K023161J919507J807333J815557J912713J659155J331687
$$ 804592371 806661308 808815062 810838223 812757730 814565063 816380620 818293333 819952488 821284175
3624.4H21284175J211047J382589J639963J472532J290501J218259J084268J001596
$$ 821284175 822495222 823877811 825517774 826990306 828280807 829499066 830583334 831584930
3640.7H31584930J007796R46522Q29339R08911R01520N34058M06444O72579P60436
$$ 831584930 832592726 833539248 834368587 835277498 836179018 836713076 837119520 837792099 838552535
3659H38552535M74155K39729J63258K6226m5419P7665j4723j65045Q643J64985K26081
$$ 838552535 839026690 839266419 839429677 839455903 839410484 839488149 839473426 839308381 839317024 839482009 839708090
3681.5H39708090K91049L75688N47946N32091K94089K16961J70588Q0109K9504M1962
$$ 839708090 839999139 840374827 840922773 841454864 841748953 841965914 842136502 842216611 842246115 842288077
3701.9H42288077J15812J03950K3604N5551K31207K89261J08600j16587k36988k13862
$$ 842288077 842403889 842507839 842531443 842586994 842818201 843107462 843216062 843099475 842862487 842648625
3722.3H42648625j14500l100L8386R239J07824K81334K70725R9837j78039m52161l05175
$$ 842648625 842534125 842531025 842569411 842578650 842686474 842967808 843238533 843338370 843160331 842708170 842402995
3744.7H42402995M6968q8751j60396R8526J35243k8133j12236n4836j1325k6941q8930
$$ 842402995 842449963 842361212 842200816 842299342 842434585 842406452 842294216 842239380 842228055 842201114 842112184
3767.1H42112184j25587l7671K8134k444k5332k4795r8527j72615j15216k3424j9908
$$ 842112184 841986597 841948926 841977060 841974616 841949284 841924489 841825962 841653347 841538131 841514707 841494799
3789.6H41494799r8110j88231j88112j72317k84195k12729K0444j6034n6684k6404
$$ 841494799 841396689 841208458 841020346 840848029 840563834 840351105 840371549 840355515 840298831 840272427
3810H40272427j36972k92778k23815o2168j38938j02461J848n9485r8706j22189o8844
$$ 840272427 840135455 839842677 839618862 839556694 839417756 839315295 839317143 839257658 839158952 839036763 838967919
3832.4H38967919K6465p2837j62721n9187J9073N8234L4869j25647m23848n58496k8253
$$ 838967919 838994384 838921547 838758826 838699639 838718712 838776946 838811815 838686168 838262320 837703824 837675571
3854.8H37675571K81394O5744q2255j02162p7307j14739j92106j22070k4021k503m1664
$$ 837675571 837956965 838022709 837940454 837838292 837760985 837646246 837454140 837332070 837308049 837305546 837263882
3877.3H37263882o5029M2677L4035j25707k08258j89841o1750Q5771L3498j46449k28047
$$ 837263882 837198853 837241530 837275565 837149858 836941600 836751759 836690009 836775780 836809278 836662829 836434782
3899.7H36434782j91749j40905o1691l4570m2856o557j5497n8889l8565j6212p5519
$$ 836434782 836243033 836102128 836040437 836005867 835963011 835956454 835940957 835882068 835843503 835827291 835751772
3922.1H35751772j39892j19567q1480o2644l1829m1723o6638m1068k4259n3883q4221
$$ 835751772 835611880 835492313 835410833 835348189 835316360 835274637 835207999 835166931 835142672 835088789 835004568
3944.6H35004568o3002m3869q3923j05501n8591%j5855p2419r7812p8141j8776J4126
$$ 835004568 834941566 834897697 834813774 834708273 834649682 834649682 834633827 834561408 834463596 834385455 834366679 834380805
3969.1H34380805l2424j10925j23322j09970q7738L8922J15633k0504j66238j56522
$$ 834380805 834348381 834237456 834114134 834004164 833916426 833955348 834070981 834050477 833884239 833727717
3989.5H33727717j02996r1553j03593r0241
$$ 833727717 833624721 833533168 833429575 833339334
3997.6H33339334
$$ 833339334
##END=$$ End of the data block
