##TITLE=Renata Menger 1 $$ Begin of the data block
##JCAMP-DX=5.00 $$ ACD/SpecManager v 10.08
##SPECTROMETER/DATA SYSTEM=Alpha
##DATE=30 Sep 2014 13:58:06
##DATA TYPE=INFRARED SPECTRUM
##DATA CLASS=XYDATA
##ORIGIN=
##OWNER=
##NPOINTS=1765
##FIRSTX=399.76428223
##LASTX=3997.64306641
##MAXX=3997.64306641
##MINX=399.76428223
##MAXY=1.00304019
##MINY=0.44359916
##XFACTOR=1.0000000000
##YFACTOR=0.000000010000000
##FIRSTY=1.00000000
##DELTAX=2.03961372
##XUNITS=1/CM
##YUNITS=ARBITRARY UNITS
##XYDATA=(X++(Y..Y))
399.8 100000000 98764092 97400087 95957434 94076407 91600406 89775312 90319687 92960894 96276784
418.1 96276784 98745817 99610531 99672037 99694568 99898654 100000000 99708539 99023056 98364836 97912598
438.5 97912598 97268975 95775843 93417054 91175395 90124053 90663528 92428303 94472522 96137547
456.9 96137547 97418213 98374379 98840696 98612988 97867459 97028697 96167707 95045263 94008058
475.2 94008058 93959767 95193172 97035843 98638922 99456698 99476403 99266320 99375576 99780607 100000000
495.6 100000000 99725318 99198103 98898232 98939645 98874462 98199630 96983635 95915389 95733047 96513063
516 96513063 97516948 98035878 98195767 98502636 99031591 99344045 99154216 98729563 98574567 98836672
536.4 98836672 99125051 99004036 98527336 98158890 98199129 98410046 98303545 97732306 97021282 96520287
556.8 96520287 96127480 95366621 93970007 92336816 91349101 91633052 92918783 94309348 95242345
575.2 95242345 95837194 96327603 96442848 95646387 94175369 93401867 94396937 96441549 97958899
593.5 97958899 98377758 98150963 97870928 97769862 97612625 97136158 96456134 95915240 95728666 95868719
613.9 95868719 96117669 96267569 96350843 96526027 96708155 96449572 95285338 93144989 90431559 87936860
634.3 87936860 86689484 87230742 89044315 91256779 93426347 95364213 96781176 97483808 97716045
652.7 97716045 97983915 98517632 99072284 99275321 99109089 98893172 98990381 99513674 99781227 99614996
673.1 99614996 99343526 99332035 99638659 99933106 99897730 99608201 99442410 99616778 99925011 100000000
693.5 100000000 99760848 99494284 99521089 99800408 99987745 99851239 99540949 99401700 99569798 99819022
713.9 99819022 99832600 99583286 99361378 99421990 99668157 99789357 99626756 99354500 99279791 99470925
734.3 99470925 99676162 99619412 99325931 99097741 99142271 99328709 99369949 99160922 98891383 98821521 98976386
756.7 98976386 99116451 99016148 98737937 98558283 98623514 98774773 98747998 98491848 98220348 98156959
777.1 98156959 98276448 98335546 98161072 97851819 97654140 97671884 97748530 97650808 97347891 97040850 96915692
799.5 96915692 96927625 96846479 96525949 96082312 95743728 95557064 95328742 94845462 94101298 93285781
819.9 93285781 92527193 91700274 90543962 88909596 86722010 83736962 79903358 76274341 74602467
838.3 74602467 75383997 77283734 78769553 79338074 79640317 81166828 84663516 89006698 92624432
856.6 92624432 94949180 96219403 96952093 97628558 98451775 99287719 99848098 100000000 99911314 99830151
877 99830151 99825376 99737251 99397242 98842901 98255527 97694868 96980786 95988584 95086282 94947833 95716554
899.5 95716554 96757501 97390193 97453833 97186530 96900213 96728253 96556485 96209294 95682883 95153958
919.9 95153958 94769835 94485861 94121784 93563879 92877209 92198825 91572523 90938973 90166038 89082843
940.3 89082843 87618011 85807025 83635104 81011087 77943629 74994797 73677361 75206226 78617972
958.6 78617972 81569213 82581955 81591457 79059529 75385511 71033287 66706568 63255429 61400783
977 61400783 61464518 63250226 66190743 69664907 73205179 76523900 79434037 81755197 83280241
995.3 83280241 83822674 83579075 83475184 84048170 84374684 83302075 80553514 76484334 72291863
1013.7 72291863 70209187 71934068 76785004 82524651 87419605 90855896 92943877 94102389
1030 94102389 94770634 95214063 95460093 95416915 95070457 94550627 93999141 93410933 92677909 91764718
1050.4 91764718 90757203 89750868 88718462 87500012 85926330 83954167 81709999 79489142
1066.7 79489142 77696526 76587385 76047069 75777084 75559258 75154924 74328083 73390526 73392069 75073802
1087.1 75073802 77940261 80965513 83562332 85591877 87112880 88266832 89175266 89879137 90383363
1105.5 90383363 90741557 91056859 91390514 91703665 91913104 91999793 92048466 92161608 92347986 92517036
1125.9 92517036 92592692 92605960 92646515 92748660 92846787 92842788 92717785 92544931 92388886 92224050 91951269
1148.3 91951269 91507691 90951592 90410483 89943719 89461535 88791138 87858111 86865449 86268067 86355746
1168.7 86355746 86835390 87153298 87151754 87020123 86822259 86442125 85792422 84861624 83682513 82308757
1189.1 82308757 80765408 79021508 77029562 74822611 72583300 70606887 69200009 68567610 68690979
1207.5 68690979 69329119 70261341 71489286 73134321 75228637 77617621 79983968 81986290 83405221
1225.8 83405221 84174961 84344834 84027207 83324325 82292902 81045777 79898506 79314971 79442471
1244.2 79442471 79694366 79295522 78265619 77293766 76679474 76182771 76092732 77336192 79815853
1262.5 79815853 82009250 82932079 82858825 82214087 81093848 79449791 77197629 74571645 72513115
1280.9 72513115 71797931 71838915 71530062 70561337 69170129 67576170 65930212 64352959 62927461
1299.2 62927461 61704642 60748166 60123521 59812701 59667033 59508276 59247839 58908492 58592248 58441925
1319.6 58441925 58582634 59066105 59882295 60994184 62381274 64035636 65939289 68075067 70475394
1338 70475394 73035985 75362366 77194852 78479224 79088372 78938991 78243709 77488148 77132314
1356.4 77132314 77377927 78193676 79413867 80718440 81941670 83107400 83882499 83463770 81508636
1374.7 81508636 79263991 77849942 77156001 76796132 76024383 74624193 73842508 74165416 74445814
1393.1 74445814 73797381 72933191 73364514 75348336 77816486 79898942 81238270 82079446 82852840
1411.4 82852840 83700103 84541547 85332555 85997581 86308020 86373174 86424404 86552995 86740655 86845338
1431.8 86845338 86920351 87344468 88035125 88381100 88279343 87799680 87194914 86937040 87091601 87214273
1452.2 87214273 87029284 86605161 86373127 86602771 87081474 87695038 88342983 88930964 89538431 90225434
1472.6 90225434 90784639 91172516 91544050 91943914 92301738 92544055 92738456 93001026 93295902 93487638
1493 93487638 93652898 93903583 94137794 94261932 94312364 94455242 94771838 94913501 94911337 94942671 94998205
1515.4 94998205 95015097 94981903 94994307 95028150 95060217 95121306 95144629 95204902 95380187 95475727 95476878 95584506
1539.9 95584506 95680326 95700270 95774323 95877254 95953476 95946163 95859545 95739210 95687497 95528978 95101058
1562.4 95101058 94689560 94494373 94597292 94890738 95063031 95177305 95419985 95568711 95554560 95485866
1582.8 95485866 95366979 95216125 95078844 94949585 94787782 94556284 94251573 93929130 93667024 93491417
1603.2 93491417 93337637 93138635 92883962 92584860 92248189 91920161 91610062 91267008 90976340 90818179
1623.5 90818179 90697324 90537280 90349233 90154183 90087378 90255326 90376586 90316099 90233600 90227193 90417236
1646 90417236 90664876 90701455 90888447 91425264 91645718 91637498 91641557 91660511 91609055 91452289 91271138
1668.4 91271138 91023463 90656829 90343279 90109777 89770591 89279306 88780528 88508880 88471937 88520485
1688.8 88520485 88576674 88556409 88496923 88363361 88073289 87643909 87052774 86317182 85468966 84571272
1709.2 84571272 83637303 82632005 81483608 80039430 78395629 76746410 74988919 73142087 71354342
1727.6 71354342 69679546 68177527 66684109 65190929 63715810 61811835 59347576 56495154
1743.9 56495154 53349662 50159675 47266224 45202333 44359916 44776443 46377110 48865807 51893151
1762.2 51893151 54587275 56567472 58078104 59176648 59966236 60360610 60308385 59935725 59328210
1780.6 59328210 58595163 57873750 57286930 57008833 57353717 58623379 60484904 62522745 64707500
1799 64707500 66891736 68774277 70231855 71384043 72359884 73210180 73906380 74496460 75104272
1817.3 75104272 75765389 76432806 77082086 77674448 78146446 78623271 79168957 79715085 80290389 80870426
1837.7 80870426 81345880 81717563 82087713 82381499 82494539 82499784 82497299 82605332 82900864 83321935
1858.1 83321935 83737266 84056121 84285694 84531903 84907877 85339558 85668516 85917330 86146408 86376667
1878.5 86376667 86612999 86835575 87020403 87172288 87350166 87569302 87778497 87963921 88117516 88237697
1898.9 88237697 88362020 88498944 88617724 88694435 88741219 88786834 88843769 88923562 89042616 89166987 89274108
1921.3 89274108 89421499 89600492 89761680 89896798 90009046 90119570 90243632 90367925 90472728 90574312
1941.7 90574312 90677589 90772301 90870088 90962231 91030371 91083896 91151142 91248727 91358560 91443080 91496098
1964.2 91496098 91548640 91616482 91683680 91742462 91792327 91839802 91908872 92005837 92103553 92170584 92209369 92246050
1988.7 92246050 92308521 92396241 92469364 92515558 92557949 92612922 92680675 92745507 92790228 92814571 92835796 92870867
2013.1 92870867 92919582 92966431 92992973 93006349 93029726 93061805 93083358 93083251 93069637 93063372 93080580 93116486
2037.6 93116486 93151546 93172652 93177992 93171203 93150616 93109953 93058574 93030250 93052602 93121171 93211037 93299109
2062.1 93299109 93381000 93464696 93554491 93644243 93718547 93770456 93813574 93864107 93919635 93964905 93989551 94001579
2086.6 94001579 94022143 94056952 94091702 94119674 94146377 94181627 94232827 94292164 94342130 94376856 94407368 94439948
2111 94439948 94463980 94464707 94445848 94427276 94414932 94387525 94319481 94227201 94176906 94213086 94300902 94379300
2135.5 94379300 94423300 94436300 94425875 94398922 94362837 94325376 94302237 94311142 94357228 94429731 94512296 94592458
2160 94592458 94668132 94744885 94821602 94888651 94937903 94973522 95005858 95037609 95063472 95078021 95082557 95088071
2184.5 95088071 95102465 95118946 95130253 95137352 95145673 95163435 95195204 95230997 95256460 95272613 95286363 95292717
2208.9 95292717 95282513 95252484 95211929 95185447 95187908 95212501 95245242 95273280 95291853 95301741 95296264 95267582
2233.4 95267582 95227468 95211762 95253760 95347166 95449239 95522237 95558536 95567071 95553333 95515448 95451051 95375854
2257.9 95375854 95327419 95332134 95374322 95409793 95406628 95372552 95348036 95369989 95436949 95515943 95581508 95632136
2282.3 95632136 95678967 95727140 95763284 95774251 95771360 95778447 95802665 95827007 95829999 95803326 95754093 95689380
2306.8 95689380 95606881 95515412 95438284 95380187 95331389 95297664 95285392 95282495 95262867 95227647 95218271 95244348
2331.3 95244348 95261610 95250386 95235991 95254332 95343608 95527482 95725667 95732796 95543039 95350021 95271593
2353.7 95271593 95259732 95263523 95288974 95334834 95385373 95435292 95480037 95521492 95572442 95633614 95694810 95747948
2378.2 95747948 95789361 95815003 95818001 95791918 95747340 95711267 95709503 95752662 95827830 95908684 95981318 96050155
2402.7 96050155 96122378 96196783 96261579 96305811 96332961 96358913 96392083 96423161 96439821 96441698 96439248 96443439
2427.2 96443439 96457392 96472704 96480268 96483129 96492749 96513820 96536541 96547830 96548992 96552289 96565855 96587354 96601880
2453.7 96601880 96598989 96586895 96579337 96580625 96583325 96583050 96584934 96591711 96603101 96616715 96624267 96623862 96623534 96630740
2482.2 96630740 96644938 96654987 96653050 96644849 96637398 96630818 96624827 96619642 96618789 96628487 96646142 96664673 96676391
2508.7 96676391 96669495 96644777 96622741 96614313 96611500 96606505 96597946 96587670 96577293 96565783 96554732 96551001 96559888
2535.3 96559888 96584290 96617514 96642709 96654141 96658564 96660537 96658933 96650445 96635884 96623951 96625906 96642900 96664429
2561.8 96664429 96676624 96668345 96642548 96614826 96589339 96557033 96518248 96488118 96478802 96486652 96496862 96497661 96492237
2588.3 96492237 96490788 96499056 96513337 96522957 96527570 96535957 96554375 96582967 96612275 96632344 96645331 96660918 96682870
2614.8 96682870 96702003 96698934 96666718 96629530 96618998 96639615 96670169 96690851 96703142 96719724 96740073 96753287
2639.3 96753287 96754426 96747655 96743166 96751291 96771562 96792418 96809381 96828824 96856660 96891236 96921533 96940625
2663.7 96940625 96954650 96972716 96998024 97022533 97034758 97035795 97037899 97049069 97062135 97064108 97054273 97045445 97049618
2690.3 97049618 97064537 97074831 97070968 97063440 97063529 97068632 97072315 97067761 97054201 97044992 97054523 97079921 97105366 97118276
2718.8 97118276 97120595 97125822 97138047 97141069 97117519 97067809 96995777 96907973 96845412 96852297 96909863 96968269
2743.3 96968269 97010440 97036994 97042984 97027469 97003156 96992451 97001195 97006595 96987116 96947503 96913159 96909523
2767.8 96909523 96934342 96961921 96979845 96997750 97021824 97041196 97041088 97016859 96980703 96953237 96941209 96935445
2792.2 96935445 96927345 96914911 96902120 96893376 96879703 96846527 96802300 96774054 96768284 96762192 96734053 96683717
2816.7 96683717 96629840 96596181 96591729 96598214 96587223 96552533 96512532 96478564 96442449 96394134 96327323 96247578
2841.2 96247578 96177423 96127647 96085387 96036315 95983726 95940816 95906228 95865399 95810163 95746702 95688528 95637059
2865.7 95637059 95570874 95470792 95349991 95240539 95166224 95127583 95098627 95057577 95015872 94992787 94980890
2888.1 94980890 94954264 94892752 94797689 94688666 94587362 94502205 94415814 94310892 94194221 94076121 93945199
2910.5 93945199 93755955 93447936 92988592 92373073 91569108 90472281 88932598 86986655 85205859
2928.9 85205859 84522057 85354769 87138033 88941944 90233350 90937972 91166443 91082036 90879583
2947.2 90879583 90738773 90784878 91067314 91533452 92055857 92522907 92895609 93192375 93444186 93661642
2967.6 93661642 93843246 94000626 94147831 94285464 94412750 94520593 94587839 94611579 94601315 94541419
2988 94541419 94387335 94073272 93487239 92469960 90918612 88968337 87189007 86375904 86742103
3006.4 86742103 87697113 88672990 89587927 90493536 91303742 91928238 92407739 92838305 93251151 93611151
3026.8 93611151 93897492 94127417 94318831 94475877 94604403 94720799 94829750 94913548 94962007 94990379
3047.2 94990379 95023882 95068502 95115048 95162672 95202774 95225114 95245087 95279425 95324540 95363307 95386332 95408714
3071.7 95408714 95448768 95507854 95570642 95616734 95643127 95658994 95669693 95683062 95699382 95704669 95704895 95717722
3096.1 95717722 95732808 95730597 95711881 95691431 95681369 95677400 95664167 95648956 95657772 95686823 95708156 95707673 95690906
3122.6 95690906 95674902 95672506 95677364 95677453 95674825 95676917 95685446 95691544 95681173 95656973 95634395 95621544 95620555 95625365
3151.2 95625365 95614547 95581293 95546263 95521539 95498973 95470685 95439327 95406300 95367146 95325547 95285159 95242012
3175.7 95242012 95200413 95160657 95114219 95062834 95008069 94948250 94888312 94828391 94763094 94694567 94626898 94558334
3200.1 94558334 94491148 94430333 94368368 94296342 94221085 94154769 94098675 94041169 93978101 93912053 93839836 93766826
3224.6 93766826 93702352 93641728 93577909 93510467 93430775 93340170 93253368 93168628 93086052 93015265 92948550 92874461
3249.1 92874461 92799264 92732334 92669940 92605740 92544484 92485821 92423600 92363894 92321122 92296189 92265123 92210549
3273.6 92210549 92140150 92066920 91999501 91941577 91887856 91826701 91758442 91701066 91656882 91594386 91492671
3296 91492671 91366327 91236138 91120851 91028637 90933681 90808809 90660524 90508723 90362418 90213627
3316.4 90213627 90053916 89880127 89699608 89527780 89353645 89156246 88940263 88720196 88505501 88297367
3336.8 88297367 88073355 87815332 87540835 87269020 87009698 86769456 86522639 86241490 85949814 85675639
3357.2 85675639 85411674 85138750 84849244 84557247 84269166 83968014 83643478 83315533 83008528 82727838
3377.6 82727838 82474238 82241112 82019013 81806904 81607407 81428915 81259656 81068563 80869919 80699176
3398 80699176 80543560 80373579 80192101 80022895 79874647 79733771 79591858 79454905 79326195 79213238
3418.4 79213238 79126996 79057723 78993410 78939563 78902066 78876740 78855675 78841853 78842068 78846616 78858763 78888613
3442.9 78888613 78941166 79025865 79110193 79170293 79235423 79316771 79405445 79503810 79612583 79715568 79806083
3465.3 79806083 79901975 80001456 80093580 80190432 80292857 80387497 80489528 80606169 80696261 80751085 80800951
3487.7 80800951 80844671 80876458 80922788 81012231 81141323 81304526 81527376 81779522 81970918 82116032
3508.1 82116032 82265812 82392806 82488221 82581371 82679349 82780838 82899839 83027917 83142495 83243322
3528.5 83243322 83327717 83418244 83589637 83871716 84189922 84480852 84777004 85135096 85506052 85783041
3548.9 85783041 86018801 86294299 86538911 86731750 86932862 87118542 87256330 87486887 87904662 88237858
3569.3 88237858 88372004 88521945 88768387 89057893 89357185 89617324 89824313 90139139 90659237 91055566
3589.7 91055566 91213918 91438013 91768771 92049879 92319912 92593104 92773443 92961460 93310654 93678212
3610.1 93678212 93946153 94147211 94287401 94579053 94992983 95140189 95035774 95058322 95602202 96183461
3630.5 96183461 96262795 96265858 96364594 96468818 96569765 96594208 96524823 96631140 97184932 97679740 97619587
3652.9 97619587 97521102 97707123 97815382 97783387 97760171 97668934 97587800 97790414 97991830 97950572 98214781
3675.4 98214781 98527658 98432493 98260266 98092121 97933632 98072052 98527914 98762596 98684871 98568696
3695.8 98568696 98498178 98523414 98691893 98766559 98617148 98490620 98644012 99009067 99099445 98886037
3716.2 98886037 98709124 98681802 98736525 98812038 98850793 98717558 98521686 98547411 98845142 99148601 99074900
3738.6 99074900 98665774 98537642 98960519 99068332 98918736 99234194 99525774 99342895 99125332 99165505
3759 99165505 99217826 99104726 99034804 99067211 99197137 99341375 99294382 99143571 99108046 99236083 99311215
3781.4 99311215 99280381 99293667 99310011 99283004 99219149 99141783 99143136 99124128 99158871 99417990 99458879 99406934
3805.9 99406934 99556673 99478656 99158186 99029970 99218893 99295789 99379003 99632120 99585015 99409252
3826.3 99409252 99318236 99252427 99215680 99154484 99231690 99520630 99660730 99621856 99547720 99335825 98960221
3848.7 98960221 98727536 99242747 100000000 99899882 99474877 99264234 99310386 99398339 99328637 99373084
3869.1 99373084 99563193 99585307 99471033 99265689 99191046 99283367 99328703 99480075 99557495 99496740 99634403
3891.6 99634403 99721777 99530083 99389195 99481279 99681973 99899578 99994659 99890387 99760592 99691105
3912 99691105 99652433 99712807 99855477 99911863 99874359 99880356 99896687 99842370 99833822 99919599 99951112 99885893
3936.4 99885893 99814445 99802798 99863976 99901950 99891347 99932492 100000000 100020206 100018108 100028205 100045455 100071990
3960.9 100071990 100103712 100115478 100116420 100131309 100159872 100198233 100235379 100247407 100246930 100265872 100294805 100304019
3985.4 100304019 100298166 100298178 100299060 100291348 100274432 100242996
3997.6 100242996
##END=$$ End of the data block
