##TITLE=Renata Menger 04 $$ Begin of the data block
##JCAMP-DX=5.00 $$ ACD/SpecManager v 10.08
##SPECTROMETER/DATA SYSTEM=Alpha
##DATE=24 Sep 2014 08:19:16
##DATA TYPE=INFRARED SPECTRUM
##DATA CLASS=XYDATA
##ORIGIN=
##OWNER=
##NPOINTS=1765
##FIRSTX=399.76428223
##LASTX=3997.64306641
##MAXX=3997.64306641
##MINX=399.76428223
##MAXY=0.89921963
##MINY=0.54675096
##XFACTOR=1.0000000000
##YFACTOR=1.000000000000000e-9
##FIRSTY=0.84917259
##DELTAX=2.03961372
##XUNITS=1/CM
##YUNITS=ARBITRARY UNITS
##XYDATA=(X++(Y..Y))
399.8 849172592 853240013 854248583 849941552 847036660 850379825 854565382 853027821 848561704
416.1 848561704 848440707 852346063 851891339 846679330 843463123 846106112 849880099 848451555 843676448
434.4 843676448 842859685 846932352 848808408 845077634 841622293 843785524 847535014 846458554 842077136
452.8 842077136 841313422 845252752 847151875 843636692 840256929 841860890 845402658 844712317 840313673
471.2 840313673 838799059 841980815 843941689 840951979 837170601 837956548 841150105 840422273 835489333
489.5 835489333 832348347 833624065 834196985 829309642 821685910 816941857 816156447 816305757 815686882
507.9 815686882 815941393 818875968 822428524 822906792 821218848 822288990 826822639 829678118 827661216
526.2 827661216 824867189 826308846 829903245 830038965 826351583 824361384 826773703 829241455 827352166
544.6 827352166 823637724 823557258 826789796 827712953 824295640 821367443 822991908 826128721 825524211
562.9 825524211 821924865 820817471 823859572 826173484 824091673 820922673 821611643 824993432 825713813
581.3 825713813 822704971 820795536 823104680 826193810 825424671 822208762 821806371 824890673 826563776
599.6 826563776 824121952 821043193 821438789 823550403 822206736 816775501 812140465 812164783 816627502
618 816627502 823582530 831681788 840322673 847744703 850589573 848259091 845398486 845960617 847022772
636.4 847022772 844202042 841015697 843509376 850071430 854567170 854086697 851719320 852494538 856344163
654.7 856344163 858448029 856714845 855109274 857314169 860751688 860345304 856521070 856996179 860989094
673.1 860989094 863883138 862803876 860304713 861011803 864444077 865739465 863146186 860465944 860683739
691.4 860683739 860685110 854848504 842745006 832562089 833901167 845259905 856183469 862126052
707.7 862126052 866813779 871955872 874381542 872853279 871266961 873224795 876619399 876987219 874680281
726.1 874680281 874182761 877091706 879622281 878488839 876028836 876550734 879643559 880899549 878775358
744.5 878775358 876910210 878504753 881344974 881140411 878121376 876541436 877859175 878322423 874259353
762.8 874259353 865913808 853391349 832594454 803813398 782666087 787472308 815571129 846301079
779.1 846301079 864711463 871662855 875204861 879835725 883626640 883779049 882099271 882715404 885949612
797.5 885949612 887840986 886389256 884741247 886238635 889190495 889531314 887095392 885893583 888040483
815.8 888040483 890529335 889807224 887268245 887003958 889271080 890065730 887381375 884305000 883986056
834.2 883986056 884208679 879709899 868314624 853091538 840284467 834418714 836256802 845502198
850.5 845502198 859304845 871801376 878917456 880812585 881378353 884199440 888036788 889059722
866.8 889059722 886864901 885140359 886183441 887691200 886543214 883792102 883333981 886275768 889297545
885.2 889297545 889654696 889068365 890451312 893035233 893625855 891765058 890533507 891913652 893834412
903.5 893834412 893357754 891220272 890656233 892361939 893495977 892123520 890181482 890459955 892312944
921.9 892312944 892685473 890838802 889457524 890459239 892092168 891675055 889699996 889036179 890468776
940.3 890468776 891525507 890288949 888270617 888049603 889296293 889278054 887152493 885357320 885877550
958.6 885877550 887185216 886557341 884303033 883346796 884719133 886060417 885242045 883379340 882908463
977 882908463 883886456 884036720 882266104 880363703 880267859 881111741 880621791 878598332 877114475 877288342
997.4 877288342 877571464 876060486 873373330 871608853 870888710 868882716 864268899 858757377 854419887
1015.7 854419887 850670874 845404863 838566303 833338678 833467066 839598596 848418057 856109381
1032 856109381 861803293 866186678 868815362 869118333 868357956 868502915 869679570 870144188 868993580
1050.4 868993580 867574453 867393494 867813170 867060959 864942908 863073230 862341046 861554444 859237313
1068.8 859237313 855881035 853307962 852095664 850993693 849137425 847547352 847608209 848810732 849217594
1087.1 849217594 848070741 846592307 845821798 844731629 841335833 835083067 826880097 816866219
1103.4 816866219 803834379 788134634 774607599 769573927 774064958 782862723 789541304 790637612
1119.8 790637612 786231458 778853238 773690760 776742518 789091289 805544615 820235014 830870986
1136.1 830870986 838317394 844472647 849999726 853801191 855087638 854926467 854868472 854673564 852676988
1154.4 852676988 848579943 844213724 840455651 834424496 820498943 793490887 752554297 706987083
1170.7 706987083 678412437 687511384 732055366 787114084 830120981 855169892 866852105
1185 866852105 871873677 874924541 877139866 877686143 876710832 875896454 876321018 877106428 876954079
1203.4 876954079 876250744 876395881 877487659 878073633 877369821 876454353 876609921 877312541 876927078
1221.7 876927078 875113487 873209476 872048855 870620131 867616534 863473415 859937847 857967198
1238.1 857967198 856986225 856104553 855351925 855147243 854789555 852726460 848484337 843079805 837137938
1256.4 837137938 829678535 819370866 806255639 790844619 772088945 747656286 716046333
1270.7 716046333 678035676 636842787 598094344 568121135 550886452 546750963 553655505 572185278
1287 572185278 607852697 660642922 717528999 763091922 791734695 805576622 807721913 800890744
1303.3 800890744 786283791 760810435 726819098 707748771 725895822 767426670 803716362
1317.6 803716362 825927436 839634717 850244939 859074354 865308642 868951440 871266484 873127401
1333.9 873127401 874184728 873994887 873456419 874189317 876376510 878604352 879765332 880252182 880748630
1352.3 880748630 880677640 878478467 872821748 861751914 842267513 817855358 800427616 798754632
1368.6 798754632 811535776 830042601 846587837 857519269 863742292 867253304 868892550 868847728
1384.9 868847728 866892517 863681018 861479819 862017512 865334570 869670689 873733044 877080142
1401.2 877080142 879312158 880329430 880709529 881437719 882554948 883321702 883498549 883574009 883844733
1419.6 883844733 883947134 883286178 881864727 880324721 878595531 875842273 871448696 863993168 853568614
1437.9 853568614 844544709 840303361 842742741 849824071 856813729 861832082 866140306 870061338
1454.3 870061338 873010218 874315381 874007642 872831821 871121466 869660616 868619621 865801930
1470.6 865801930 858603358 852438748 855512977 865083158 873904884 878844917 881219625 882862568
1486.9 882862568 883828878 883430779 882372856 881584108 880838990 879219115 876588166 873587012 869310200
1505.2 869310200 860821187 848299325 829809844 804238856 784249663 787299454 812392950 844258964
1521.6 844258964 867003381 878041565 883023202 884555697 884625137 884387434 884377837 884454846 883691370
1539.9 883691370 881949246 880617738 879695654 878802121 877855957 877254367 877284408 877505362 876337588
1558.3 876337588 872843027 869864225 867164195 863315403 857019842 847587049 838450551 834520042
1574.6 834520042 838399410 843190849 842728198 838075280 829919398 817628443 800527036 778149128
1590.9 778149128 749976814 716046333 679987788 649263978 631756723 632595897 651232123 681667209
1607.2 681667209 714775622 741041303 755910516 760114670 755514741 747754335 740229666 732280612
1623.5 732280612 724460423 716821492 709469914 704192579 702280462 706182480 717491269 733651042
1639.9 733651042 752084672 769682586 786234915 800615549 810619175 819704294 828238010 832006037
1656.2 832006037 833592296 834453166 833439052 830035031 825224459 818171442 807140708 792744756
1672.5 792744756 771370292 741997957 713239253 688910663 667135239 645357013 633444846
1686.8 633444846 638502002 658663154 685706139 714710057 741904199 763556004 783146620
1701.1 783146620 797625899 808802307 819697678 829168618 837352931 844697237 851637483 858457744
1717.4 858457744 863855779 867411435 870289087 873073637 875801623 878336906 880401254 882141650
1733.7 882141650 883621335 884889662 885915458 886461794 886896431 887795866 889070094 890014708 890306056
1752 890306056 890568376 891245306 891985893 892326176 892311990 892520189 893273175 894182146 894718587 894815445
1772.4 894815445 894873381 895121515 895291507 895089388 894778490 894864976 895372093 895880163 896146834 896331608
1792.8 896331608 896699905 897130072 897251010 897065878 897063076 897449970 897814810 897767484 897514880 897562981
1813.2 897562981 897898674 897995234 897690117 897488415 897772729 898220181 898304343 897982359 897763133 898041308
1833.6 898041308 898430526 898402750 898205101 898453236 899048209 899219632 898781359 898371696 898521006 898966491
1854 898966491 899019063 898607492 898370206 898684859 899139047 899137974 898679495 898402810 898606539 898721159
1874.4 898721159 898308992 897803068 897837877 898224831 898195386 897584081 897050977 897089660 897282541 896914303
1894.8 896914303 896106064 895700395 895929098 896056890 895503879 894707143 894401610 894403160 893825531 892524779
1915.2 892524779 891638875 892218649 893553972 894267738 894207180 894304574 894950390 895474255 895277977 894775748
1935.6 894775748 894815981 895394027 895608783 895043612 894484103 894626677 895050943 894936383 894310713 894015312
1956 894015312 894383669 894718587 894356906 893699586 893604219 894044459 894164443 893619359 893078983 893209100
1976.4 893209100 893612504 893417180 892619550 892089546 892275751 892580628 892314613 891757131 891732037 892273784
1996.8 892273784 892544806 892111897 891573787 891629398 892013729 891916335 891269326 890861630 891100466 891400754
2017.2 891400754 891129255 890591025 890544295 891038477 891324162 890973091 890527904 890687048 891270339 891523421
2037.6 891523421 891248822 891043544 891361237 891811490 891755342 891324699 891229331 891642690 891955972 891718566
2058 891718566 891305625 891337454 891726196 891847014 891512036 891224205 891406000 891778469 891774118 891379476
2078.4 891379476 891197026 891510010 891832113 891692817 891344845 891352475 891720057 891910374 891658902 891335309
2098.8 891335309 891392887 891709507 891758502 891405225 891122401 891270280 891533911 891383171 890902042 890668869
2119.2 890668869 890865803 891045213 890828669 890441835 890355587 890559077 890600801 890327871 890132725 890381396
2139.6 890381396 890876710 891133785 891084969 891156137 891582668 892027318 892073512 891874909 891931891 892317235
2160 892317235 892579973 892425835 892157972 892239690 892634749 892865479 892708600 892526090 892698884 893015921
2180.4 893015921 893012643 892716229 892584205 892804205 893031299 892906785 892612040 892604530 892899573 893028319
2200.8 893028319 892771661 892501831 892607808 892910004 892942369 892661273 892510712 892738581 893028378 892986953
2221.2 892986953 892731726 892715514 893015623 893186986 892963588 892666638 892707884 892980039 893022180 892718136
2241.6 892718136 892457485 892528892 892723501 892679155 892407537 892293632 892491996 892656565 892522156 892311931
2262 892311931 892351210 892585099 892660916 892448545 892252862 892343640 892540753 892532527 892346263 892256856 892353356
2284.4 892353356 892390490 892148495 891762555 891531527 891494155 891393006 891063511 890656650 890404820 890247941
2304.8 890247941 889915407 889369011 888865888 888576150 888319016 887745917 886867225 886156321 885897040 885794699
2325.2 885794699 885411561 884769261 884348512 884347022 884408653 884303629 884193599 884328306 884848833 885857344
2345.6 885857344 886821508 886839747 885752082 884069800 882346332 880941868 880186796 880166590 880638003
2363.9 880638003 881294966 882099748 883173943 884448111 885647655 886635840 887540519 888482630 889327228
2382.3 889327228 889815629 889897168 889804959 889782190 889842629 889822066 889627874 889398038 889328122 889384806 889353633
2404.7 889353633 889194191 889116228 889235914 889387190 889388204 889325380 889406741 889639437 889818728 889813960 889746368
2427.2 889746368 889800370 889946342 889984787 889856696 889762402 889835775 889907241 889763534 889477134 889329374
2447.6 889329374 889419615 889524281 889449656 889331341 889388382 889584303 889681876 889566600 889421046 889455378
2467.9 889455378 889593303 889601946 889437914 889313102 889373302 889454007 889345765 889127254 889025569 889068484
2488.3 889068484 889061749 888929904 888835192 888906837 889050424 889064133 888913691 888785899 888807833 888868928 888805151
2510.8 888805151 888646424 888575613 888633370 888621867 888404250 888106585 887961090 888014913 888091326 888066113 888034463
2533.2 888034463 888108373 888205767 888187408 888042986 887903810 887892544 887938917 887899995 887821019 887878299 888082147
2555.6 888082147 888252676 888276160 888223410 888240576 888354659 888429224 888369083 888267279 888241231 888220012 888045609
2578.1 888045609 887704134 887337148 887051940 886820614 886586905 886388600 886329591 886411488 886469662 886366844
2598.5 886366844 886161745 886007071 885924339 885803998 885608971 885452569 885437906 885508239 885531247 885515571
2618.9 885515571 885623991 885886014 886081100 886013627 885750532 885515571 885374844 885154128 884724617 884221613
2639.3 884221613 883863568 883679986 883527815 883300543 883099675 883081675 883154809 883090258 882841170 882556081
2659.7 882556081 882341206 882120609 881781816 881388128 881133795 881063819 881026685 880967081 881017447 881266057
2680.1 881266057 881594658 881841898 882003784 882193446 882479310 882734954 882779062 882629156 882468820 882425845
2700.5 882425845 882438362 882399142 882372618 882500827 882731557 882869542 882867455 882878065 883043230 883294225 883466959
2722.9 883466959 883551359 883626461 883718789 883789539 883737087 883574426 883456647 883390307 883248985 883042037 882911086
2745.3 882911086 882920563 882943273 882787883 882472932 882205784 882083893 881987751 881758273 881419122 881153345
2765.7 881153345 881044805 880971193 880869985 880856216 880970359 881145060 881289363 881348073 881400049 881541550
2786.1 881541550 881678998 881602347 881334960 881129861 881090879 881031752 880776942 880478024 880343139 880328119
2806.5 880328119 880256176 879992306 879621625 879379153 879307210 879234910 879080772 878968716 878983200 879030764
2826.9 879030764 878987670 878839910 878700316 878658772 878606319 878274798 877638221 877047896 876652837 876211584
2847.3 876211584 875560343 874906242 874539912 874416411 874303341 874060571 873681605 873219788 872627079 871868730
2867.7 871868730 871204138 870936215 870923221 870838940 870683253 870598257 870581806 870486319 870069981 869193733
2888.1 869193733 867914379 866311967 864316881 861863136 859535754 858626127 859748304 861977518
2904.4 861977518 864019513 865500331 866680980 867609739 867979825 867663682 866954803 866128325 865185797
2922.8 865185797 864106357 863105953 862338305 861660838 861013174 860489845 860195637 860242963 860700071
2941.1 860700071 861469924 862122297 862136126 861399889 860185802 858745754 857404947 856623888 856445491
2959.5 856445491 856400609 856213152 856155574 856374919 856375456 855567515 853732765 851034641 848030508 845256388
2979.9 845256388 843056560 842146873 843428195 846983075 851742685 856194556 859611332 862343490
2996.2 862343490 864653707 866391003 867615938 868505597 869208455 869938135 870740712 871353507 871556997
3014.5 871556997 871459067 871267617 871038616 870820522 870721996 870773554 870937467 871076763 871008158 870630741
3034.9 870630741 870028555 869408250 868754148 867963195 867302656 867236197 867763937 868299007 868451893 868366063
3055.3 868366063 868160129 867815614 867392838 867008626 866751969 866481543 866083860 865817785 865968585 866532505
3075.7 866532505 867172003 867445111 867337823 867139339 866932392 866716206 866458476 866046906 865613461 865377486
3096.1 865377486 865277648 865088582 864758492 864530981 864521980 864442885 864083529 863749385 863704860 863635480 863217890
3118.6 863217890 862467527 861578465 860851347 860376596 860004306 859636247 859262884 858862400 858416975 857861400
3139 857861400 857111871 856295347 855601609 855091691 854842961 854788840 854525685 853844047 853016734 852277696
3159.4 852277696 851611912 850931823 850170851 849334359 848485410 847649574 846747994 845710754 844613850
3177.7 844613850 843564987 842537642 841399968 840070367 838625908 837136269 835533142 833727062
3194 833727062 831664860 829402447 827046514 824570179 821885526 819017053 816048324 812969446 809673965
3212.4 809673965 806091726 802339554 798669279 795313239 792533576 790681183 790014327 790481389 791708350
3230.7 791708350 793079019 794012249 794418633 794566751 794578910 794465065 794375479 794526875 794995844 795750380
3251.1 795750380 796726644 797760606 798651755 799314499 799721539 799875021 799869955 799805224 799635947 799162149
3271.5 799162149 798345566 797406018 796458304 795428753 794233561 792900980 791507602 790091991 788657486
3289.9 788657486 787062407 785155356 782969713 780582428 778086126 775621891 773166358 770428717
3306.2 770428717 767134726 763349175 759417653 755641699 752016068 748343170 744545758 740661144
3322.5 740661144 736584902 732005179 726774156 721066177 714995205 708572984 701784670 694495499
3338.8 694495499 686900139 679764092 673813462 669307649 665966272 663209319 661229372 661265135 663920224
3357.2 663920224 668118358 672245562 675434470 677585363 678799033 679230571 679202497 679064870 678883791
3375.5 678883791 678458571 677751124 676894963 675915718 674743772 673421383 672066271 670533478 668651521
3393.9 668651521 666617692 664684951 662750363 660425842 657558203 654395401 651106775 647656083
3410.2 647656083 643958449 639966786 635921836 632298768 629364848 627212226 626038730 626050532 627255261
3428.6 627255261 629330695 631935000 634802520 637471735 639687181 641681015 643667996 645559669
3444.9 645559669 647199869 648565531 649684906 650511503 651269913 652684391 655238867 658437848 661562920
3463.2 661562920 664513767 667274177 669502854 671096206 672519684 674230099 676340163 678576887
3479.6 678576887 680528581 682354331 684419036 686593235 688717246 690864325 693074346 695334792
3495.9 695334792 697557390 699741483 701874793 703715146 705350101 707150996 709129691 711137891
3512.2 711137891 713051796 714842975 716637254 718502045 720447302 722322464 724069715 725875497
3528.5 725875497 727770865 729741096 731892109 734072089 736048937 738033414 740246892 742502034
3544.8 742502034 744467318 746207356 748037159 750034332 752160490 754402339 756688416 758903444
3561.1 758903444 761057556 763361931 765923142 768345952 770484746 772768855 775361300 778010011
3577.5 778010011 780620992 783339679 786206901 789077818 791784108 794294059 796759605 799404502
3593.8 799404502 802219808 804997027 807656765 810260475 812833607 815354407 817901790 820457220
3610.1 820457220 822980464 825453222 827671111 829775989 831986070 833998799 835700095 837301314
3626.4 837301314 839132667 841047108 842643261 844124436 845496476 846722960 847993970 849310637
3642.7 849310637 850563288 851833344 853269100 854475081 855085492 855572641 856317461 857043743 857532918
3661.1 857532918 857907891 858277440 858676910 859223723 859819889 860111296 860134184 860053241 860018015 860144436
3681.5 860144436 860409200 860904753 861790299 862627864 862888038 862932622 863074481 863305867 863609076 863919258
3701.9 863919258 864113808 864248097 864502490 864881575 865170956 865175068 865041018 864990890 865052164 865093589
3722.3 865093589 865014434 864992380 865172029 865442812 865738511 866031528 866255343 866289735 866040230 865720451
3742.7 865720451 865768909 866034269 866112828 866058052 865912974 865751684 865682542 865681231 865620792 865543902 865617216
3765.1 865617216 865739048 865721166 865557492 865369856 865368426 865598440 865787268 865685105 865466356 865335643
3785.5 865335643 865246236 865158737 865075946 865030527 865081549 865126371 865127921 865241945 865274847 865129352 865010381
3807.9 865010381 864887118 864753425 864742577 864920974 865023673 864895344 864726841 864571571 864449918 864346385
3828.3 864346385 864271224 864346147 864534676 864638627 864535093 864311337 864135385 864064276 863996029 863877356
3848.7 863877356 863722563 863596022 863579452 863481164 863329053 863302350 863395333 863453090 863355100 863248527 863190889
3871.2 863190889 863047302 862914920 862842321 862850428 862954736 862997413 862966835 862842262 862666905 862621605 862614691
3893.6 862614691 862506807 862419128 862450957 862505853 862491965 862390816 862201035 862033188 861954808 861915112 861914456
3916 861914456 861975849 862064540 862110376 862060308 861929297 861798882 861777961 861866176 861902416 861815572 861716092
3938.5 861716092 861678600 861676395 861651421 861609042 861608624 861625791 861624002 861613452 861599982 861587346 861554325 861493289
3962.9 861493289 861428499 861364067 861329496 861353636 861390114 861404300 861396551 861380458 861402810 861430883 861351609 861195683
3987.4 861195683 861096084 861062229 861047149 861059785 861094415
3997.6 861094415
##END=$$ End of the data block
