##TITLE=Renata Menger - OH-benz 1 $$ Begin of the data block
##JCAMP-DX=5.00 $$ ACD/SpecManager v 10.08
##SPECTROMETER/DATA SYSTEM=Alpha
##DATE=22 Oct 2014 10:39:34
##DATA TYPE=INFRARED SPECTRUM
##DATA CLASS=XYDATA
##ORIGIN=
##OWNER=
##NPOINTS=1765
##FIRSTX=399.76428223
##LASTX=3997.64306641
##MAXX=3997.64306641
##MINX=399.76428223
##MAXY=0.86718589
##MINY=0.11794090
##XFACTOR=1.0000000000
##YFACTOR=1.000000000000000e-9
##FIRSTY=0.84030515
##DELTAX=2.03961372
##XUNITS=1/CM
##YUNITS=ARBITRARY UNITS
##XYDATA=(X++(Y..Y))
399.8 840305150 839767396 839728653 840122163 840253055 839673221 838575959 837485671 836828887 836517155 836001217
420.2 836001217 834866703 832703710 827938497 818302989 802642047 782337666 761504769 744611740
436.5 744611740 733833849 727674901 722266793 715732396 710380614 709369361 712671757 718456447
452.8 718456447 725405514 734222531 747327924 765796065 787072599 805652916 816920519 820507228
469.1 820507228 819356024 816613913 813832402 811313987 808095753 803059280 796873510 792003632
485.4 792003632 790741622 793647110 799507201 806257725 812661290 819118381 826167881 832947016
501.7 832947016 837611318 838711262 836309612 831783056 826904297 823074162 820931613 820554495 821882665
520.1 821882665 824706674 828456581 832526565 836914837 841020048 839787543 825567186 798518300
536.4 798518300 768178105 743511915 728368819 723654330 729188979 744306922 767837286 797419369
552.7 797419369 827795446 850260377 858835578 857482016 854485214 853154719 852639437 851779342
569.1 851779342 850233555 848144114 845650017 843124032 841071844 839617848 838680327 838433623 839012623
587.4 839012623 839574814 838492453 835385144 831703901 828764737 827036858 827016532 828865409 831679702
605.8 831679702 834507108 837486386 840851545 843621373 844307423 842232943 837334812 829948485 821377337
624.1 821377337 813430369 807208180 802439213 798101723 794055402 791002512 788829625 786599755
640.4 786599755 783623278 780145586 778013051 779787242 786625504 797702193 810901701 823596895
656.8 823596895 834133983 842086136 846971571 848866582 848661661 847009301 844383478 841057181
673.1 841057181 835639179 824598491 805849373 782525420 759534240 736932814 711884975 686145186
689.4 686145186 666128457 657165885 659761488 667900443 670312583 659137547 638781011 621447742
705.7 621447742 614166319 615257204 622864366 640156507 670595169 712694883 759561479 800819516
722 800819516 827248871 836634040 833643496 824416518 813545048 804126918 798004866 796057701
738.3 796057701 798564017 805392861 816009521 829293728 843135893 854391754 860507011 861732364
754.7 861732364 860491037 858108640 851827383 836042523 809521198 778838992 752372861 735021532
771 735021532 728573978 733159721 747820914 770796716 799560666 829496861 851174057 853802860
787.3 853802860 836860716 811627686 789003134 773290932 764901042 762968242 766805053 776391804
803.6 776391804 790927470 806676567 817009807 817327380 810594618 804371297 803301215 807465017
819.9 807465017 815049410 824328065 834251702 842959702 846613467 842246771 831144571 817821562
836.2 817821562 806502700 799577951 798351049 801487625 802206337 794418335 780746579 767300010
852.6 767300010 757144630 751420736 747225046 737153947 719604731 702982128 695361853 696210504
868.9 696210504 699620485 705054641 719597876 747537494 785234511 822263300 843345284 839487493
885.2 839487493 817472279 790363073 765979350 748150527 739286780 738855124 742913365 747400284
901.5 747400284 749959648 747979105 739624619 726489305 711493373 696066380 681524932 670396686
917.8 670396686 664984643 665374339 669736207 677562714 690251768 708643794 731940210 757565677
934.1 757565677 782377899 803723752 818850696 825563431 824089408 817408562 809198856 801813900
950.5 801813900 796176076 792215288 788528204 782510459 772617519 760144174 747478843 736009181
966.8 736009181 727204382 723420322 726023853 734692812 748230875 764228106 778760195 787633717
983.1 787633717 788391471 781412840 769294381 754574001 737428725 715919316 689010203 659476876
999.4 659476876 632019818 608614743 588137329 569123924 550402343 530127227 506603003
1013.7 506603003 480384171 455271304 437311918 432462484 444582373 473827034 516469002
1028 516469002 567449987 622377336 676147759 721310794 750361383 760728657 757003188 747089624
1044.3 747089624 736298919 725596070 713211238 696036458 672107458 644045770 617831826
1058.6 617831826 597318649 582445085 572758377 569135785 571279109 577350020 586311102 597369850
1074.9 597369850 608728051 620108604 634696126 655744195 682804763 712739408 741656721
1089.2 741656721 764475465 775976539 774409354 762534797 744757891 723909378 700598121
1103.4 700598121 675388932 650832236 631034851 619806111 619178653 628985703 647178173 670703709
1119.8 670703709 696817696 723356843 747483432 765857279 776939094 781849384 782882810 781931996
1136.1 781931996 779828966 776423216 771433592 765145898 757817328 749099433 738867998 727950215
1152.4 727950215 717298448 707038224 696377397 683724463 667192996 645908475 620775163
1166.7 620775163 593154848 563551068 532324910 500090182 466956496 433829874 403848857
1180.9 403848857 379353911 359114498 340513796 322326154 304472655 286882877 269893467
1195.2 269893467 254673064 242414311 234760061 235584304 249244526 275994807 311475456 349819809
1211.5 349819809 385724723 415604472 438045204 452791482 460045487 461346924 459949404 459315538
1227.9 459315538 461651534 467856526 478038043 491778076 508297086 526369989 543758810 557544529
1244.2 557544529 565764666 567738533 562143147 546421647 519609809 485450327 451780587 426336825
1260.5 426336825 413063318 411523074 418504059 430041313 442182750 450097173 447936386 431469649
1276.8 431469649 401591390 365053475 330854654 305155009 289280385 281251401 277893037 276030779
1293.1 276030779 273013741 266887724 256470650 241533741 223204151 204119727 187423065 175213501
1309.4 175213501 168286175 167143062 172538728 185119525 205085099 232166588 265710115 304750234
1325.8 304750234 347687453 391295463 431247234 464705855 491439581 512657762 529880404
1340 529880404 544832349 559493601 575695217 594719052 616996825 641280651 664030910 680909872
1356.4 680909872 688247919 683828652 668317258 645508289 619362891 592621803 566785872 540307641
1372.7 540307641 511193335 484018773 466848433 460122347 456105620 447984278 437434614 433054835
1389 433054835 441353083 462561816 492922276 526531756 560775816 599495769 644504905 688787222
1405.3 688787222 723265231 744425833 755765855 763652384 771385074 778327405 783270121 785628676
1421.6 785628676 785669744 784086049 781349003 777927339 774563372 772227943 771348536 770198882 765919566
1440 765919566 757278860 743933797 726457715 709313035 696582198 689877689 690006196 697549343
1456.3 697549343 712250769 732136548 753350794 772489846 788256407 799789786 807380199
1470.6 807380199 813946605 820331395 825628936 829206169 831103504 831983447 830919504 823518395
1486.9 823518395 808621049 790937841 775439858 764669955 759736776 761086047 768467605 781072378
1503.2 781072378 797618270 815928936 831459939 839206517 840538740 840236962 840215683 840370178
1519.5 840370178 840574086 840845883 841212869 841541052 841286361 840278447 838724077 836846769 834889174
1537.9 834889174 832970440 831200182 829663754 828299165 826640189 824318588 821373165 817530513
1554.2 817530513 812689900 806566477 798022687 785933197 770241380 754260838 741978645 734722793
1570.5 734722793 731365383 730171204 730380893 731333673 731640875 728786647 719498813 702400029 679887235
1588.9 679887235 656704307 634769917 613919258 595119238 580300510 571427524 569102168 572313249
1605.2 572313249 580195248 591855228 606593132 624393702 644026220 663430810 682281137
1619.5 682281137 701333284 720382929 738128960 753205836 765100718 774572134 781942368 787076890
1635.8 787076890 790688515 793550611 795805275 797583938 799086213 800298989 801294863 802246153 803233027
1654.1 803233027 804251611 805005968 805141628 804752231 803741515 801682293 798694909 795251548 791393101
1672.5 791393101 786472559 780233383 772770584 763837934 753401160 741745949 729428113 716931522
1688.8 716931522 703953266 690716386 677455246 663223445 646619439 626599371 601908565
1703.1 601908565 571151733 533814669 491311103 446687281 403196037 363334447 329553485
1717.4 329553485 302747756 281960845 264088631 245415717 224313393 200484484 174918324
1731.7 174918324 150597692 131028891 119095884 117940895 130153328 155077159 189197883
1745.9 189197883 227457881 266615778 306092530 344605088 379701763 408172965 426793039
1760.2 426793039 432941526 427059203 412403822 392430007 371017992 352091670 338514477 331652820
1776.5 331652820 330651045 333370715 338901997 347186387 357692003 371517926 391322076 419058084
1792.8 419058084 454848707 496610790 540691733 583093405 620403111 650920868 675540149
1807.1 675540149 695546508 711517274 724284232 734826505 743689001 751104474 757429063 763026893
1823.4 763026893 768168688 773033082 777720690 782236278 786528409 790599585 794460177 798129857
1839.8 798129857 801576018 804790139 807840586 810711145 813342333 815751314 817935765 819739282
1856.1 819739282 821052253 822050035 822948694 823843360 824757159 825671017 826561928 827427685 828280270
1874.4 828280270 829082668 829740107 830224156 830649555 831201911 831962049 832915604 834049702 835351050
1892.8 835351050 836747646 838103056 839276671 840206444 840937972 841566145 842115879 842572391 842945755
1911.1 842945755 843271434 843626618 844062924 844549835 845011830 845421612 845849335 846381247 847006142 847633362
1931.5 847633362 848191500 848562062 848604500 848344624 847976744 847723782 847734988 848057389 848686934 849607110
1951.9 849607110 850701451 851703644 852368951 852627277 852568507 852385461 852260947 852313519 852631152 853260934
1972.3 853260934 854170501 855245233 856305122 857175112 857828081 858366966 858851552 859261632 859581769
1990.7 859581769 859848082 860131800 860496163 860958159 861486375 862025559 862517953 862933099 863273025 863529921
2011.1 863529921 863688469 863749981 863722861 863610566 863421500 863191366 862973511 862797201 862653852 862539768
2031.5 862539768 862477660 862478852 862520695 862565517 862583220 862556100 862482190 862385511 862306118 862267375 862270534 862314582
2056 862314582 862403572 862539470 862709522 862881064 863014460 863085330 863092721 863042831 862932026 862755835 862533212
2078.4 862533212 862311542 862143397 862066090 862103224 862263799 862526774 862842500 863160908 863446593 863667309
2098.8 863667309 863789380 863797188 863709867 863559604 863358438 863101482 862788558 862428904 862038851 861647666
2119.2 861647666 861302376 861057758 860953212 861000597 861195743 861525655 861958265 862444997 862941504 863424838
2139.6 863424838 863887489 864321351 864722967 865103185 865473628 865830183 866157889 866445839 866691768 866892159
2160 866892159 867038608 867129743 867175221 867185891 867166221 867122173 867064893 866994679 866895080 866758704 866602123
2182.4 866602123 866450012 866314054 866193175 866093755 866027355 865994513 865980983 865966797 865933061 865863860 865747809
2204.8 865747809 865580499 865367413 865111053 864802241 864439249 864039958 863631725 863230407 862834454 862439036
2225.2 862439036 862052202 861700654 861414731 861209452 861087024 861043155 861060739 861108005 861157835 861196578
2245.6 861196578 861209214 861167669 861053467 860880077 860667288 860411644 860099494 859729171 859315217 858890831
2266 858890831 858509958 858230889 858092129 858093917 858199000 858354747 858511686 858628333 858673692 858637154 858535051
2288.5 858535051 858399451 858256340 858094990 857869685 857540846 857084811 856485009 855746686 854900837 853983879
2308.9 853983879 853031576 852091253 851230443 850514412 849970520 849611461 849459708 849492192 849625289 849770904
2329.3 849770904 849838674 849744618 849562466 849517047 849756122 850220442 850713193 851068377 851189911 850992084
2349.7 850992084 850399613 849418759 848163664 846850634 845810473 845326781 845449269 846038163 846912682
2368 846912682 847971261 849177599 850493789 851844668 853148222 854351878 855430543 856375039 857175589
2386.4 857175589 857819319 858317673 858721554 859091938 859465182 859848619 860225618 860560954 860816002 860964298
2406.8 860964298 860994041 860903263 860702634 860422254 860110641 859816253 859571040 859394312 859298289 859282374
2427.2 859282374 859320104 859361291 859368324 859339118 859289050 859229445 859164119 859097719 859036088 858978629 858915985 858839571
2451.6 858839571 858751059 858662248 858590841 858548939 858536541 858541369 858537972 858498216 858403862 858249545 858038306
2474.1 858038306 857780755 857500553 857225716 856972277 856742144 856534719 856356740 856217623 856120348 856062651
2494.5 856062651 856039345 856037736 856041193 856037438 856016219 855965316 855875313 855749488 855601609 855441213 855273426
2516.9 855273426 855118990 855010271 854966938 854987204 855059624 855169475 855297387 855422974 855526686 855591476
2537.3 855591476 855609953 855593145 855568111 855562389 855590582 855650365 855726600 855802834 855872452 855931699 855967462 855962574
2561.8 855962574 855911136 855822504 855703771 855551064 855366528 855171800 854996264 854860067 854763269 854690254
2582.2 854690254 854625285 854552925 854459763 854348123 854236126 854140639 854072213 854046941 854085445 854192615 854346335
2604.6 854346335 854516566 854687810 854855418 855013967 855153620 855261505 855322301 855319023 855238795 855077446
2625 855077446 854845285 854564726 854256272 853936255 853630662 853375435 853197634 853104591 853091776 853155196
2645.4 853155196 853285849 853465497 853679717 853919268 854163945 854388177 854578376 854734898 854863405 854960740
2665.8 854960740 855013072 855008602 854944408 854833364 854704082 854583681 854491174 854436636 854415059 854419470 854451001
2688.2 854451001 854506731 854568720 854611814 854619324 854589462 854522705 854416430 854277968 854123354 853969157 853834569
2710.7 853834569 853737354 853686929 853675067 853674352 853655159 853598595 853498518 853353202 853144288 852849603 852486789
2733.1 852486789 852102458 851728320 851375163 851035595 850678444 850280523 849859715 849458396 849107265 848819137
2753.5 848819137 848617136 848549306 848647833 848883927 849175811 849429905 849574327 849574566 849434376 849185944
2773.9 849185944 848884583 848595798 848369122 848227262 848174512 848190248 848224819 848230243 848186195 848085463 847916126
2796.3 847916126 847670853 847354054 846977353 846558928 846118689 845671833 845234156 844823480 844454587 844137847
2816.7 844137847 843873918 843645036 843411922 843121469 842738152 842250526 841642022 840891004 839992881 838960826
2837.1 838960826 837858260 836824059 835544109 831720173 820304513 796615660 761415362 721446037
2853.4 721446037 684979916 658170998 644490957 645405591 660829604 688968062 725518882 763120174
2869.7 763120174 793312192 811383009 819129825 821651459 822612047 823242545 823742270 824150383 824095190
2888.1 824095190 822233617 816863656 807603240 795868039 783719063 772926629 764860511 760562122
2904.4 760562122 760701656 765442431 774164975 785121679 795687616 803805470 809238911 812878907
2920.7 812878907 815404534 817090571 818139493 818689704 818656147 817653358 815099657 810542107 804071188
2939.1 804071188 796467245 788821220 782083571 777041793 774418056 774730742 778035045 783788979
2955.4 783788979 790959418 798344016 805004478 810553670 815011740 818424881 820777774 822112799
2971.7 822112799 822362304 821182251 818414986 814665735 811000228 807912350 804420888 798459828
2988 798459828 788777232 776090801 762302220 749375999 738751650 731372178 728316367 730806291
3004.4 730806291 739128947 751648605 764983594 775913715 783479750 788645685 792577446 795961142
3020.7 795961142 799001396 801507652 803196847 803872883 803473473 802155137 800331593 798706889 798095524
3039 798095524 798945487 800991237 803278029 804695785 804686725 803337336 801038265 798340499 795948863
3057.4 795948863 794573009 794678926 796312153 799090028 802337408 805339336 807788372 809951067
3073.7 809951067 812161982 814426303 816576123 818493962 820150435 821514010 822484612 823002875 823172390
3092.1 823172390 823190570 823234439 823407114 823686242 823984265 824269235 824552357 824831784 825091839 825321555
3112.4 825321555 825525224 825714767 825909615 826124489 826336861 826488733 826548159 826545477 826519608 826472044
3132.8 826472044 826372385 826174855 825871825 825520456 825174212 824830711 824469805 824094236 823720813 823356509
3153.2 823356509 822981834 822566569 822104573 821613371 821124732 820677757 820290446 819956720 819663405 819386661
3173.6 819386661 819094718 818759143 818343580 817806304 817135811 816364348 815544188 814724207 813944042 813236713
3194 813236713 812625051 812108696 811660945 811245978 810828447 810377300 809882343 809360385 808837533 808324456
3214.4 808324456 807808459 807269037 806696713 806094468 805455804 804756582 803979635 803128242 802216291 801273644
3234.8 801273644 800345838 799461246 798621297 797831535 797118366 796504259 795975924 795494437 795020700 794523597
3255.2 794523597 794004679 793513417 793086410 792700410 792319953 791934192 791541576 791128218 790674388 790166736
3275.6 790166736 789592862 788968384 788350046 787778854 787233293 786658049 786013126 785291195 784526229 783764303
3296 783764303 783010602 782222748 781358302 780423999 779439211 778387368 777232587 775955021 774585724
3314.4 774585724 773187935 771806061 770442784 769062340 767629445 766154230 764661372 763141692
3330.7 763141692 761577547 759947717 758234024 756466448 754669368 752805889 750838041 748770237
3347 748770237 746645868 744517565 742394149 740264118 738145411 736044466 733936071 731813312 729678392
3365.4 729678392 727515519 725324333 723126531 720944405 718787849 716670632 714647293 712775111
3381.7 712775111 711045206 709406495 707845092 706391335 705052853 703797221 702596843 701444745
3398 701444745 700334072 699260414 698233783 697252572 696291804 695338488 694414377 693545938 692721665
3416.3 692721665 691911817 691117167 690353572 689616680 688897312 688202798 687548220 686935902 686348021 685763240
3436.7 685763240 685168028 684545875 683885217 683210194 682574689 682047307 681716859 681663632 681901157 682376206
3457.1 682376206 683039844 683890879 684944689 686192870 687600613 689125597 690746367 692451000 694197774
3475.5 694197774 695908666 697479904 698826313 699919224 700771391 701412559 701872647 702162504 702327847
3493.8 702327847 702487111 702740669 703141093 703748047 704624593 705799043 707249999 708922446 710750103
3512.2 710750103 712662637 714593768 716522694 718464017 720397294 722271562 724065423 725797415
3528.5 725797415 727475822 729071617 730550885 731930137 733266890 734592617 735932291 737336338
3544.8 737336338 738813818 740324974 741851509 743381739 744832754 746129632 747337759 748595655
3561.1 748595655 749980986 751486599 753110170 754881799 756812274 758846641 760848939 762706995
3577.5 762706995 764423668 766061544 767689288 769337714 771008670 772701204 774450064 776297629
3593.8 776297629 778201222 780032754 781701028 783243060 784765542 786262691 787634313 788904846
3610.1 788904846 790222108 791675627 793195844 794598699 795848250 797027886 798219144 799460351
3626.4 799460351 800755143 802074313 803397119 804769218 806097507 807112813 807725549 808044553 808270216
3644.8 808270216 808536589 808959246 809629858 810578048 811790407 813141406 814341486 815132439 815423548
3663.1 815423548 815295696 814918339 814449072 814077318 814005256 814284265 814797878 815377235 815941155 816494823
3683.5 816494823 817103088 817704141 818136096 818441093 818787932 819271386 819817662 820176065 820152521 819839418
3703.9 819839418 819505036 819306195 819221199 819163382 819068313 818971395 819000185 819146156 819156051 818779111 818154931
3726.4 818154931 817666769 817491889 817495942 817472160 817432761 817399979 817320228 817282259 817348003 817398071 817358494
3748.8 817358494 817431390 817819655 818449020 819066703 819505453 819808483 819976449 819994688 819986761 820011258
3769.2 820011258 820026755 820015371 820041895 820153356 820324540 820519209 820693135 820812166 820872486 820790589
3789.6 820790589 820459664 819944799 819352925 818763912 818319738 818139493 818195999 818372250 818561494 818607092
3810 818607092 818453610 818161190 817791283 817465007 817235470 817131400 817211568 817385018 817435741 817283452
3830.4 817283452 817003250 816677868 816475153 816532493 816720188 816740155 816561460 816357613 816219628 816077948
3850.8 816077948 815826535 815531969 815334141 815273702 815325081 815419078 815412283 815205216 814942420 814775288
3871.2 814775288 814719379 814710736 814718366 814757109 814782679 814763844 814776063 814873219 814989924 815007210 814822018
3893.6 814822018 814505219 814239144 814116180 814156711 814300478 814455330 814634204 814861238 815036774 815016866
3914 815016866 814778388 814418435 814050019 813740671 813522220 813394725 813317060 813220561 813077152 812920749
3934.4 812920749 812763870 812598407 812463820 812384784 812327266 812286317 812306106 812400281 812539995 812689960
3954.8 812689960 812830925 812963426 813073039 813143969 813192844 813233435 813258290 813262880 813252807 813226402 813177645
3977.2 813177645 813102007 812992215 812842369 812649548 812419593 812165856 811903715 811648667 811411202 811191142
3997.6 811191142
##END=$$ End of the data block
