##TITLE=Renata Menger - Cl-benz 3 $$ Begin of the data block
##JCAMP-DX=5.00 $$ ACD/SpecManager v 10.08
##SPECTROMETER/DATA SYSTEM=Alpha
##DATE=22 Oct 2014 10:39:34
##DATA TYPE=INFRARED SPECTRUM
##DATA CLASS=XYDATA
##ORIGIN=
##OWNER=
##NPOINTS=1765
##FIRSTX=399.76428223
##LASTX=3997.64306641
##MAXX=3997.64306641
##MINX=399.76428223
##MAXY=0.88673091
##MINY=0.33977509
##XFACTOR=1.0000000000
##YFACTOR=1.000000000000000e-9
##FIRSTY=0.85020387
##DELTAX=2.03961372
##XUNITS=1/CM
##YUNITS=ARBITRARY UNITS
##XYDATA=(X++(Y..Y))
$$ plain form
399.8 850203872 842036068 838240325 841657221 846456110 845921695 838509977 824104607 805384815
416.1 805384815 793482900 801200092 816652596 829489768 841878653 852354407 858475447 860788584
432.4 860788584 861495256 862305880 863122940 862975657 861922085 861059070 860273123 858587801 857058346
450.8 857058346 857390761 858843565 858786047 855637908 850862205 846168935 841815412 838565350 838718474
469.1 838718474 843300939 849883437 854687393 856947362 858466983 860096157 860587537 859214842 857552052
487.5 857552052 856448948 853609085 846222401 836078167 828510642 821139693 804789066 789378703
503.8 789378703 796947300 821752548 840524852 846837699 847887933 849199355 851451993 852882028
520.1 852882028 853625596 855393112 857750595 858022153 854895592 848358810 838345885 829145789 828509331
$$ packed form
399.8H50203872q167804l795743L416896M798889n34415p411718j4405370j8719792
416.1H05384815j1901915P717192J5452504J2837172J2388885J0475754O121040K313137
432.4H60788584P06672Q10624Q17060j47283j053572q63015p85947j685322j529455
450.8H57058346L32415J452804n7518l148139m775703m693270m353523l250062J53124
469.1H38718474M582465O582498M803956K259969J519621J629174M91380j372695j662790
487.5H57552052j103104k839863p386684j0144234p567525p370949j6350627j5410363
503.8G89378703P568597K4805248J8772304O312847J050234J311422K252638J430035
520.1H52882028P43568J767516K357483K71558l126561o536782j0012925r200096o36458
$$ plain form
538.5 828509331 835518181 840980172 840647280 839367747 843190014 851000309 857806683 861117303 861422300
556.8 861422300 861099124 861973286 863259852 863272369 862253249 862056077 863050818 863448977 862515569 861863136
577.2 861863136 862534344 863232136 862588286 861311913 860789835 860651076 859561205 857865334 857776940
595.6 857776940 860205412 862853169 863427103 862749457 862347782 861771643 860663891 860511959 862106502
613.9 862106502 864123583 864793479 863530040 861624777 861187398 862588584 863583744 862863541 861397147
632.3 861397147 858982861 854786336 849718392 844681025 840612113 840571463 846683323 856497347 865820289
650.6 865820289 872378886 875598311 876214325 876455128 877704620 878907561 878556967 876608372 875315547
669 875315547 875189364 872491539 866655648 862399638 862711906 864056349 864640296 867197931 871369302
$$ packed form
538.5H28509331P008850N461991l32892j279533L822267P810295O806374L310620L04997
556.8H61422300l23176Q74162J286566J2517j019120j97172R94741L98159r33408o52433
577.2H61863136O71208O97792o43850j276373n22078j38759j089871j695871q8394
595.6H57776940K428472K647757N73934o77646m01675n76139j107752j51932J594543
613.9H62106502K017081O69896j263439j905263m37379J401186R95160p20203j466394
632.3H61397147k414286m196525n067944n037367m068912m0650O111860R814024R322942
650.6H65820289O558597L219425O16014K40803J249492J202941l50594j948595j292825
669H75315547j26183k697825n835891m256010L12268J344443N83947K557635M171371
$$ plain form
687.3 871369302 873507321 871687114 867288649 863883734 865357637 871199250 876079082 877750635
703.7 877750635 878260672 878463864 877166152 872413993 864726424 861378014 866430223 872852445 875765383
722 875765383 877467155 878505588 876986623 872460067 865915716 859091818 855907857 859368980 866742671
740.4 866742671 872851074 874452829 871224940 867218375 867696166 872396827 876363516 877347350 877618015
758.7 877618015 879150867 880841136 881056547 880655468 881468534 882920206 882679224 880633652 879078686
777.1 879078686 878669679 876855969 871626794 863609016 852390170 833040476 806189060 790166914
793.4 790166914 798528910 820213974 840868354 855061233 862044752 864272237 862160921 855381489
809.7 855381489 846521258 838635206 830630064 813334167 775546312 736568451 740683913 782095253
$$ packed form
687.3H71369302K138019j820207m398465l404915J473903N841613M879832J671553
703.7H77750635N10037K03192j297712m752159p687569l348410N052209O422222K912938
722H75765383J701772J038433j518965m526556o544351o823898l183961L461123P373691
740.4H66742671O108403J601755l227889m006565M77791M700661L966689R83834K70665
758.7H77618015J532852J690269K15411m01079Q13066J451672k40982k045572j554966
777.1H79078686m09007j813710n229175q017778j1218846j9349694k6851416j6022146
793.4G90166914Q361996K1685064K0654380J4192879O983519K227485k111316o779432
809.7H55381489q860231p886052q005142j7295897l7787855l8977861M115462M1411340
$$ plain form
826 782095253 808708310 803301811 790564239 791981518 809069753 830229878 841301560 836226165
842.4 836226165 818790615 804679632 812471867 837522030 858883560 865683436 860605180 856219649
858.7 856219649 863338768 875759363 882396579 883341432 882720828 880399764 873066962 861408114
875 861408114 856159210 864740312 877426088 883501530 884486198 884102702 881406605 873773932 862777829
893.4 862777829 855862439 858269334 865134180 867868900 864790738 860748649 859541893 858788848 856179357
911.7 856179357 855800509 858618021 858004212 851955414 845230877 838178635 824915767 801212132
928 801212132 770003915 742096305 729861319 737600684 761105239 793071747 824787557 848364234
944.3 848364234 861633062 867992580 871315598 872984052 872310400 867900789 859798968 853609145
$$ packed form
826G82095253K6613057n406499j2737572J417279J7088235K1160125J1071682n075395
842.4H36226165j7435550j4110983P792235K5050163K1361530O799876n078256m385531
858.7H56219649P119119J2420595O637216R44853o20604k321064p332802j1658848
875H61408114n248904Q581102J2685776O075442R84668l83496k696097p632673j0996103
893.4H62777829o915390K406895O864846K734720l078162m042089j206756p53045k609491
911.7H56179357l78848K817512o13809o048798o724537p052242j3262868k3703635
928H01212132l1208217k7907610j2234986P739365K3504555L1966508L1715810K3576677
944.3H48364234J3268828O359518L323018J668454o73652m409611q101821o189823
$$ plain form
960.7 853609145 854866862 858392358 856943130 852081895 847372234 844456315 845664203 851030231
977 851030231 857250512 861436069 862869024 862388134 861047804 858831167 854954302 849049628 840752006
995.3 840752006 828662455 811562896 790960431 770349264 752594471 738369107 732769012 743208289
1011.6 743208289 759696484 767550051 769900560 771062613 766044438 753600538 740536153 731515229
1028 731515229 727021813 732602894 753234982 781109273 804111242 818748832 827684402 833443463
1044.3 833443463 836694300 837353647 835412800 831408739 827643991 827203929 829966128 832202613 830964148
1062.6 830964148 825750530 816928148 804941833 792087853 782729924 778282762 775425732 771389246
1079 771389246 763952196 747850955 722352803 701774776 703053296 722451925 744880736 766279578
$$ packed form
960.7H53609145J257717L525496j449228m861235m709661k915919J207888N366028
977H51030231O220281M185557J432955m80890j340330k216637l876865n904674q297622
995.3H40752006j2089551j7099559k0602465k0611167j7754793j4225364n600095J0439277
1011.6G43208289J6488195P853567K350509J162053n018175j2443900j3064385r020924
1028G31515229m493416N581081K0632088K7874291K3001969J4637590Q935570N759061
1044.3H33443463L250837O59347j940847m004061l764748m40062K762199K236485j238465
1062.6H30964148n213618q822382j1986315j2853980r357929m447162k857030m036486
1079G71389246p437050j6101241k5498152k0578027J278520J9398629K2428811K1398842
$$ plain form
1095.3 766279578 788101912 806286931 816073537 818039477 817320049 818695366 821338952 820776224
1111.6 820776224 814476311 803303897 791727006 785474300 787006795 795845985 809160769 821645439
1127.9 821645439 829986095 834722579 837540984 839408576 840388715 840445280 840008736 839500427 838789999
1146.3 838789999 837559640 835769892 833568692 830811799 827105284 822364330 817050338 811515927
1162.6 811515927 805370331 797757685 787842691 774526179 755861759 731139421 705230951 686754346
1178.9 686754346 675854862 662089050 639029026 608375192 574341655 544957399 532417238
1193.2 532417238 543483794 569580317 593512237 606807053 613992035 621692061 632328331 647213101
1209.5 647213101 666993320 688106596 703450859 707895637 703598619 699567497 702884018 712167859
$$ packed form
1095.3G66279578K1822334J8185019R786606J965940p19428J375317K643586n62728
1111.6H20776224o299913j1172414j1576891o252706J532495Q839190J3314784J2484670
1127.9H21645439Q340656M736484K818405J867592R80139N6565m36544n08309p10428
1146.3H38789999j230359j789748k201200k756893l706515m740954n313992n534411
1162.6H11515927o145596p612646r914994j3316512j8664420k4722338k5908470j8476605
1178.9F86754346j0899484j3765812k3060024l0653834l4033537k9384256j2540161
1193.2E32417238J1066556K6096523K3931920J3294816P184982P700026J0636270J4884770
1209.5F47213101J9780219K1113276J5344263M444778m297018m031122L316521R283841
$$ plain form
1225.8 712167859 722358108 731432557 740307450 750340402 761930168 773600221 783333063 791181684
1242.1 791181684 798313737 803914785 805380702 801476240 793795586 784855843 776337445 768955171
1258.4 768955171 761612058 751997590 741195381 735107422 736994207 741001725 737389803 721123278
1274.8 721123278 692485154 655969799 624970436 615479231 620909572 613755107 583683670 548754871
1291.1 548754871 530385196 537141860 565562606 603216052 629869282 627856374 603703260 583287954
1307.4 583287954 577030718 574758172 569711447 565327942 566854298 577030182 595801055 619977415
1323.7 619977415 644629836 666802466 687223077 707754433 729229093 750636220 769730628
1338 769730628 784627080 794739008 801571071 807160676 812208533 815983176 817488849 816482604
$$ packed form
1225.8G12167859J0190249R074449Q874893J0032952J1589766J1670053R732842P848621
1242.1G91181684P132053N601048J465917l904462p680654q939743q518398p382274
1258.4G68955171p343113r614468j0802209o087959J886785M007518l611922j6266525
1274.8G21123278k8638124l6515355l0999363r491205N430341p154465l0071437l4928799
1291.1E48754871j8369675O756664K8420746L7653446K6653230k012908k4153114k0415306
1307.4E83287954o257236k272546n046725m383505J526356J0175884J8770873K4176360
1323.7F19977415K4652421K2172630K0420611K0531356K1474660K1407127J9094408
1338G69730628J4896452J0111928O832063N589605N047857L774643J505673j006245
$$ plain form
1354.3 816482604 813338220 808545530 801400900 789028287 769462705 746150970 728273511 725947142
1370.6 725947142 737174690 745523274 730585575 692321837 660354555 661943913 689722538 722725809
1386.9 722725809 746909380 755476117 748611033 732666612 726032794 740941644 758842468 759880006
1403.3 759880006 758101821 771683514 792053878 806364894 813634813 817406237 820414662 825671911
1419.6 825671911 833671987 842283249 849621475 854694784 857749999 859042585 859345555 859592140 859942675
1437.9 859942675 860548556 861789763 863497674 865217865 866626680 867370963 867209196 866314173 864328146
1456.3 864328146 861054242 858413041 857380986 858204782 860468090 862702012 864126444 864728391 864363790
1474.7 864363790 862283826 856643081 843142450 817953169 790366650 779836774 791607857 806647360
$$ packed form
1354.3H16482604l144384m792690p144630j2372613j9565582k3311735j7877459k326369
1370.6G25947142J1227548Q348584j4937699l8263738l1967282J589358K7778625L3003271
1386.9G22725809K4183571Q566737o865084j5944421o633818J4908850J7900824J037538
1403.3G59880006j778185J3581693K0370364J4311016P269919L771424L008425N257249
1419.6H25671911Q000076Q611262P338226N073309L055215J292586L02970K46585L50535
1437.9H59942675O05881J241207J707911J720191J408815P44283j61767q95023j986027
1456.3H64328146l273904k641201j032055Q23796K263308K233922J424432O01947l64601
1474.7H64363790k079964n640745j3500631k5189281k7586519j0529876J1771083J5039503
$$ plain form
1491 806647360 813895822 822720766 839154124 855364859 864702225 869493961 872683108 875297785
1507.3 875297785 877046704 878715992 880703509 882624865 884081304 884982467 885508835 885632217 885413647
1525.6 885413647 885006011 884643078 884363711 883780360 883071542 882591367 881844521 880483985 879147112
1544 879147112 878055811 877161145 876095831 874405503 871915936 868557751 861449659 849960804 844831228
1562.4 844831228 848333061 856023371 860321999 857858002 851498365 842043042 826595247 806579411
1578.7 806579411 781649232 754148483 741786778 756555021 783704519 801959276 806534827
1593 806534827 802785814 795906425 788902581 782256305 775014997 765598059 751921237 733803332
1609.3 733803332 716043591 703640699 693089247 676520526 658580482 651655614 667405963
$$ packed form
1491H06647360P248462Q824944J6433358J6210735R337366M791736L189147K614677
1507.3H75297785J748919J669288J987517J921356J456439R01163N26368J23382k18570
1525.6H85413647m07636l62933k79367n83351p08818m80175p46846j360536j336873
1544H79147112j091301q94666j065314j690328k489567l358185p108092j1488855n129576
1562.4H44831228L501833P690310M298628k463997o359637r455323j5447795k0015836
1578.7H06579411k4930179k7500749j2361705J4768243K7149498J8254757M575551
1593H06534827l749013o879389p003844o646276p241308r416938j3676822j8117905
1609.3G33803332j7759741j2402892j0551452j6568721j7940044o924868J5750349
$$ plain form
1623.5 667405963 702763081 740235209 768948615 786537230 798476100 808674157 815327644
1637.8 815327644 819259465 823090374 827625751 833308399 838921010 842528641 845479071 848330200
1654.1 848330200 850220323 852262616 854800522 857124209 858424127 859099090 859909892 860679924 860699654
1672.5 860699654 859958887 858751655 857566476 856387317 854584932 851407170 848072171 845069051
1688.8 845069051 841399074 837154686 831076324 822910666 814377308 805680037 798400104 790671468
1705.1 790671468 780420363 768290579 754038632 737398684 717755020 692827582 666230381
1719.4 666230381 640752494 610058546 571263313 526673436 478313595 429416895 377409786
1733.7 377409786 339793444 339775085 379649311 448673159 521742344 583204865 627888680 657841384
$$ packed form
1623.5F67405963L5357118L7472128K8713406J7588615J1938870J0198057O653487
1637.8H15327644L931821L830909M535377N682648N612611L607631K950430K851129
1654.1H48330200J890123K042293K537906K323687J299918O74963Q10802P70032J9730
1672.5H60699654p40767j207232j185179j179159j802385l177762l334999l003120
1688.8H45069051l669977m244388o078362q165658q533358q697271p279933p728636
1705.1G90671468j0251105j2129784j4251947j6639948j9643664k4927438k6597201
1719.4F66230381k5477887l0693948l8795233m4589877m8359841m8896700n2007109
1733.7C77409786l7616342j8359L9874226O9023848P3069185O1462521M4683815K9952704
$$ plain form
1750 657841384 675550640 684830606 689578772 689680338 682744920 668164074 649002790 627636671
1766.3 627636671 608549476 606789827 632221460 668368459 695316076 712258875 723257244
1780.6 723257244 733110309 746428668 762967944 778900743 793577611 807355106 817944527
1794.9 817944527 825419962 831704378 837574959 843165219 848411679 853240669 857212961 860126257
1811.2 860126257 862236142 863977671 865501702 866745353 867983699 869535625 871336758 872809887
1827.5 872809887 873847902 874674141 875568867 876496732 877232552 877854586 878605366 879453480 879953563
1845.9 879953563 880127311 880380988 880860507 881231427 881301582 881241083 881187677 880912423 880218923 879458845
1866.3 879458845 879258871 879832804 880599916 881193221 881725669 882464767 883271933 883767903 883939028 884058774
$$ packed form
1750F57841384J7709256R279966M748166J01566o935418j4580846j9161284k1366119
1766.3F27636671j9087195j759649K5431633L6146999K6947617J6942799J0998369
1780.6G23257244R853065J3318359J6539276J5932799J4676868J3777495J0589421
1794.9H17944527P475435O284416N870581N590260N246460M828990L972292K913296
1811.2H60126257K109885J741529J524031J243651J238346J551926J801133J473129
1827.5H72809887J038015Q26239Q94726R27865P35820O22034P50780Q48114N00083
1845.9H79953563J73748K53677M79519L70920P0155o0499n3406k75254o93500p60078
1866.3H79458845j99974N73933P67112N93305N32448P39098Q07166M95970J71125J19746
$$ plain form
1886.7 884058774 884098589 883717835 883046865 882633746 882785499 883101702 883121252 882996142 883163154 883588493
1907.1 883588493 883788526 883499205 883037210 882888079 883084893 883318782 883399546 883392870 883256912 882908762
1927.5 882908762 882488787 882294714 882360458 882525086 882896543 883601308 884507716 885231614 885508478 885546803
1947.9 885546803 885725737 886049092 886207879 886136711 886121333 886323094 886473119 886346877 886140466 886157453
1968.3 886157453 886342227 886420131 886341453 886347890 886563063 886730909 886620343 886423528 886441410 886565924
1988.7 886565924 886511564 886308134 886214077 886251926 886186659 885945678 885762274 885797501 885861814 885730803 885486066
2011.1 885486066 885361433 885374844 885315359 885095477 884878993 884789288 884721994 884535015 884295583 884185076
2031.5 884185076 884188116 884131312 883973181 883862674 883886635 883865654 883598566 883174241 882837176 882615864
$$ packed form
1886.7H84058774L9815l80754o70970m13119J51753L16203J9550j25110J67012M25339
1907.1H83588493K00033k89321m61995j49131J96814K33889Q0764o676j35958l48150
1927.5H82908762m19975j94073O5744J64628L71457P04765R06408P23898K76864L8325
1947.9H85546803J78934L23355J58787p1168j5378K01761J50025j26242k06411J6987
1968.3H86157453J84774P7904p8678O437K15173J67846j10566j96815J7882J24514
1988.7H86565924n4360k03430r4057L7849o5267k40981j83404L5227O4313j31011k44737
2011.1H85486066j24633J3411n9485k19882k16484q9705o7294j86979k39432j10507
2031.5H84185076L040n6804j58131j10507K3961k0981k67088m24325l37065k21312
$$ plain form
2051.9 882615864 882358193 882069528 881979108 882268548 882783294 883220077 883522093 883827746 884126604 884278357
2072.3 884278357 884265840 884233415 884308338 884407520 884387493 884314120 884364724 884524107 884601116 884505391 884384871
2094.7 884384871 884402394 884478986 884441614 884331465 884347558 884483397 884533644 884399354 884217262 884133995 884073019
2117.1 884073019 883906364 883691132 883592963 883611262 883568823 883382797 883222938 883282185 883484900 883610010
2137.5 883610010 883660018 883830607 884119630 884289801 884226084 884121180 884202778 884396076 884482682 884493947
2157.9 884493947 884610474 884840488 884999275 884991169 884972811 885094047 885252416 885249019 885142148 885136843 885221481
2180.4 885221481 885208428 885038316 884872139 884834290 884805322 884634733 884419978 884340584 884361029 884284198 884064436
2202.8 884064436 883892775 883899271 883929610 883792520 883582473 883488238 883459091 883319855 883078754 882919908
$$ packed form
2051.9H82615864k57671k88665r0420K89440N14746M36783L02016L05653K98858J51753
2072.3H84278357j2517l2425P4923R9182k0027p3373N0604J59383P7009r5725j20520
2094.7H84384871J7523P6592l7372j10149J6093J35839N0247j34290j82092q3267o0976
2117.1H84073019j66655k15232r8169J8299m2439j86026j59859N9247K02715J25110
2137.5H83610010N0008J70589K89023J70171o3717j04904Q1598J93298Q6606J1265
2157.9H84493947J16527K30014J58787q106j8358J21236J58369l397j06871n305Q4638
2180.4H85221481j3053j70112j66177l7849k8968j70589k14755p9394K0445p6831k19762
2202.8H84064436j71661O496L0339j37090k10047r4235k9147j39236k41101j58846
$$ plain form
2223.2 882919908 882932127 882963598 882865429 882730126 882731676 882830977 882824600 882681310 882580936 882569194 882452488
2245.6 882452488 882146537 881814420 881611764 881524324 881443977 881356180 881353021 881437719 881485224 881427169 881319344
2268.1 881319344 881236613 881170332 881062031 880876541 880647302 880474985 880357742 880207777 880059659 880015671
2288.5 880015671 880045116 879998088 879824698 879651725 879515231 879279196 878899336 878466487 878061593 877688646
2308.9 877688646 877299249 876930952 876699984 876574576 876393080 876106799 875860929 875761509 875710785 875605166
2329.3 875605166 875449836 875242949 874982417 874780536 874731719 874844551 875308454 876270354 877101898 877082169
2349.7 877082169 876240909 875139356 874259949 873618722 873146534 872901678 872987032 873342514 873818278 874418914
2370.1 874418914 875171542 875948906 876587808 877088189 877595067 878132343 878579378 878864765 879042387 879190266
$$ packed form
2223.2H82919908J2219L1471r8169j35303J550R9301o377j43290j00374j1742j16706
2245.6H82452488l05951l32117k02656q7440q0347q7797l159Q4698M7505n8055j07825
2268.1H81319344q2731o6281j08301j85490k29239j72317j17243j49965j48118m3988
2288.5H80015671K9445m7028j73390j72973j36494k36035l79860m32849m04894l72947
2308.9H77688646l89397l68297k30968j25408j81496k86281k45870r9420n0724j05619
2329.3H75605166j55330k06887k60532k01881m8817J12832M63903R61900Q31544j9729
2349.7H77082169q41260j101553q79407o41227m72188k44856Q5354L55482M75764O00636
2370.1H74418914P52628P77364O38902N00381N06878N37276M47035K85387J77622J47879
$$ plain form
2390.4 879190266 879282236 879241705 879107356 879039466 879114091 879213333 879204869 879138589 879135609 879203200 879246175 879224777
2414.9 879224777 879226863 879314184 879384518 879306316 879134059 879043818 879063010 879031062 878909171 878850579 878900290
2437.4 878900290 878915489 878807962 878683031 878668785 878689528 878592372 878413379 878276467 878207028 878119409 877930164
2459.8 877930164 877710402 877603471 877562821 877412558 877151608 876946986 876893938 876892686 876808405 876685619
2480.2 876685619 876653850 876669586 876573920 876373529 876238048 876226783 876212597 876124144 876046598 876053214 876058519
2502.6 876058519 875956655 875824451 875805438 875888407 875927866 875874579 875845909 875908554 875950098 875891685 875807524
2525.1 875807524 875809729 875879347 875838757 875642896 875457227 875376403 875319779 875198126 875056207 875000775 874992192
2547.5 874992192 874891400 874719083 874585986 874478340 874291241 873996258 873693883 873506188 873503864 873669744
$$ packed form
2390.4H79190266R1970m0531j34349o7890P4625R9242q464o6280k980O7591M2975k1398
2414.9H79224777K086Q7321P0334p8202j72257r0241J9192l1948j21891n8592M9711
2437.4H78900290J5199j07527j24931j4246K0743r7156j78993j36912o9439q7619j89245
2459.8H77930164k19762j06931m0650j50263k60950k04622n3048j252q4281j22786
2480.2H76685619l1769J5736r5666k00391j35481j1265j4186q8453p7546O616N305
2502.6H76058519j01864j32204j9013Q2969L9459n3287k8670O2645M1544n8413q4161
2525.1H75807524K205O9618m0590j95861j85669q0824n6624j21653j41919n5432q583
2547.5H74992192j00792j72317j33097j07646j87099k94983l02375j87695k324J65880
$$ plain form
2567.9 873669744 873898745 874120712 874318659 874420166 874384940 874284923 874198794 874133587 874034345 873893738
2588.3 873893738 873801827 873805404 873831034 873817146 873780906 873749256 873720050 873692930 873711288 873808920 873926878
2610.7 873926878 873978674 873967826 873929620 873873591 873802900 873699725 873557031 873414338 873294353 873180866
2631.1 873180866 873103857 873078465 873057604 873016000 872941494 872843504 872727156 872582674 872473896 872438967 872399032
2653.5 872399032 872317135 872241318 872176409 872109413 872052073 872013152 871994555 871971488 871922255 871867061 871843874
2676 871843874 871850848 871813178 871695161 871563613 871485412 871462941 871445417 871385217 871314764 871284306 871248066 871162057
2700.5 871162057 871086240 871049762 871001005 870931029 870862603 870793998 870710611 870596945 870478213 870393693 870357931
2722.9 870357931 870350242 870289743 870167136 870087922 870060265 870006323 869879425 869660318 869404554 869179308 869005978
$$ packed form
2567.9H73669744K29001K21967J97947J01507l5226j00017q6129o5207r9242j40607
2588.3H73893738r1911L577K5630j3888l6240l1650k9206k7120J8358R7632J17958
2610.7H73926878N1796j0848l8206n6029p0691j03175j42694j42693j19985j13487
2631.1H73180866p7009k5392k0861m1604p4506r7990j16348j44482j08778l4929l9935
2653.5H72399032q1897p5817o4909o6996n7340l8921j8597k3067m9233n5194k3187
2676H71843874O974l7670j18017j31548p8201k2471j7524o0200p0453l0458l6240q6009
2700.5H71162057p5817l6478m8757o9976o8426o8605q3387j13666j18732q4520l5762
2722.9H70357931p689o0499j22607p9214k7657n3942j26898k19107k55764k25246j73330
$$ plain form
2745.3 869005978 868858695 868644118 868346393 868102849 867997766 867988586 868037939 868107021 868125439 868057549 867961764
2767.8 867961764 867915690 867911160 867877007 867738664 867513597 867291033 867097855 866914511 866782725 866752088
2788.2 866752088 866741240 866654158 866519511 866391897 866268396 866105199 865900397 865732849 865679801 865692973
2808.6 865692973 865606070 865367234 865106463 864948094 864866197 864729524 864527404 864357054 864216685 864011467
2828.9 864011467 863715887 863434374 863261282 863122523 862777054 862163424 861553490 861040056 860356629 859310985
2849.3 859310985 857956052 856180072 853300929 848371863 841164827 833741128 830347538 833203971
2865.7 833203971 839675546 845853209 850244939 852932155 854318440 855088353 855723381 856203556 856402457
2884 856402457 856387436 856337607 856279254 856095970 855780780 855353057 854718626 853719771 852115393 849834859
$$ packed form
2745.3H69005978j47283k14577k97725k43544j05083r180M9353O9082J8418o7890r5785
2767.8H67961764m6074m530l4153j38343k25067k22564j93178j83344j31786l0637
2788.2H66752088j0848q7082j34647j27614j23501j63197k04802j67548n3048J3172
2808.6H65692973q6903k38836k60771j58369q1897j36673k02120j70350j40369k05218
2828.9H64011467k95580k81513j73092j38759l45469o13630o09934n13434o83427j045644
2849.3H59310985j354933j775980k879143m929066p207036p423699l393590K856433
2865.7H33203971O471575O177663M391730K687216J386285P69913O35028M80175J98901
2884H56402457j5021m9829n8353j83284l15190m27723o34431r98855j604378k280534
$$ plain form
2904.4 849834859 847442627 845917881 845699072 846393764 847496748 848753214 849886954 850644410 851107776
2922.8 851107776 851486027 851828516 852006614 851793706 851221979 850467443 849403918 847851753 846049368
2941.1 846049368 844405770 843054473 842069507 841771424 842390358 843562961 844778776 845940411 847037435
2959.5 847037435 847967207 848619759 848990440 849214077 849386454 849476099 849276900 848598778 847524941 845849693
2979.9 845849693 842360258 835747957 828089654 826049507 832528234 841037810 844998777 844636381
2996.2 844636381 842560291 839959085 836780250 832576156 827655256 824366689 825877070 832221389
3012.5 832221389 839779079 845478952 848832846 850487292 851216018 851641357 852043271 852521837 853024602
3030.9 853024602 853452623 853741825 853861034 853996933 854206741 854245603 853983343 853523791 853038371 852515697
$$ packed form
2904.4H49834859k392232j524746k18809O94692J102984J256466J133740P57456M63366
2922.8H51107776L78251L42489J78098k12908n71727p54536j063525j552165j802385
2941.1H46049368j643598j351297r84966k98083O18934J172603J215815J161635J097024
2959.5H47037435R29772O52552L70681K23637J72377Q9645j99199o78122j073837j675248
2979.9H45849693l489435o612301p658303k040147O478727Q509576L960967l62396
2996.2H44636381k076090k601206l178835m204094m920900l288567J510381O344319
3012.5H32221389P557690N699873L353894J654446P28726M25339M01914M78566N02765
3030.9H53024602M28021K89202J19209J35899K09808L8862k62260m59552m85420n22674
$$ plain form
3051.3 852515697 851903856 851300955 850763977 850451887 850620449 851172507 851708353 851877511 851648033 851323485
3071.7 851323485 851137936 851082861 850999951 850655496 850092351 849567711 849096060 848643899 848263264 847922325
3092.1 847922325 847608209 847353637 847105205 846559167 845386386 843703389 842000604 840871334 840823233
3110.4 840823233 841988087 843850553 845497370 846402824 846579850 846277356 845978439 846056700 846376359
3128.8 846376359 846543074 846431732 846298516 846355915 846388340 846053243 845489621 845050633 844762087 844576240
3149.2 844576240 844477654 844222248 843715250 843184531 842698336 842186570 841704130 841295838 840906024 840492070
3169.6 840492070 840051591 839587212 839091778 838521957 837889671 837304533 836783469 836198509 835509181 834810615
3189.9 834810615 834173203 833566725 832948148 832357407 831820548 831305742 830803335 830316544 829814494 829271138
$$ packed form
3051.3H52515697o11841o02901n36978l12090J68562N52058N35846J69158k29478l24548
3071.7H51323485j85549n5075q2910l44455n63145n24640m71651m52161l80635l40939
3092.1H47922325l14116k54572k48432n46038j172781j682997j702785j129270m8101
3110.4H40823233J164854J862466J646817R05454J77026l02494k98917P8261L19659
3128.8H46376359J66715j11342j33216N7399L2425l35097n63622m38988k88546j85847
3149.2H44576240r8586k55406n06998n30719m86195n11766m82440m08292l89814m13954
3169.6H40492070m40479m64379m95434n69821o32286n85138n21064n84960o89328o98566
3189.9H34810615o37412o06478o18577n90741n36859n14806n02407m86791n02050n43356
$$ plain form
3210.3 829271138 828669190 827986777 827283680 826661050 826064646 825370729 824615896 823889256 823199213 822536349
3230.7 822536349 821853578 821063101 820237219 819483757 818734288 817949295 817210019 816543460 815817952 814978004
3251.1 814978004 814175487 813504338 812850177 812123299 811409235 810774624 810215652 809791565 809525907 809184253
3271.5 809184253 808579683 807805479 807006717 806327820 805754185 805118680 804392695 803710520 803177357 802666247
3291.9 802666247 801951110 800980151 799854875 798770547 797917962 797253668 796449482 795222521 793640614
3310.3 793640614 791988969 790490091 789105475 787696183 786236107 784798503 783361673 781692266
3326.6 781692266 779776275 777863145 776038766 774308860 772662401 770861804 768755078 766492605
3342.9 766492605 764173210 761959732 760027826 758005083 755522370 752873063 750404596 748076618
$$ packed form
3210.3H29271138o01948o82413p03097o22630n96404o93917p54833p26640o90043o62864
3230.7H22536349o82771p90477q25882p53462p49469p84993p39276o66559p25508q39948
3251.1H14978004q02517o71149o54161p26878p14064o34611n58972m24087k65658l41654
3271.5H09184253o04570p74204p98762o78897n73635o35505p25985o82175n33163n11110
3291.9H02666247p15137r70959j125276j084328q52585o64294q04186j226961j581907
3310.3G93640614j651645j498878j384616j409292j460076j437604j436830j669407
3326.6G81692266j915991j913130j824379j729906j646459j800597k106726k262473
3342.9G66492605k319395k213478j931906k022743k482713k649307k468467k327978
$$ plain form
3359.2 748076618 745656192 743138313 740811288 738636255 736180663 733311653 730469286 728016198
3375.5 728016198 725824296 723709166 721603751 719542325 717704713 716199756 714937329 713603675
3391.9 713603675 711990535 710392952 709176540 708171427 706877828 705267906 703807354 702654362
3408.2 702654362 701627612 700605333 699533045 698443174 697479606 696693003 696025014 695490003 695117116
3426.5 695117116 694844544 694602728 694439888 694376230 694278657 694098651 693990946 694063604 694260299 694503665
3446.9 694503665 694775939 695078075 695389032 695760250 696307123 697086096 698038936 699045122 700039506
3465.3 700039506 701030672 702054799 703076243 703951478 704617798 705195963 705900013 706907213 708145022
3483.6 708145022 709471226 710831821 712126315 713325322 714521468 715807915 717142761 718520999
$$ packed form
3359.2G48076618k420426k517879k327025k175033k455592k869010k842367k453088
3375.5G28016198k191902k115130k105415k061426j837612j504957j262427j333654
3391.9G13603675j613140j597583j216412j005113j293599j609922j460552j152992
3408.2G02654362j026750j022279j072288j089871r63568p86603o67989n35011l72887
3426.5F95117116k72572k41816j62840o3658r7573j80006j07705P2658J96695K43366
3446.9F94503665K72274L02136L10957L71218N46873P78973R52840J006186R94384
3465.3G00039506R91166J024127J021444Q75235O66320N78165P04050J007200J237809
3483.6G08145022J326204J360595J294494J199007J196146J286447J334846J378238
$$ plain form
3500 718520999 720034838 721571088 722990930 724391103 725832939 727299452 728773654 730211318 731633127
3518.3 731633127 733123779 734744966 736391544 737957597 739474416 740993798 742558062 744164109
3534.6 744164109 745767593 747340798 748935223 750586867 752225637 753692329 754989564 756359160
3551 756359160 757846713 759287000 760767162 762439668 764147103 765725851 767337918 769174099 770967543
3569.3 770967543 772518396 774041355 775711894 777528286 779459715 781449676 783448458 785486579
3585.6 785486579 787516117 789391339 791179717 793100476 795181692 797299922 799330890 801225126
3601.9 801225126 803044319 804866314 806763232 808641791 810450256 812235534 813892365 815545797
3618.3 815545797 817216754 818570316 819681466 820863128 822394311 823961377 825102568 826101422
$$ packed form
3500G18520999J513839J536250J419842J400173J441836J466513J474202J437664J421809
3518.3G31633127J490652J621187J646578J566053J516819J519382J564264J606047
3534.6G44164109J603484J573205J594425J651644J638770J466692J297235J369596
3551G56359160J487553J440287J480162J672506J707435J578748J612067J836181J793444
3569.3G70967543J550853J522959J670539J816392J931429J989961J998782K038121
3585.6G85486579K029538J875222J788378J920759K081216K118230K030968J894236
3601.9H01225126J819193J821995J896918J878559J808465J785278J656831J653432
3618.3H15545797J670957J353562J111150J181662J531183J567066J141191R98854
$$ plain form
3634.6 826101422 827090740 828042090 828994572 829906821 830765724 831704497 832877696 833850086 834210932
3652.9 834210932 834488332 835080266 835667253 835988045 836174309 836416721 836731791 837104082 837418914 837547183
3673.3 837547183 837662697 837754726 837793529 837948978 838256836 838768303 839561224 840209305 840334892 840385616
3693.7 840385616 840564370 840704858 840799093 840962589 841144681 841278017 841394067 841531694 841719568 841814399
3714.1 841814399 841756344 841664910 841595829 841545105 841542125 841591477 841642499 841728449 841919899 842159748 842328012
3736.5 842328012 842292905 842024803 841752410 841737032 841782570 841754794 841863811 841998696 841970682 841897607 841911376
3759 841911376 841925800 841846347 841743052 841655433 841623485 841594934 841492474 841416001 841468871 841560185 841508627
3781.4 841508627 841384649 841267228 841128230 841058254 841041863 840975225 840927839 840887547 840825558 840862572 840841532
$$ packed form
3634.6H26101422R89318R51350R52482R12249Q58903R38773J173199R72390L60846
3652.9H34210932K77400N91934N86987L20792J86264K42412L15070L72291L14832J28269
3673.3H37547183J15514R2029L8803J55449L07858N11467P92921O48081J25587N0724
3693.7H40385616J78754J40488R4235J63496J82092J33336J16050J37627J87874R4831
3714.1H41814399n8055r1434o9081n0724k980M9352N1022Q5950J91450K39849J68264
3736.5H42328012l5107k68102k72393j5378M5538k7776J09017J34885k8014p3075J3769
3759H41911376J4424p9453j03295q7619l1948k8551j02460p6473N2870R1314n1558
3781.4H41508627j23978j17421j38998o9976j6391o6638m7386m0292o1989L7014k1040
$$ plain form
3803.9 840841532 840725660 840663552 840552628 840374589 840323687 840489805 840589941 840514064 840390325 840238750
3824.3 840238750 840138257 840064943 839962423 839930534 840009034 840061486 839979827 839837492 839727461 839650214 839529812
3846.7 839529812 839314938 839082539 839026451 839105725 838996410 838782549 838652790 838651717 838692546 838658929 838607788
3869.1 838607788 838546157 838381290 838181436 838017583 837994754 838101029 838129461 838023365 837813437 837664664
3889.5 837664664 837666810 837624013 837486029 837378383 837329268 837295115 837244809 837174594 837082148 836985886 836866319
3912 836866319 836699605 836594939 836616695 836598694 836451352 836338699 836312830 836242259 836144567 836090326 836034000
3934.4 836034000 835933745 835799873 835694492 835671067 835663080 835658014 835680187 835646927 835604131 835626721 835624754
3956.8 835624754 835551620 835484922 835470617 835469782 835443199 835390627 835375071 835416794 835427463 835379183 835334778 835324347
$$ packed form
3803.9H40841532j15872o2108j10924j78039n0902J66118J00136p5877j23739j51575
3824.3H40238750j00493p3314j02520l1889P8500N2452q1659j42335j10031p7247j20402
3846.7H39529812k14874k32399n6088P9274j09315k13861j29759j073M0829l3617n1141
3869.1H38607788o1631j64867j99854j63853k2829J06275K8432j06096k09928j48773
3889.5H37664664K146m2797j37984j07646m9115l4153n0306p0215r2446r6262j19567
3912H36866319j66714j04666K1756j8001j47342j12653k5869p0571r7692n4241n6326
3934.4H36034000j00255j33872j05381k3425p987n066K2173l3260m2796K2590j967
3956.8H35624754p3134o6698j4305q35k6583n2572j5556M1723J0669m8280m4405j0431
$$ plain form
3981.3 835324347 835282505 835126042 834932446 834836543 834817767 834756255 834605157 834486842
3997.6 834486842
$$ packed form
3981.3H35324347m1842j56463j93596r5903j8776o1512j51098j18315
3997.6H34486842
##END=$$ End of the data block
