##TITLE=Renata Menger - CN-N(CH3)2 $$ Begin of the data block
##JCAMP-DX=5.00 $$ ACD/SpecManager v 10.08
##SPECTROMETER/DATA SYSTEM=Alpha
##DATE=12 Nov 2014 09:25:08
##DATA TYPE=INFRARED SPECTRUM
##DATA CLASS=XYDATA
##ORIGIN=
##OWNER=
##NPOINTS=1765
##FIRSTX=399.76428223
##LASTX=3997.64306641
##MAXX=3997.64306641
##MINX=399.76428223
##MAXY=0.88717771
##MINY=0.53725666
##XFACTOR=1.0000000000
##YFACTOR=1.000000000000000e-9
##FIRSTY=0.85456234
##DELTAX=2.03961372
##XUNITS=1/CM
##YUNITS=ARBITRARY UNITS
##XYDATA=(X++(Y..Y))
$$ plain form
399.8 854562342 855049729 853138506 852023840 853237808 853728771 851632059 849777758 849887729 848933399
418.1 848933399 845492423 844318390 845720708 846535206 846063256 846457720 848589182 850075245 849487782
436.5 849487782 848861635 849615395 850144625 849316478 848595738 849122226 849724174 848990738 847832143 847645462
456.9 847645462 847549677 845868468 842525661 838392973 836078525 837917864 841814578 844646752 846190870
475.2 846190870 846947312 846942961 846569717 846046507 844967425 843723178 844029367 846197844 848265290
493.6 848265290 848705530 848077476 847718239 847796261 847407341 846304417 845253289 844461024 842564225
511.9 842564225 837675989 828105927 814410090 805930614 811653256 825346649 836132824 841294527
528.3 841294527 842866838 843031466 843779624 845121562 845351040 844315827 843931258 844659865 844627619
$$ packed form
399.8H54562342M87387j911223j114666J213968M90963k096712j854301J09971r54330
418.1H48933399l440976j174033J402318Q14498m71950L94464K131462J486063n87463
436.5H49487782o26147P53760N29230q28147p20740N26488O01948p33436j158595j86681
456.9H47645462r5785j681209l342807m132688k314448J839339L896714K832174J544118
475.2H46190870P56442m351l73244n23210j079082j244247L06189K168477K067446
493.6H48265290M40240o28054l59237P8022l88920j102924j051128p92265j896799
511.9H42564225m888236r570062j3695837q479476N722642J3693393J0786175N161703
528.3H41294527J572311J64628P48158J341938K29478j035213l84569P28607l2246
$$ plain form
546.6 844627619 843145907 841946542 841877937 840891242 837187111 831473649 824452937 816967785 814098656
565 814098656 820388615 831548631 839428663 841686249 841777384 842809200 844129682 843866944 842886508
583.3 842886508 843057096 843557894 842437983 840252459 838346660 833644509 817064285 789986074
599.6 789986074 781033456 803783059 830024362 840454638 842999935 845637321 848366439 849476397
616 849476397 850179672 852105677 853960633 854022324 853378594 854393423 856820166 858223617 858353496
634.3 858353496 859204412 860737622 861275613 860932648 861450732 862951100 863731086 863348067 863426149 864685059
654.7 864685059 865631461 865402699 865263164 866278112 867214322 866308033 865134180 866487145 868056953
673.1 868056953 868215978 867718995 868093133 869224846 869777620 869655013 869991422 871104181 871871173
$$ packed form
546.6H44627619j481712j199365o8605r86695l704131n713462p020712p485152k869129
565H14098656O289959J1160016P880032K257586R1135J031816J320482k62738r80436
583.3H42886508J70588N00798j119911k185524j905799m702151j6580224k7078211
599.6G89986074q952618K2749603K6241303J0430276K545297K637386K729118J109958
616H49476397P03275J926005J854956O1691o43730J014829K426743J403451J29879
634.3H58353496Q50916J533210N37991l42965N18084J500368P79986l83019P8082J258910
654.7H64685059R46402k28762j39535J014948R36210r06289j173853J352965J569808
673.1H68056953J59025m96983L74138J131713N52774j22607L36409J112759P66992
$$ plain form
691.4 871871173 871703327 871597886 872316718 873050570 872899592 872480273 872723639 873233497 873006821 872228444
711.8 872228444 871894121 871873915 870662093 867137551 861406982 854557097 846485972 837643921 837117851
730.2 837117851 850651503 866230011 873162627 874307930 874499917 874639630 874007761 873008370 872981489
748.5 872981489 874146879 875178039 875339568 875583649 876480401 877052605 876536489 875835299 876047671
766.9 876047671 876530707 876003385 874896824 874486446 874351144 872832716 869968116 868025839 868269563
785.3 868269563 869210184 869873405 871245444 872995377 873406947 872112989 870504200 869528234 867992043
803.6 867992043 864070654 857195616 846106410 825509369 789585710 748455465 734989762 767051876
819.9 767051876 817930996 854042470 871176898 879394650 883659422 885107398 885597825 886545002
$$ packed form
691.4H71871173j67846j05441P18832P33852j50978m19319K43366N09858k26676p78377
711.8H72228444l34323k0206j211822l524542n730569o849885q071125q842051n26070
730.2H37117851J3533652J5578508O932616J145303J91987J39713o31869r99391k6881
748.5H72981489J165390J031160J61529K44081Q96752N72204n16116p01190K12372
766.9H76047671M83036n27322j106561m10378j35302j518428k864600j942277K43724
785.3H68269563R40621O63221J372039J749933M11570j293958j608789r75966j536191
803.6H67992043l921389o875038j1089206k0597041l5923659m1130245j3465703L2062114
819.9G67051876N0879120L6111474J7134428Q217752M264772J447976M90427R47177
$$ plain form
836.2 886545002 887177706 886477828 885500193 885732710 886477590 886103749 884904861 884366810 884287894 882792294
856.6 882792294 879265189 876110792 876498044 879804909 882517636 883776486 884799004 885238230 884420812
875 884420812 883511007 883772075 884289503 883619070 882399201 882110476 882409394 881851315 880472124 879755020
895.4 879755020 880042493 880010843 879175067 878770411 879274786 879344940 878159165 876807511 876324177 875832081
915.8 875832081 874066472 871433258 868896306 865383565 857639849 847107410 844438493 852610171
932.1 852610171 859073520 856503844 848089337 835920691 821802974 814249814 821526527 839886189
948.4 839886189 858416915 869104207 870450914 866421402 864451110 868301749 872870982 874407291
964.7 874407291 874528825 873883665 872402370 871115863 870616078 870101154 868890464 867646933 867085397
$$ packed form
836.2H86545002O32704o99878r77635K32517P44880l73841j198888n38051p8916j495600
856.6H82792294l527105l154397L87252L306865K712727J258850J022518M39226q17418
875H84420812r09805K61068N17428o70433j219869k88725K98918n58079j379191p17104
895.4H79755020K87473l1650q35776m04656N04375P0154j185775j351654m83334m92096
915.8H75832081j765609k633214k536952l512741p743716j0532439k668917Q171678
932.1H52610171O463349k569676q414507j2168646j4117717p553160P276713J8359662
948.4H39886189J8530726J0687292J346707m029512j970292L850639M569233J536309
964.7H74407291J21534o45160j481295j286507m99785n14924j210690j243531n61536
$$ plain form
983.1 867085397 866468549 864800870 862500072 860390842 857701361 853621721 850937188 852985620 857720256
1001.4 857720256 860737860 861216247 861006916 861170709 861077309 860154867 859163046 858902156 858821154 857997060
1021.8 857997060 856814325 856290102 856259286 855692685 854580104 853901148 853822649 853422999 852366090
1040.2 852366090 851463675 851139128 850636840 849391222 848077416 847387850 846760750 845276952 843170762
1058.6 843170762 841267347 839370966 836589098 832976639 829748154 828131318 828828514 831712306
1074.9 831712306 835660815 839235723 841359496 841859162 841679633 841727078 841725886 841037095 839958549
1093.2 839958549 839268804 838869154 838064015 836927772 836203516 835953772 835368276 834097803 832776725
1111.6 832776725 831828654 830697000 828903198 826924086 825336874 823838472 821794093 819284081
$$ packed form
983.1H67085397o16848j667679k300798k109230k689481m079640k684533K048432M734636
1001.4H57720256L017604M78387k09331J63793r3400r22442r91821k60890q1002q24094
1021.8H57997060j182735n24223l0816n66601j112581o78956p8499l99650j056909
1040.2H52366090r02415l24547n02288j245618j313806o89566o27100j483798k106190
1058.6H43170762j903415j896381k781868l612459l228485j616836O97196K883792
1074.9H31712306L948509L574908K123773M99666j79529M7445j192o88791j078546
1093.2H39958549o89745l99650q05139j136243p24256k49744n85496j270473j321078
1111.6H32776725r48071j131654j793802j979112j587212j498402k044379k510012
$$ plain form
1127.9 819284081 816901505 814960361 813681901 813330650 813427806 812913537 811072707 808062077 804726005
1146.3 804726005 801504970 797908187 793381214 787883699 780844867 770673931 758089423 749673903
1162.6 749673903 749909937 751495302 745018363 730533600 713232756 697871327 688273311 686117589
1178.9 686117589 690095365 697205424 703577340 705026448 699315608 687892914 675011158 665132642
1195.2 665132642 660664141 662068546 671029568 692357719 728375733 771836758 810311079 837029696
1211.5 837029696 853054643 862036884 866653740 868171692 867128134 863940537 858862758 851804733
1227.9 851804733 843029559 834706187 830890000 833803475 840751827 847240150 851496577 853889108
1244.2 853889108 854552865 853238583 849936664 844692171 837174773 827191949 817096114 813752174
$$ packed form
1127.9H19284081k382576j941144j278460l51251R7156n14269j840830l010630l336072
1146.3H04726005l221035l596783m526973n497515p038832j0170936j2584508q415520
1162.6G49673903K36034J585365o476939j4484763j7300844j5361429r598016k155722
1178.9F86117589L977776P110059O371916J449108n710840j1422694j2881756r878516
1195.2F65132642m468501J404405Q961022K1328151L6018014M3461025L8474321K6718617
1211.5H37029696J6024947Q982241M616856J517952j043558l187597n077779p058025
1227.9H51804733q775174q323372l816187K913475O948352O488323M256427K392531
1244.2H53889108O63757j314282l301919n244493p517398r982824j0095835l343940
$$ plain form
1260.5 813752174 822546184 838383555 851068020 856866241 858267963 857926309 856889427 855642378
1276.8 855642378 854546010 853573978 852442026 851151049 850005627 849052131 848009527 846725345 845422745
1295.2 845422745 844275713 843052149 841474354 839707971 838049889 836380005 834441185 832320035
1311.5 832320035 830294311 828305304 825861216 822669268 818958402 814598680 808857381 801065028
1327.8 801065028 792191148 787697077 792383492 800727546 803776920 800615489 794753313 787535667
1344.1 787535667 778871059 768731773 756590903 741686821 723767698 704395056 687500000
1358.4 687500000 677529693 678866088 693205059 716510355 741120815 757605731 762438416 758047998
1374.7 758047998 747705162 733295500 715568423 696750343 680724382 671838224 673585713 684911370
$$ packed form
1260.5H13752174Q794010J5837371J2684465N798221J401722l41654j036882j247049
1276.8H55642378j096368r72032j131952j290977j145422r53496j042604j284182j302600
1295.2H45422745j147032j223564j577795j766383j658082j669884j938820k121150
1311.5H32320035k025724j989007k444088l191948l710866m359722n741299p792353
1327.8H01065028q873880m494071M686415Q344054L049374l161431n862176p217646
1344.1G87535667q664608j0139286j2140870j4904082j7919123j9372642j6895056
1358.4F87500000r970307J336395J4338971K3305296K4610460J6484916M832685m390418
1374.7G58047998j0342836j4409662j7727077j8818080j6025961q886158J747489J1325657
$$ plain form
1391 684911370 705127716 734338880 766418397 796292424 820004761 835463583 844588697 848742485
1407.3 848742485 849323273 846766353 840597034 831157804 821425676 819700837 827676475 835177720
1423.7 835177720 837337852 835883975 832223535 826609910 820113420 811431170 800544858 792091250
1440 792091250 788041770 788798332 792497039 795644283 796532691 796003759 795025587 793933570 793779552
1458.3 793779552 795218170 797084391 798515618 799734652 801746845 805008531 808912933 811506152
1474.7 811506152 811986864 810943544 808325112 804384112 800091982 795733333 790601373 784442067
1491 784442067 778490126 771658599 761719465 749670625 738169074 727507889 712934256 687461197
1507.3 687461197 662113965 640018225 616020441 589794397 563783944 545381486 537256658
$$ packed form
1391F84911370K0216346K9211164L2079517K9874027K3712337J5458822R125114M153788
1407.3H48742485N80788k556920o169319r439230r732128j724839P975638P501245
1423.7H35177720K160132j453877l660440n613625o496490q682250j0886312q453608
1440G92091250m049480P56562L698707L147244Q88408n28932r78172j092017j54018
1458.3G93779552J438618J866221J431227J219034K012193L261686L904402K593219
1474.7H11506152M80712j043320k618432l941000m292130m358649n131960o159306
1491G84442067n951941o831527r939134j2048840j1501551j0661185j4573633k5473059
1507.3F87461197k5347232k2095740k3997784k6226044k6010453j8402458q124828
$$ plain form
1521.6 537256658 539308190 551013529 572895408 601396561 635699153 678464234 713913560
1535.8 713913560 729446232 722643793 705798566 701988041 709486783 720157325 728050292 728291690
1552.2 728291690 718987823 702249050 674071252 641927600 626776338 617728055 609470844 606972039
1568.5 606972039 620742023 652204454 699439585 759698749 803654432 826092243 838574827
1582.8 838574827 844275832 845267951 843621850 839984536 833873510 823938072 809403479 789864182
1599.1 789864182 763724387 728880286 687017500 645606875 614468277 597610712 591736376
1613.4 591736376 595995367 613561690 638461292 667570531 702346325 732816279 754333675
1627.6 754333675 769334078 778807640 785557985 791898787 796746910 800006330 803281248 808129728
$$ packed form
1521.6E37256658K051532J1705339K1881879K8501153L4302592M2765081L5449326
1535.8G13913560J5532672o802439j6845227l810525P498742J0670542P892967K41398
1552.2G28291690r303867j6738773k8177798l2143652j5151262r048283q257211k498805
1568.5F06972039J3769984L1462431M7235131O0259164M3955683K2437811J2482584
1582.8H38574827N701005R92119j646101l637314o111026r935438j4534593j9539297
1599.1G89864182k6139795l4844101m1862786m1410625l1138598j6857565n874336
1613.4E91736376M258991J7566323K4899602K9109239L4775794L0469954K1517396
1627.6G54333675J5000403R473562O750345O340802M848123L259420L274918M848480
$$ plain form
1643.9 808129728 816520870 826469421 833325326 839671910 847213745 851745665 854921460 858408451
1660.3 858408451 862152040 865444303 868012249 870525897 872991383 874846578 876415193 877901077
1676.6 877901077 879221082 880551040 881810308 882640541 883015275 883373141 883787215 884220183 884679377
1694.9 884679377 885072231 885233700 885083854 884991050 884938240 884694278 884361327 884147644 884098470 883966327
1715.3 883966327 883243918 882162333 881439805 881038666 880964875 881361961 882163584 882982254 883376062 883432209
1735.7 883432209 883674324 884073913 884371877 884565055 884805560 885170937 885465086 885537148 885548472 885572433
1756.1 885572433 885595143 885609806 885501444 885313392 885209382 885218501 885306954 885273576 885086060 884958625 884928226
1778.6 884928226 884871244 884706259 884464920 884257138 884174883 884070098 883781016 883463919 883255363 883043826
$$ packed form
1643.9H08129728Q391142R948551O855905O346584P541835M531920L175795L486991
1660.3H58408451L743589L292263K567946K513648K465486J855195J568615J485884
1676.6H77901077J320005J329958J259268Q30233L74734L57866M14074M32968M59194
1694.9H84679377L92854J61469j49846r2804n2810k43962l32951k13683m9174j32143
1715.3H83966327p22409j081585p22528m01139p3791L97086Q01623Q18670L93808N6147
1735.7H83432209K42115L99589K97964J93178K40505L65377K94149P2062J1324K3961
1756.1H85572433K2710J4663j08362j88052j04010R119Q8453l3378j87516j27435l0399
1778.6H84928226n6982j64985k41339k07782q2255j04785k89082l17097k08556k11537
$$ plain form
1799 883043826 882720709 882355750 882080972 881913245 881819487 881742179 881630123 881448865 881135583 880779326
1819.4 880779326 880538821 880372643 880190313 880083621 880012393 879842937 879612327 879346550 879091084 878900111
1839.8 878900111 878688753 878264070 877731562 877272904 876705229 875903368 875158131 875093997 875814915 876591921
1860.2 876591921 876916528 876987636 876960158 876631320 875981450 875330925 874751925 874277830 874088109 874081969
1880.5 874081969 873905003 873444080 873015940 872818291 872632384 872332335 872129738 872194827 872360647 872269273
1900.9 872269273 871752977 871051490 870588005 870490193 870366216 869824111 869183779 869185090 869858384 870486081
1921.3 870486081 870788336 870858133 870702684 870353818 870013535 869790792 869529247 869098067 868639350 868310809
1941.7 868310809 868037581 867702127 867386103 867240131 867176652 866944253 866530836 866214693 866100073 865979791
$$ packed form
1799H83043826l23117l64959k74778j67727r3758p7308j12056j81258l13282l56257
1819.4H80779326k40505j66178j82330j06692p1228j69456k30610k65777k55466j90973
1839.8H78900111k11358m24683n32508m58658n67675q01861p45237o4134P20918P77006
1860.2H76591921L24607P1108k7478l28838o49870o50525n79000m74095j89721o140
1880.5H74081969j76966m60923m28140j97649j85907l00049k02597O5089J65820r1374
1900.9H72269273n16296p01487m63485r7812j23977n42105o40332J311O73294O27697
1921.3H70486081L02255O9797j55449l48866l40283k22743k61545m31180m58717l28541
1941.7H68310809k73228l35454l16024j45972o3479k32399m13417l16143j14620j20282
$$ plain form
1962.1 865979791 865768194 865616500 865551353 865378439 865008116 864612460 864343464 864059031 863589287 863062263
1982.5 863062263 862690687 862389207 861911714 861240625 860646069 860379517 860377252 860488594 860713005 860981047
2002.9 860981047 861042380 860827863 860571384 860418737 860242844 859910488 859520018 859243631 859008491 858624101
2023.3 858624101 858165562 857860923 857694626 857464552 857173681 857012749 856987178 856899142 856694996 856534839
2043.7 856534839 856472313 856357753 856114149 855885863 855779290 855670035 855451882 855230033 855105162 854990780
2064.1 854990780 854784727 854563117 854439855 854333580 854103684 853795052 853555620 853383482 853158116 852876544
2084.5 852876544 852640152 852455914 852219939 851885438 851517797 851167619 850781739 850344777 849929214 849563181
2104.9 849563181 849200070 848796248 848397195 848089159 847856343 847617865 847388506 847214401 847061455 846886456
$$ packed form
1962.1H65979791k11597j51694o5147j72914l70323l95656k68996k84433m69744n27024
1982.5H63062263l71576l01480m77493o71089n94556k66552k265J11342K24411K68042
2002.9H60981047O1333k14517k56479j52647j75893l32356l90470k76387k35140l84390
2023.3H58624101m58539l04639j66297k30074k90871j60932k5571q8036k04146j60157
2043.7H56534839o2526j14560k43604k28286j06573j09255k18153k21849j24871j14382
2064.1H54990780k06053k21610j23262j06275k29896l08632k39432j72138k25366k81572
2084.5H52876544k36392j84238k35975l34501l67641l50178l85880m36962m15563l66033
2104.9H49563181l63111m03822l99053l08036k32816k38478k29359j74105j52946j74999
$$ plain form
2125.3 846886456 846700609 846502006 846246898 845918536 845529199 845091343 844596028 844030201 843378544 842632949
2145.7 842632949 841690421 840366006 838696122 837296665 837079465 837891221 838421941 838008881 837004721
2164.1 837004721 835724831 834282458 832747340 831072688 829130530 826919317 824626982 822327971
2180.4 822327971 819726110 816322148 811837077 806094885 798867047 789878726 778399408 762779951
2196.7 762779951 741915584 718854189 698355138 677357376 651951194 632695794 634296834
2211 634296834 663821042 716617525 771253228 809557438 832454026 846789241 856034815 861974239
2227.3 861974239 866032481 868962884 870770693 871420562 871310353 870854080 870158911 869282901 868393600
2245.6 868393600 867628396 866885781 866034150 865135372 864343405 863605738 862821162 862086594 861523867 861077547
$$ packed form
2125.3H46886456j85847j98603k55108l28362l89337m37856m95315n65827o51657p45595
2145.7H42632949r42528j324415j669884j399457k17200Q11756N30720m13060j004160
2164.1H37004721j279890j442373j535118j674652j942158k211213k292335k299011
2180.4H22327971k601861l403962m485071n742192p227838q988321j1479318j5619457
2196.7G62779951k0864367k3061395k0499051k0997762k5406182j9255400J601040
2211F34296834K9524208N2796483N4635703L8304210K2896588J4335215R245574N939424
2227.3H61974239M058242K930403J807809O49869j10209m56273o95169q76010q89301
2245.6H68393600p65204p42615q51631q98778p91967p37667p84576p34568n62727m46320
$$ plain form
2266 861077547 860598981 860088229 859647751 859241664 858704984 858068466 857500970 857034981 856527269 855870962
2286.4 855870962 855152190 854447365 853681862 852921009 852520943 852639258 852935016 853003025 852802038 852444649
2306.8 852444649 851990879 851483881 851006448 850652039 850264430 849562764 848586321 847694993 847083569 846644878
2327.2 846644878 846310258 846187711 846235573 846188366 846023738 846012354 846252739 846640646 847299218 848039687
2347.6 848039687 848232269 847597480 846418023 845252216 844422042 843921423 843631864 843648612 844070494
2366 844070494 844729662 845383406 846003175 846631467 847211242 847698271 848135650 848538935 848801494 848818779
2386.4 848818779 848651767 848468423 848335803 848205268 848077953 848016560 848000705 847927332 847755432 847534955
2406.8 847534955 847296417 847011030 846674383 846354902 846123815 845929384 845680356 845421076 845245957 845105946
$$ packed form
2266H61077547m78566n10752m40478m06087n36680o36518n67496m65989n07712o56307
2286.4H55870962p18772p04825p65503p60853m00066J18315K95758O8009k00987l57389
2306.8H52444649m53770n06998m77433l54409l87609p01666r76443q91328o11424m38691
2327.2H46644878l34620j22547M7862m7207j64628j1384K40385L87907O58572P40469
2347.6H48039687J92582o34789j179457j165807q30174n00619k89559J6748M21882
2366H44070494O59168O53744O19769O28292N79775M87029M37379M03285K62559J7285
2386.4H48818779j67012j83344j32620j30535j27315o1393j5855p3373j71900k20477
2406.8H47534955k38538k85387l36647l19481k31087j94431k49028k59280j75119j40011
$$ plain form
2427.2 845105946 844891310 844654322 844476938 844288170 844025075 843763113 843581021 843414426 843144894 842786729
2447.6 842786729 842465043 842201650 841869950 841437578 841031253 840691984 840339065 839974761 839721799 839624405
2467.9 839624405 839529335 839302659 839061260 838983119 839031577 839072406 839114130 839207888 839256167 839163244 839026868
2490.4 839026868 838996112 839062035 839102685 839069426 839021444 838959157 838793814 838545382 838358045 838273287 838165641
2512.8 838165641 837944508 837693632 837515831 837377846 837228000 837098122 837014496 836895108 836653948 836369932
2533.2 836369932 836170554 836023271 835800588 835498869 835224152 834976196 834661424 834299505 834046841 833962977
2553.6 833962977 833903790 833793581 833719850 833696365 833610713 833419859 833227515 833084583 832923234 832706392
2574 832706392 832497418 832365632 832268953 832114935 831892490 831658125 831449926 831253648 831077099 830964863
$$ packed form
2427.2H45105946k14636k36988j77384j88768k63095k61962j82092j66595k69532l58165
2447.6H42786729l21686k63393l31700m32372m06325l39269l52919l64304k52962r7394
2467.9H39624405r5070k26676k41399p8141M8458M0829M1724R3758M8279r2923j36376
2490.4H39026868l0756O5923M0650l3259m7982o2287j65343k48432j87337q4758j07646
2512.8H38165641k21133k50876j77801j37985j49846j29878q3626j19388k41160k84016
2533.2H36369932j99378j47283k22683l01719k74717k47956l14772l61919k52664q3864
2553.6H33962977n9187j10209p3731k3485q5652j90854j92344j42932j61349k16842
2574H32706392k08974j31786r6679j54018k22445k34365k08199j96278j76549j12236
$$ plain form
2594.4 830964863 830874920 830713809 830476940 830278099 830229640 830289602 830341876 830343068 830278397 830112517 829872906
2616.8 829872906 829669058 829576075 829578876 829619586 829654396 829654694 829609871 829523206 829369545 829140067 828866601
2639.3 828866601 828564882 828255773 827960014 827658772 827322066 826968551 826643586 826322019 825958669 825567603
2659.7 825567603 825175226 824808598 824461818 824068010 823611021 823138952 822643995 822107494 821573079 821064234
2680.1 821064234 820605516 820312798 820311308 820585489 821003735 821432710 821768105 821955144 822010040 822012901
2700.5 822012901 822078824 822264671 822516859 822758198 822964370 823108494 823153257 823113501 823023796 822911203
2720.9 822911203 822783291 822622418 822411358 822173953 821948051 821702480 821417749 821117222 820799768 820471168
2741.2 820471168 820144653 819869936 819658935 819401324 819050372 818702340 818428040 818168879 817852974 817539692
$$ packed form
2594.4H30964863q9943j61111k36869j98841m8459N9962N2274J192o4671j65880k39611
2616.8H29872906k03848r2983K801M0710L4810K98m4823q6665j53661k29478k73466
2639.3H28866601l01719l09109k95759l01242l36706l53515l24965l21567l63350l91066
2659.7H25567603l92377l66628l46780l93808m56989m72069m94957n36501n34415n08845
2680.1H21064234m58718k92718j490K74181M18246M28975L35395J87039N4896K861
2700.5H22012901O5923J85847K52188K41339K06172J44124M4763l9756q9705j12593
2720.9H22911203j27912j60873k11060k37405k25902k45571k84731l00527l17454l28600
2741.2H20471168l26515k74717k11001k57611l50952l48032k74300k59161l15905l13282
$$ plain form
2761.6 817539692 817307532 817138851 816957176 816743791 816577435 816450417 816226542 815876424 815514326 815169454
2782 815169454 814770639 814335644 813941956 813540399 813038051 812515378 812118769 811782241 811299026 810649753
2802.4 810649753 809915543 809093177 808137715 806968212 805701673 804765344 804525554 805045784 806080759
2820.8 806080759 807155490 807805419 807849586 807508588 807186604 807110906 807293177 807697952 808081567 808038652
2841.2 808038652 807489514 806628883 805546045 804210484 802695751 801193416 799923182 799099922 798736513
2859.5 798736513 798668981 798825085 799186349 799618721 800024867 800422013 800641775 800485790 800122082 799751401
2879.9 799751401 799341977 798853636 798315883 797781944 797269940 796798468 796385646 795902431 795247972 794567645
2900.3 794567645 793957770 793291450 792494595 791666925 790909946 790173888 789363921 788534760 787818611 787284732
$$ packed form
2761.6H17539692k32160j68681j81675k13385j66356j27018k23875l50118l62098l44872
2782H15169454l98815m34995l93688m01557n02348n22673l96609l36528m83215o49273
2802.4H10649753p34210q22366r55462j169503j266539r36329k39790N20230J034975
2820.8H06080759J074731O49929M4167l40998l21984p5698J82271M04775L83615m2915
2841.2H08038652n49138q60631j082838j335561j514733j502335j270234q23260l63409
2859.5G98736513o7532J56104L61264M32372M06146L97146K19762j55985l63708l70681
2879.9G99751401m09424m88341n37753n33939n12004m71472m12822m83215o54459o80327
2900.3G94567645o09875o66320p96855q27670p56979p36058q09967q29161p16149n33879
$$ plain form
2920.7 787284732 787039042 787174821 787711442 788561702 789465249 790366292 791424930 792618394 793861926
2939.1 793861926 795209348 796604991 797757089 798489928 798978984 799466550 799859226 800063372 800320864
2957.4 800320864 800803661 801436365 802085698 802722394 803402364 804119349 804829299 805484474 806014776 806429148
2977.8 806429148 806718349 806748331 806540847 806317925 806245744 806348324 806447566 806350350 806163013 805998027
2998.2 805998027 805838704 805768192 805803716 805899203 806115985 806450427 806711137 806744099 806617796 806456923
3018.6 806456923 806273222 806075513 805899978 805717170 805537283 805374265 805195391 804995060 804764509 804507673
3039 804507673 804265141 804061711 803850055 803564787 803227425 802921832 802648127 802308500 801837683 801290393
3059.4 801290393 800765574 800267041 799759150 799237132 798749089 798382461 798201680 798236728 798339307 798219204
$$ packed form
2920.7G87284732k45690J35779N36621Q50260R03547R01043J058638J193464J243532
2939.1G93861926J347422J395643J152098P32839M89056M87566L92676K04146K57492
2957.4H00320864M82797O32704O49333O36696O79970P16985P09950O55175N30302M14372
2977.8H06429148K89201K9982k07484k22922p2181J02580R9242r7216j87337j64986
2998.2H05998027j59323p0512L5524R5487K16782L34442K60710L2962j26303j60873
3018.6H06456923j83701j97709j75535j82808j79887j63018j78874k00331k30551k56836
3039H04507673k42532k03430k11656k85268l37362l05593k73705l39627m70817n47290
3059.4H01290393n24819m98533n07891n22018m88043l66628j80781L5048J02579j20103
$$ plain form
3079.8 798219204 797854960 797471166 797185361 797045112 797007978 796894670 796668708 796440065 796223283 795911729
3100.2 795911729 795469820 795025826 794667542 794311583 793923438 793719888 793827415 794002175 794030726 793913901
3120.6 793913901 793675601 793373764 793087065 792843819 792598605 792273104 791894972 791570425 791288197 790901899
3141 790901899 790334284 789668858 789051592 788574874 788151503 787547708 786722243 785892129 785171270 784476161
3161.4 784476161 783778071 783159673 782594025 781966984 781290591 780637920 780003607 779340565 778644681 777953148
3181.8 777953148 777242124 776467502 775682688 774926126 774155438 773331106 772465289 771599531 770748198 769900918
3202.2 769900918 769075632 768303633 767545700 766733944 765872240 765043914 764277101 763452530 762502849 761526227
3222.6 761526227 760623395 759732187 758747697 757733405 756794274 755859256 754828572 753746808 752691925
$$ packed form
3079.8G98219204l64244l83794k85805j40249l7134j13308k25962k28643k16782l11554
3100.2G95911729m41909m43994l58284l55959l88145k03550J07527J74760K8551j16825
3120.6G93913901k38300l01837k86699k43246k45214l25501l78132l24547k82228l86298
3141G90901899n67615o65426o17266m76718m23371o03795q25465q30114p20859o95109
3161.4G84476161o98090o18398n65648o27041o76393o52671o34313o63042o95884o91533
3181.8G77953148p11024p74622p84814p56562p70688q24332q65817q65758q51333q47280
3202.2G69900918q25286p71999p57933q11756q61704q28326p66813q24571r49681r76622
3222.6G61526227r02832q91208r84490j014292r39131r35018j030684j081764j054883
$$ plain form
3240.9 752691925 751711905 750801861 749857664 748811066 747770846 746870518 746058643 745219409 744369984
3259.3 744369984 743544221 742726505 741969287 741419613 741069436 740532100 739609718 738572001 737603903
3277.7 737603903 736680508 735764503 734863341 734007359 733211040 732482731 731726348 730758786 729517698
3296 729517698 728042364 726565599 725437999 724607646 723581553 722000897 720002413 717954516 716043591
3314.4 716043591 714186788 712303102 710439742 708642066 706830919 704748333 702326477 699833632
3330.7 699833632 697464883 695304155 693379641 691339314 688876033 686174452 683393478 680689037
3347 680689037 678202212 675525367 672345936 669050276 665974319 663022161 660007536 657042325 654468000
3365.4 654468000 652153194 649499476 646274030 642961800 640053988 637447059 634916961 632413208
$$ packed form
3240.9G52691925r80020r10044r44197j046598j040220r00328q11875q39234q49425
3259.3G44369984q25763q17716p57218n49674l50177n37336r22382j037717r68098
3277.7G37603903r23395r16005r01162q55982p96319p28309p56383r67562j241088
3296G29517698j475334j476765j127600q30353j026093j580656j998484k047897j910925
3314.4G16043591j856803j883686j863360j797676j811147k082586k421856k492845
3330.7F99833632k368749k160728j924514k040327k463281k701581k780974k704441
3347F80689037k486825k676845l179431l295660l075957k952158l014625k965211k574325
3365.4F54468000k314806k653718l225446l312230k907812k606929k530098k503753
$$ plain form
3381.7 632413208 629982114 627747655 625873089 624388397 622794926 620667756 618484676 616905868
3398 616905868 615692198 613988876 611764967 609832823 608421028 607178748 605884254 604407549 602863133
3416.3 602863133 601609945 600605130 599600434 598732650 598208964 597956002 597704828 597476482 597460806
3434.7 597460806 597359002 596901953 596474588 596475661 596853495 597367406 597847700 598357141 599009633 599802494
3455.1 599802494 600747228 601823866 602821410 603818715 605218709 606823623 607964218 608581901 609273374
3473.4 609273374 610356212 611748219 613165557 614281893 615315735 616599202 617895305 619059443
3489.8 619059443 620315671 621710002 623143375 624519825 625885665 627296805 628487229 629431129
3506.1 629431129 630525053 631932974 633545756 635127842 636512041 637832999 639347672 641113758
$$ packed form
3381.7F32413208k431094k234459j874566j484692j593471k127170k183080j578808
3398F16905868j213670j703322k223909j932144j411795j242280j294494j476705j544416
3416.3F02863133j253188j004815j004696q67784n23686k52962k51174k28346j5676
3434.7E97460806j01804m57049m27365J073L77834N13911M80294N09441O52492P92861
3455.1E99802494R44734J076638R97544R97305J399994J604914J140595O17683O91473
3473.4F09273374J082838J392007J417338J116336J033842J283467J296103J164138
3489.8F19059443J256228J394331J433373J376450J365840J411140J190424R43900
3506.1F29431129J093924J407921J612782J582086J384199J320958J514673J766086
$$ plain form
3522.4 641113758 642725587 643938899 645136535 646618187 648337007 650232732 652091324 653733909
3538.7 653733909 655494928 657546461 659499705 661043286 662461817 664072514 665733397 667374134
3555 667374134 669185877 671220660 673300147 675219476 677106202 679378033 681858242 684099138 686228573
3573.4 686228573 688465893 690830290 693349421 695984304 698569953 700972199 703186452 705444098
3589.7 705444098 707793951 710150778 712611854 715244353 717871785 720328867 722617686 724792004
3606 724792004 727021813 729333699 731591284 733777523 735813737 737829626 739974737 741918921 743553877
3624.4 743553877 745005131 746497393 748191953 749768496 751184642 752498984 753691912 754837632
3640.7 754837632 755976856 757065475 758098364 759188473 760168850 760754943 761200249 761903405 762759745
$$ packed form
3522.4F41113758J611829J213312J197636J481652J718820J895725J858592J642585
3538.7F53733909J761019K051533J953244J543581J418531J610697J660883J640737
3555F67374134J811743K034783K079487J919329J886726K271831K480209K240896K129435
3573.4F86228573K237320K364397K519131K634883K585649K402246K214253K257646
3589.7G05444098K349853K356827K461076K632499K627432K457082K288819K174318
3606G24792004K229809K311886K257585K186239K036214K015889K145111J944184J634956
3624.4G43553877J451254J492262J694560J576543J416146J314342J192928J145720
3640.7G54837632J139224J088619J032889J090109R80377N86093M45306P03156Q56340
$$ plain form
3659 762759745 763334632 763599455 763820112 764034092 764217138 764506876 764707208 764635384 764662147 764920831
3679.4 764920831 765249491 765664577 766225398 766913176 767319262 767286479 767334402 767548800 767693818 767708600
3699.8 767708600 767706156 767808318 767974138 768046796 767938197 767827809 767908096 767993569 767930746 767796636 767738163
3722.3 767738163 767785311 767916322 768108070 768311203 768558502 768838584 769077599 769219100 769110680 768642724
3742.7 768642724 768197596 768182397 768048763 767697632 767633140 767738581 767734706 767618477 767507732 767459810
3763.1 767459810 767470300 767510414 767510355 767499447 767534494 767637312 767810643 767876208 767691731 767439127 767300367
3785.5 767300367 767277360 767285585 767253160 767128468 766953945 766814411 766621888 766425312 766361594 766252160
3805.9 766252160 766124129 766143858 766216218 766194224 766142309 766148806 765946627 765589535 765389621 765244007 765092194
$$ packed form
3659G62759745N74887K64823K20657K13980J83046K89738K00332p1824K6763K58684
3679.4G64920831L28660M15086N60821O87778M06086l2783M7923K14398J45018J4782
3699.8G67708600k444J02162J65820P2658j08599j10388Q0287Q5473o2823j34110n8473
3722.3G67738163M7148J31011J91748K03133K47299K80082K39015J41501j08420m67956
3742.7G68642724m45128j5199j33634l51131o4492J05441l875j16229j10745m7922
3763.1G67459810J0490M0114n9j0908L5047J02818J73331O5565j84477k52604j38760
3785.5G67300367k3007Q225l2425j24692j74523j39534j92523j96576o3718j09434
3805.9G66252160j28031J9729P2360k1994n1915O497k02179l57092j99914j45614j51813
$$ plain form
3828.3 765092194 764973462 764971495 765117466 765098870 764751136 764438748 764350116 764387548 764427841 764374018 764046848
3850.8 764046848 763300002 762891889 763118863 763317883 763321400 763181388 763023794 762894869 762692928 762529135
3871.2 762529135 762467027 762439132 762425661 762352467 762282729 762247086 762115717 761901259 761662424 761482894 761474252
3893.6 761474252 761494339 761379719 761156142 760924697 760765314 760714769 760694861 760639369 760589659 760521710 760378182
3916 760378182 760189235 760024965 759928405 759882987 759868979 759854138 759787798 759699702 759645879 759561181 759417176
3938.5 759417176 759276807 759169161 759094000 759010434 758885980 758757114 758678854 758619547 758528888 758453071 758397043
3960.9 758397043 758309662 758197367 758090734 758012474 757960021 757888854 757807195 757729471 757615805 757549345 757596433
3983.3 757596433 757585287 757435381 757271588 757158160 757097006 757054687 756967306
$$ packed form
3828.3G65092194j18732j967J45971j8596l47734l12388q8632L7432M0293n3823l27170
3850.8G64046848p46846m08113K26974J99020L517j40012j57594j28925k01941j63793
3871.2G62529135o2108k7895j3471p3194o9738l5643j31369k14458k38835j79530q642
3893.6G61474252K0087j14620k23577k31445j59383n0545j9908n5492m9710o7949j43528
3916G60378182j88947j64270r6560m5418j4008j4841o6340q8096n3823q4698j44005
3938.5G59417176j40369j07646p5161q3566j24454j28866p8260n9307r0659p5817n6028
3960.9G58397043q7381j12295j06633p8260n2453p1167q1659p7724j13666o6460M7088
3983.3G57596433j1146j49906j63793j13428o1154m2319q7381
$$ plain form
3997.6 756967306
$$ packed form
3997.6G56967306
##END=$$ End of the data block
