##TITLE=Renata Menger - (CH3)2-N-benz 2 $$ Begin of the data block
##JCAMP-DX=5.00 $$ ACD/SpecManager v 10.08
##SPECTROMETER/DATA SYSTEM=Alpha
##DATE=22 Oct 2014 10:39:34
##DATA TYPE=INFRARED SPECTRUM
##DATA CLASS=XYDATA
##ORIGIN=
##OWNER=
##NPOINTS=1765
##FIRSTX=399.76428223
##LASTX=3997.64306641
##MAXX=3997.64306641
##MINX=399.76428223
##MAXY=0.85449195
##MINY=0.41686550
##XFACTOR=1.0000000000
##YFACTOR=1.000000000000000e-9
##FIRSTY=0.80158800
##DELTAX=2.03961372
##XUNITS=1/CM
##YUNITS=ARBITRARY UNITS
##XYDATA=(X++(Y..Y))
399.8H01587999q16107n839348n302787o72757j542449q147300r711563k797902M674614
$$ 801587999 800771892 794932544 789629757 788957000 787414551 779267251 769555688 766757786 771432400
418.1G71432400N078614L081560O645083R394825M362702k683401k381087K761186
$$ 771432400 776511014 779592574 786237657 795632482 799995184 797311783 794930696 797691882
434.4G97691882K817213k092182k783955J534403J866936l514647m407465L189325
$$ 797691882 800509095 798416913 795632958 797167361 799034297 795519650 791112185 794301510
450.8G94301510Q855104M520715k274812j725554K531707J008213m121960m307568
$$ 794301510 803156614 807677329 805402517 803676963 806208670 807216883 803094923 798787355
467.1G98787355K66195Q68499m252553o713629l807187j783907k935767l179551j125335
$$ 798787355 799053550 799922049 795669496 788955867 785148680 783364773 780429006 777249455 776124120
485.4G76124120j411617m780114k712309O309390J0259747M015863n891442j2646258
$$ 776124120 774712503 769932389 767220080 773529470 783789217 787805080 781913638 769267380
501.7G69267380j4091193j2765348p931948K100348Q454979M094839m123151l380120
$$ 769267380 755176187 742410839 734478891 736579239 745034218 749129057 745005906 741625786
518.1G41625786R226143J9916892J8325866R087324K361238K373397L694177J121998
$$ 741625786 750851929 770768821 789094687 798182011 800543249 802916646 806610823 807732821
534.4H07732821k376795j582742J538932J391292j761079k642095m0650J021564k038420
$$ 807732821 805356026 803773284 805312216 806703508 804942429 802300334 802259684 803281248 801242828
552.7H01242828n342662m378140N52952L908277K467036Q00610J747310J486301j245677
$$ 801242828 795900166 791522026 792074978 795983255 798450291 799250901 800998211 802484512 801238835
571.1H01238835k247572M530J512110k46763k238393j243353O00398o22034m218459
$$ 801238835 798991263 798995793 800507903 800261140 798022747 796779394 797379792 796757758 792539299
589.4G92539299o513477n484104j869321J996100M250705M934252M254877J787901
$$ 792539299 786025822 780541718 778672397 780668497 784919202 789853454 794108331 795896232
605.8G95896232q71122r98437O97136Q52287j125813k140999n08249J203359O85215
$$ 795896232 795025110 794026673 794723809 795576096 794450283 792309284 791801035 793004394 793689609
624.1G93689609p65145r09746o65247k264560m389107m638910n240441p458925l858566
$$ 793689609 792924464 792014718 791349471 789084911 784695804 780056894 774816453 767357528 763498962
642.5G63498962P999122J5801549J2778461N802989R70006l68237N41627Q91924k76089
$$ 763498962 771498084 787299633 800078094 805881083 806851089 806482852 807024479 807916403 807640314
660.8H07640314j142323q76605o95229l71993k5868q6486M76062O38246n20944j186848
$$ 807640314 806497991 805621386 804926157 804554164 804528296 804441810 804917872 805556118 805035174 803848326
681.2H03848326l24547M82976j49309j265347j204491l00944l44813j594662k435387
$$ 803848326 803523779 804006755 803857446 802592099 801387608 801086664 800741851 799147189 796711802
699.6G96711802k429723l577471p008851p683575m27365O934762N661666J874626J533747
$$ 796711802 794282079 790704608 783695757 776012182 775584817 782519579 788181245 790055871 791589618
717.9G91589618J637935l78251m697203r614349r806335l581822R58562O27339K987206
$$ 791589618 793227553 792849302 788152099 778537750 768731415 765149593 766108155 766735494 769722700
736.3G69722700P278383O113768J150250k716601m736423o485939r672404j2542128
$$ 769722700 777001083 783114851 784265101 781548500 776812077 770326138 760653734 748111606
752.6G48111606p639289Q170128K1755933K0173073R888947K586425k7478j217842
$$ 748111606 740472317 748642445 770398378 790571451 800460398 803046823 803019345 801801503
768.9H01801503k532900l204345k849043k918482m516244o880700r614706j5381098
$$ 801801503 799268603 796064258 793215215 790296733 785780489 778899789 769285083 753903985
785.3G53903985k3210764j9549370k630770M081905N46753J0012448K3309648K0152629
$$ 753903985 730693221 711143851 708513081 712594986 713141739 723154187 746463835 766616464
801.6G66616464Q291542m00960o421983j1787415j6714275k2485673l0506671l0506432
$$ 766616464 774908006 774507046 768085063 756297648 739583373 717097700 686591029 656084597
817.9F56084597n770564K9476941M0890574K7959108J3870538P167101M319667K485157
$$ 656084597 650314033 679790974 720681548 748640656 762511194 769678295 773997962 776483119
834.2G76483119J538753J835048K419472J880884M09246m41134j23024J68085l98219
$$ 776483119 778021872 779856920 782276392 784157276 784566522 784125388 784002364 784170449 783772230
852.6G83772230r27210n22494K00391l6717r98914j302063p57993o84201j651764k353072
$$ 783772230 782845020 782322526 782522917 782486200 781487286 780185223 779427230 778743029 777091265 774738193
873G74738193j725495o91355p52687j721799k259672k226770l145039n824924q008062
$$ 774738193 773012698 772321343 771568656 769846857 767587185 765360415 762215376 756390452 748382390
891.3G48382390l616691P113874J1399805N167246p06732j643598j503527k244234
$$ 748382390 744765699 751879573 763279378 768446624 767739892 766096294 764592767 762348533
907.6G62348533k908647k605796k290845l148854m596412n384505n827546p396758
$$ 762348533 759439886 756834090 754543245 751394391 746797979 741413474 735585928 728189170
923.9G28189170j0851979j5649080k0747423k3776114j8658042l303170R689450J0830164
$$ 728189170 717337191 701688111 680940688 657164574 638506532 635203362 644892812 655722976
940.3F55722976J4145255K7389824L2578588K2582650J0729253L786147o020j522303
$$ 655722976 669868231 697258055 729836643 752419293 763148546 766934693 766928673 765406370
956.6G65406370j662195k074956l232301m073202l851712k822220k210796l547609
$$ 765406370 763744175 761669219 758436918 754363716 750512004 747689784 745478988 741931379
972.9G41931379o618738p109046m11630P232726O452083J191557j846314l517330n152940
$$ 741931379 735312641 728203595 727791965 735024691 741476774 742668331 740822017 737304687 732151747
991.3G32151747o488502q551657j0711551n842388M004836L772021l538669l394126
$$ 732151747 725663245 717111588 706400037 700557649 704562485 708334506 704795837 701401711
1007.6G01401711J739323L459632J039088k839387o243348q350789r215176r442687
$$ 701401711 703141034 706600666 707639754 704800367 698557019 690206230 680991054 671548367
1023.9F71548367q350850m292070K382040Q950591J2718916J2232959Q523643M428685
$$ 671548367 663197517 658905447 661287487 670238078 682956994 695189953 703713596 708142281
1040.2G08142281J287698j196086k797723l091395k852738l258228m292369m838645
$$ 708142281 709429979 708233893 705436170 702344775 699492037 696233809 691941440 687102795
1056.5F87102795m409731l661990l064156k238810r88245j05083m33027j532197k153457
$$ 687102795 682693064 679031074 675966918 673728108 672739863 672634780 672201753 670669556 668516099
1074.9F68516099k117097k405465l412008m318952m481972m450380n002380n760610
$$ 668516099 666399002 663993537 660581529 656262577 651780605 647330225 642327845 636567235
1091.2F36567235n687594m719556l841400l697157l908455l970146m199982n092740
$$ 636567235 630879641 626160085 622318685 618621528 614713073 610742927 606542945 601450205
1107.5F01450205o295145p245481q280277j0138631j2471616j3870895j3917327j3911068
$$ 601450205 595155060 587909579 579629302 569490671 557019055 543148160 529230833 515319765
1123.8E15319765j4536500j3596297p477432L786772J3843000J7242909J7926395K1860778
$$ 515319765 500783265 487186968 479709536 483496308 497339308 514582217 532508612 554369390
1140.1E54369390K4472296J6657889j37389j5633106k4208963k7990162k9782742k9213816
$$ 554369390 578841686 595499575 595362186 579729080 555520117 527529955 497747213 468533397
1156.5D68533397k4975270j7656386r036243L8773R279757J7343134K2284389K3219108
$$ 468533397 443558127 425901741 416865498 416904271 426184028 443527162 465811551 489030659
1172.8D89030659K0681918J5449524Q336603J592637j060486K957821J2326479K2183895
$$ 489030659 509712577 525162101 533498704 535091341 534030855 536988676 549315155 571499050
1189.1E71499050K7926504K8478861K5438786K0650685J5702903J1593520P578850
$$ 571499050 599425554 627904415 653343201 673993886 689696789 701290309 708869159
1203.4G08869159K587140j968086l040731n81264J608491L118515P277071J1242807
$$ 708869159 711456299 709488213 706447482 705866218 707474709 710593224 717870295 729113102
1219.7G29113102R019196J580834n752980q781314o684244l485620l860712p508874
$$ 729113102 738132298 739713132 733960152 725178838 718494594 715008974 711148262 703639388
1236G03639388r985149p265866q0347N964697P081032N507886M427433K822697j815021
$$ 703639388 693654239 686388373 686308026 692272723 699353755 704861641 709289074 712111771 710296750
1254.4G10296750q834243j4590800j4786124o504953O209255J3037145R794593J664340
$$ 710296750 701462507 686871707 672085583 665580630 671789885 684827030 694621623 696285963
1270.7F96285963o003380j1355519j4886439j8724322k4193764k9981971l3013463
$$ 696285963 690282583 678927064 664040625 645316303 621122539 591140568 558127105
1285E58127105k9955625j8100560J924574K3976982M0257692M6947182M4637501L5967827
$$ 558127105 528171480 510070920 511995494 535972476 576230168 623177350 667814851 703782678
1301.3G03782678K4610877J3934254N304754j248300n283117o238282m917085l503680
$$ 703782678 728393555 742327809 747632563 746384263 741101146 734862864 729945779 726442099
1317.6G26442099l285706l972650o390870j2353301k0003378k0940065r173692N551577
$$ 726442099 723156393 719183743 712792873 700439572 680436194 659496129 650322437 655874014
1333.9F55874014R226322L170490k664148l533543j967966j975954m271269p173717
$$ 655874014 665100336 668270826 665606678 662073135 660105169 658129215 653857946 646684229
1350.2F46684229r943008j3180792j6473472j8831134k1481634k5981009k8921604
$$ 646684229 636741221 623560429 607086957 588255823 566774189 540793180 511871576
1364.5E11871576k7874022k4150283j4819324p48395R379178P799446O102294J7376810
$$ 511871576 483997554 459847271 445027947 444279552 453658730 461458176 467560470 484937280
1380.8D84937280L2940537M0034235L7381112K2876024J867772j4887214k2546947
$$ 484937280 517877817 557912052 595293164 618169188 620036960 605149746 582602799
1395.1E82602799j7315328p492006R25422J0830462K3432851K9018342J7034650l753007
$$ 582602799 565287471 557795465 558720887 569551349 592984200 622002542 639037192 635284185
1411.4F35284185o067514J4255643L0879676L0223251J7400503P818758K856553j963794
$$ 635284185 629216671 643472314 674351990 704575241 721975744 729794502 732651055 730687261
1427.7G30687261p770121j2585164j4412880j6316533j3948500k520025R079755J4960408
$$ 730687261 722917140 710331976 695919096 679602563 665654063 663134038 672213793 687174201
1444.1F87174201J2567997M645646k738834n129635l472626J323223P582664Q452118
$$ 687174201 699742198 704387844 701649010 696519375 693046749 694369972 701952636 710404754
1460.4G10404754O126702K702772j485586l697038n423069r747743j3628066j4387131
$$ 710404754 716531456 719234228 717748642 714051604 708628535 698880792 685252726 670865595
1476.7F70865595j4435529j5286208j6672968j7168582j8278599k1835208k5007724
$$ 670865595 656430066 641143858 624470890 607302308 589023709 567188501 542180777
1491E42180777k2724867k0647973k1446020k0336836j7487347j3411284p452100K600699
$$ 542180777 519455910 498807937 477361917 457025081 439537734 426126450 418674350 421275049
1507.3D21275049J1202187J5233367J8693179K1866173K3890406K3219883K3829997
$$ 421275049 432477236 447710603 466403782 488269955 512160361 535380244 559210241
1521.6E59210241K1317601J6637504J3508320Q539677K978325m113079j0260403j2206971
$$ 559210241 580527842 597165346 610673666 619213343 622191668 618078589 607818186 595611215
1537.9E95611215r741426K617955J2831033J4730751J2537599J0216236R337127J1025071
$$ 595611215 585869789 588487744 601318777 616049528 628587127 638803363 648140490 659165561
1554.2F59165561J4784336K3823500K7478754J4909864R275377P508993O018340N513728
$$ 659165561 673949897 697773397 725252151 740162015 749437392 756946385 762964725 768478453
1570.5G68478453M378438L173709J250327j727581m519463q667886j4185846j9318759
$$ 768478453 772856891 776030600 777280927 775553346 771033883 762365997 748180151 728861392
1586.8G28861392k2391260k2592664k0630836j8373609j6578257j4911115j3258934
$$ 728861392 706470132 683877468 663246632 644873023 628294766 613383651 600124717
1601.1F00124717j1734784r901941p083356k315104M068553J0773838K0772159L2826483
$$ 600124717 588389933 578487992 571404636 569089532 573158085 583931923 604704082 637530565
1617.4F37530565L1684160K6113928K3621499J7359913J0889292O739378M294455L838002
$$ 637530565 669214725 695328653 718950152 736310065 747199357 753938735 758233190 762071192
1633.7G62071192K920032m52280j837969n83947J160920J314163o80745j704752k524197
$$ 762071192 764991224 764538944 762700975 762117028 763277948 764592111 763911366 762206614 759682417
1652.1G59682417n269051n540847m356623l218353j205444O97851J323700O47247q67665
$$ 759682417 754413366 748872519 744515896 741297543 740092099 740789950 742113650 742760897 741893232
1670.5G41893232j985192l920496o207585o335378n672097p787347j5033424j9187987
$$ 741893232 739908040 735987544 729779959 723444581 717772484 709985137 694951713 675763726
1686.8F75763726k2619843k9680610l1724989l0976475k3114323m282177J3610602
$$ 675763726 653143883 623463273 591738284 560761809 537647486 533365309 546975911
1701.1E46975911K1261811K7413785L3388734L1938732K8047383K3454785J8672764
$$ 546975911 568237722 595651507 629040241 660978973 689026356 712481141 731153905
1715.3G31153905J3721347O413281k60472l638387l579974L60787N466044R004593
$$ 731153905 744875252 751288533 751028061 747389674 743809700 744170487 749636531 758641124
1731.7G58641124J1723816J1200369Q109510P418930O928742N786657N353332N068719
$$ 758641124 770364940 781565309 789674819 797093749 804022491 809809148 815162480 820231199
1748H20231199N100310M958749M231214L415406K552211K169252K285182J924158J412630
$$ 820231199 825331509 830290258 834521472 837936878 840489089 842658341 844943523 846867681 848280311
1766.3H48280311J504957J913965J898050P33495j42157q2612O2287k57313p14660
$$ 848280311 849785268 851699233 853597283 854330778 854188621 854106009 854168296 853910983 853196323
1784.7H53196323n35309L22938R87827N20170k65360k11596J34766l9458m71771k92957
$$ 853196323 852661014 852983952 853971779 854491949 854226589 854014993 854149759 854110301 853638530 853345573
1805.1H53345573L14891N57006J28627k29896k8431K33114L874l15487k10941J08719
$$ 853345573 853660464 854217470 854346097 854116201 854087770 854320884 854324758 854009271 853798330 853907049
1825.5H53907049J31905l42310p45892m58300p8619k53737m76718k03490N4240l87549
$$ 853907049 854038954 853696644 852950752 852492452 852413833 852160096 851683378 851479888 851534128 851146579
1845.9H51146579r53257j021684p08341m69327o08265p83384o55949l67165k38478
$$ 851146579 850193322 849171638 848463297 847993970 847385705 846602321 845946372 845579207 845340729
1864.2H45340729k98500n01335o73950p03633q69750j078189r64522o99103o60658
$$ 845340729 845042229 844540894 843866944 843163311 842293561 841215372 840250850 839551747 838891089
1882.6H38891089o61671k64406L82244O01351K99454O259n1141k8372k06709m93169
$$ 838891089 838229418 837965012 838347256 838948607 839248061 839254320 839203179 839174807 838968098 838474929
1903H38474929n62906m79758n90741q60453q51750m48347r5725p8022j63019k24232
$$ 838474929 837912023 837432265 836841524 835981071 835129321 834680974 834585249 834507227 834344208 834119976
1923.4H34119976l39330n14686p28607q80837r00209q44300o68883k51711K09987K98262
$$ 834119976 833780646 833265960 832537353 831656516 830756307 829912007 829243124 828991413 829201400 829499662
1943.8H29499662J2159l13103m39167l02017q3506R835n9664j99080l38197m45425
$$ 829499662 829511821 829198718 828759551 828457534 828374028 828383863 828324199 828125119 827786922 827341497
1964.2H27341497m85838m41312l48389k86997k75671k57790k25544k34962l20196m06384
$$ 827341497 826855659 826414347 826065958 825778961 825503290 825245500 825019956 824784994 824464798 824058414
1984.6H24058414m16160m02212m85361p41303j003682j128972j052797o41644j56879
$$ 824058414 823642254 823240042 822754681 822013378 821009696 819880724 818827927 818186283 818029404
2002.9H18029404M3451J14561K30074K63869J29164j20759l55602m40895l70205k88367
$$ 818029404 818072855 818187416 818417490 818681359 818810523 818689764 818334162 817893267 817523062 817234695
2023.3H17234695k91467l47435l39329k56718k49445k97606k60472j57535j39058k65598
$$ 817234695 816943228 816595793 816256464 815999746 815750301 815452695 815192223 815034688 814895630 814630032
2043.7H14630032m11094m31537l74437l48270l05593j19090J56761K70307J51693M77
$$ 814630032 814218938 813787401 813412964 813064694 812759101 812640011 812796772 813067079 813218772 813219249
2064.1H13219249k2590j6689j56522l54230l67046k35677k04324l08097l71158l04997
$$ 813219249 813196659 813179970 813023448 812669218 812302172 812066495 811862171 811554074 811182916 810877919
2084.5H10877919k44140l17693m30644l76999k04742j67787l00646l38852j53065j6213
$$ 810877919 810633779 810316086 809885442 809508443 809303701 809135914 808835268 808496416 808343351 808327138
2104.9H08327138j43289l02494k22385m7445o3538k48492l28303k33471k05159l60728
$$ 808327138 808183849 807881355 807658970 807611525 807547987 807299495 806971192 806737721 806532562 806171834
2125.3H06171834m59015l03805j02222j15156k56896k43902p4864l9041k13861l19898
$$ 806171834 805712819 805409014 805306792 805191636 804934740 804690838 804615974 804576933 804363072 804043174
2145.7H04043174j95205n5373j37687l49760l84509k22683j99140l97682m74870k62797
$$ 804043174 803847969 803792596 803654909 803305149 802920640 802697957 802498817 802101135 801626265 801363468
2166.1H01363468m0531l2961r7633k6107J01507Q941k74897l59773j56701j4842j24693
$$ 801363468 801322937 801289976 801192343 801166236 801267743 801276684 801001787 800642014 800485313 800470471 800345778
2188.5H00345778k72810j71483Q5772R2804j64449k60949o9321P5996o5684k63929
$$ 800345778 800072968 799901485 799987257 800080061 799915612 799654663 799585342 799661338 799595654 799331725
2208.9G99331725k09153o0678j49369m04596m61102k59459j86920m07994n81801m60744
$$ 799331725 799122572 799061894 798912525 798507929 798046827 797787368 797600448 797192454 796610653 796149909
2229.3G96149909k84016l66926n54204m58419j00196J15872K5093r0956J907Q7559
$$ 796149909 795865893 795498967 794944763 794486344 794386148 794502020 794527113 794436157 794438064 794525623
2249.7G94525623r0539l53575l78489k16306k02119l85523m55081k49625k0206l5643
$$ 794525623 794435084 794081509 793703020 793486714 793284595 792899072 792443991 792194366 792174160 792138517
2270.1G92138517j47522k6404K33888K16484q6903k48194j11163l1054k69055n33104
$$ 792138517 791990995 791964591 792198479 792414963 792328060 792079866 791968703 791937649 791668594 791135490
2290.5G91135490m46975j78933j31429l14295m11093k87771k51115n27143p88868p12633
$$ 791135490 790688515 790509582 790378153 790063858 789652765 789364994 789113879 788586736 787797868 787085235
2310.9G87085235n00798m87685o84738q19445o95884m99428n04911o14464n24163k16603
$$ 787085235 786584437 786096752 785412014 784592569 783896685 783397257 782892346 782277882 781753719 781537116
2331.3G81537116p1705k27690k78174m8876J05679L0875J67251M14192P4387p52092
$$ 781537116 781465411 781237721 780959547 780910671 781016350 781047225 781214476 781628668 781703055 780950963
2351.7G80950963j385390j267910p11799l56018k99931j46329K61187N78880N38946
$$ 780950963 779565573 778297663 777585864 777229846 776929915 776783586 777044773 777623653 778162599
2370.1G78162599L82542M25041N75542N38052L26275K11954K78235K91467M4644k90931
$$ 778162599 778545141 778970182 779545724 780083776 780410051 780622005 780900240 781191707 781236351 780945420
2390.4G80945420l96311k95579l38436n89907o70254m22061j83284k10881k98321j38581
$$ 780945420 780549109 780253530 779915094 779325187 778654933 778232872 778049588 777838707 777540386 777401805
2410.8G77401805K03848L94583L28958K41220K75671K53797J0013k35319k11894q8513
$$ 777401805 777605653 778000236 778329194 778570414 778846085 779099882 779109895 778874576 778662682 778574169
2431.2G78574169j77920m25637n23448l89099k94507m13298n33104m44353k99036l40998
$$ 778574169 778396249 777970612 777447164 777058065 776763558 776350260 775817156 775372803 775073767 774732769
2451.6G74732769m84109m41075k13921r7394j84715k40862j04487N6446Q404j63138
$$ 774732769 774248660 773807585 773593664 773496270 773311555 773070693 772966206 773022652 773031056 772867918
2472G72867918j87814m3571M7862m3213j43647n7519N1916n1141k61068l07858j92285
$$ 772867918 772680104 772636533 772684395 772641182 772497535 772440016 772491932 772440791 772179723 771871865 771679580
2494.5G71679580j71065l37839m68016l84331k63571l35575m77075m44830l11672k77996
$$ 771679580 771508515 771170676 770702660 770318329 770054758 769719183 769242108 768797278 768485606 768207610
2514.9G68207610l15369k71558j49250j12593k32637l57986l32475k19702j61052j63376
$$ 768207610 767892241 767620683 767471433 767358840 767126203 766768217 766435742 766216040 766054988 765891612
2535.3G65891612j11878J0132N3525m0352j27792p1347M2975M4525l6657n3525L993
$$ 765891612 765779734 765789866 765843391 765803039 765675247 765603900 765646875 765691400 765654743 765601218 765605211
2557.7G65605211J9431o2644j49071j40667r1613j24096k08080k26796j76668j60873
$$ 765605211 765624642 765561998 765412927 765272260 765180647 765056551 764848471 764621675 764445007 764284134
2578.1G64284134k28405k78294k22206r3758q285N841L6716M9532j9670j41144k65002
$$ 764284134 764055729 763777435 763555229 763461471 763453186 763459027 763495743 763545275 763525605 763384461 763119459
2600.5G63119459l12567k91407k91526l35693l64602l49522l66151m61519n59747n75840
$$ 763119459 762806892 762515485 762223959 761888266 761523664 761174142 760807991 760346472 759786725 759210885
2620.9G59210885n20051m75943m81904m87029m29630l30985k40982j44779m6492J9789
$$ 759210885 758690834 758214891 757732987 757245958 756816328 756485343 756244361 756099582 756053090 756072879
2641.3G56072879P3254P6652q286j11758j89007k62022l50475m32908m91500n52714
$$ 756072879 756146133 756222785 756214499 756102741 755913734 755651712 755301237 754868329 754376829 753824115
2661.7G53824115o07014o16312n70595m31538k24054n8829N3048J36435J43528O6638
$$ 753824115 753217101 752600789 752030194 751598656 751374602 751315773 751368821 751505256 751648784 751715422
2682.1G51715422k265J2099P7486J10984J01507J14262J73509K05696J50919N1379
$$ 751715422 751713157 751725256 751802742 751913726 752015233 752129495 752303004 752508700 752659619 752710998
2702.5G52710998l9458j19567k64645m98652o40869n75722m59373m65393n48064n73874
$$ 752710998 752671540 752551973 752287328 751788676 751147807 750572085 750112712 749647319 749099255 748525381
2722.9G48525381n13971m68075m96030m74274l11256j05440J1921J1504j6094Q464
$$ 748525381 748011410 747543335 747047305 746573031 746261775 746156335 746168256 746179760 746163666 746172130
2743.3G46172130L5703J1325J8656J11700J95264J39356l5644r4175P9692K34842J27494
$$ 746172130 746207833 746219158 746237814 746349514 746544778 746684134 746648490 746554315 746634007 746868849 746996343
2765.7G46996343j12653k76684l76165m97818o44088o62625m77493l53813m89533o62744
$$ 746996343 746883690 746607006 746230841 745733023 745088935 744426310 743948817 743595004 743105471 742442727
2786.1G42442727p02917q09849j096010j312733j273870j165986j227558j326501j182378
$$ 742442727 741739810 740929961 739833951 738521218 737247348 736081362 734853804 733527303 732344925
2804.5G32344925p82191l65138k34843l74555m50552m08649m73023o30498o26564l87191
$$ 732344925 731562734 731197596 730962753 730588198 730137646 729728997 729255974 728625476 727998912 727611721
2824.9G27611721r6381J06752K82407M82857N54025L44813j23143o17504q54075r43542
$$ 727611721 727515340 727622092 727904499 728387356 728941381 729286194 729163051 728545547 727691472 726747930
2845.3G26747930j130223j288414j162052q30353n83768m07219j55091J16527K90931
$$ 726747930 725617707 724329293 723167241 722336888 721753120 721345901 721190810 721307337 721598268
2863.6G21598268K83479J64449R6739J669l35217p11739o71565l22581j88648l74318
$$ 721598268 721881747 722046196 722142935 722144604 721809387 721097648 720426083 720103502 719914854 719540536
2884G19540536n59747n81085o02901p51436q81076q56280p86782p59542p36773o73651
$$ 719540536 718980789 718399704 717796803 717045367 716164291 715308011 714521229 713761687 713024914 712351263
2904.4G12351263n27263l69489l09885l25441l27707k70128k14755j85311n6207J65760
$$ 712351263 711824000 711454511 711144626 710819185 710491478 710221350 710006595 709821284 709765077 709930837
2924.8G09930837K82049J37329j54733j50979L26693R12845J208067J139224Q05497
$$ 709930837 710212886 710350215 710195482 710044503 710371196 711284041 712492108 713631332 714436829
2943.2G14436829K47300k76566j82867O07193J296639J343250J062811Q70824Q17716
$$ 714436829 714684129 714407563 714224696 714831889 716128528 717471778 718534589 719405413 720223129
2961.5G20223129O94871L77774O0737p0870k29955q26120j906752k621115j329362
$$ 720223129 720918000 721295774 721356511 721285641 721055686 720229566 718322814 715701699 714372337
2979.9G14372337K128005M783809M152417J637161o5088j72973M02391N99206K45630
$$ 714372337 716500342 721284151 725436568 727073729 727008641 726835668 727238059 727837265 728082895
2998.2G28082895j58131j03831M70519R36389P21931K5988o54042r89437p79867o5506
$$ 728082895 727924764 727820933 728291452 729227841 729949772 729975760 729321718 728332281 727552414 727486908
3018.6G27486908O82652R89438Q72910N41508J23620k23577l65198l18706k79784k79427
$$ 727486908 728169560 729158998 730031908 730573416 730697036 730473459 730108261 729789555 729509771 729230344
3039G29230344j34289R6560J38342m4704k33590l09825l21567l55423m54366n19693
$$ 729230344 729096055 729192615 729330957 729286253 729052663 728742838 728421271 728065848 727611482 727091789
3059.4G27091789m54724l92079m59254n83172o53982o61075o83486o85394n75781m06921
$$ 727091789 726637065 726244986 725785732 725202560 724548578 723887503 723204017 722518623 721942842 721535921
3079.8G21535921k49386j53959j53601j32143J0550J92582M02093O91891R00030P83921
$$ 721535921 721286535 721132576 720978975 720846832 720857382 721049964 721452057 722143948 723043978 723827899
3100.2G23827899L79204O6281J51991M28975N43177N09441M37439K69413k2114l84807
$$ 723827899 724207103 724273384 724425375 724854350 725397527 725906968 726344407 726613820 726591706 726206899
3120.6G26206899o56963o29246l98576k97308m19617n18799m10676k18272k22385m58836
$$ 726206899 725549936 724920690 724522114 724224806 723805189 723286390 722875714 722657442 722435057 721976221
3141G21976221n57244m32551l84748l71933k65181l25859n65588o23763n07831m26710
$$ 721976221 721418977 720986426 720601678 720229745 719964564 719638705 719073117 718449354 717941523 717514813
3161.4G17514813m19617m63605n31196n81622n54920n03182n36919o00516o00636o06359
$$ 717514813 717095196 716631591 716100395 715518773 714963853 714460671 713923752 713323236 712722600 712116241
3181.8G12116241o53982o82592o86050o91056o95348o83844o87122p24733p55548p58052
$$ 712116241 711462259 710779667 710093617 709402561 708707213 708023369 707336247 706611514 705855966 705097914
3202.2G05097914p47264p33435p20024p29740p77065q14736p87676p42077p63655q15749
$$ 705097914 704350650 703617215 702897191 702167451 701390386 700575650 699787974 699045897 698282242 697466493
3222.6F97466493q43466q69929q95739q74937q31186q72374r32813r01222q67486q58188
$$ 697466493 696623027 695753098 694857359 693982422 693151236 692278862 691346049 690444827 689577341 688719153
3243F88719153p79807p11382p88450q45015p39038o42896o96122p91729p75516o74963
$$ 688719153 687939346 687227964 686439514 685594499 684855461 684212565 683516443 682724714 681949198 681274235
3263.4F81274235n86748m56512l22878m44591o71804p16090p30992p78973p67410p15553
$$ 681274235 680687487 680230975 679908097 679463506 678791702 678075612 677344620 676565647 675798237 675082684
3283.8F75082684p04289p11858o15537n80132p59185j005769j202225j200021r22203
$$ 675082684 674378395 673666537 673051000 672470868 671711683 670705914 669503689 668303668 667381465
3302.1F67381465o75618q48115j286864j544237j531243j428307j415848j445651j424373
$$ 667381465 666705847 665857732 664570868 663026631 661495388 660067081 658651233 657205582 655781209
3320.5F55781209j385033j398861j581967j767755j766562j759112j791537j741707
$$ 655781209 654396176 652997315 651415348 649647593 647881031 646121919 644330382 642588675
3336.8F42588675j788676j992523k126992k170682k095461j937747k069354k428949
$$ 642588675 640799999 638807476 636680484 634509802 632414341 630476594 628407240 625978291
3353.1F25978291k500534k312362k245069k358317k430022k308607k198160k352774
$$ 625978291 623477757 621165395 618920326 616562009 614131987 611823380 609625220 607272446
3369.4F07272446k639949k693117k442181k169490k017557j912237j784145j649678
$$ 607272446 604632497 601939380 599497199 597327709 595310152 593397915 591613770 589964092
3385.7E89964092j587332j573920j585781j653672j668155j559615j462340j544476
$$ 589964092 588376760 586802840 585217059 583563387 581895232 580335617 578873277 577328801
3402.1E77328801j702130j655519j420796j139581q64148p33376p35580o56546n53965
$$ 577328801 575626671 573971152 572550356 571410775 570546627 569813251 569077671 568421125 567867160
3420.4E67867160n70059n65827m22358k47181k02596j56343K027r060j77682j24812
$$ 567867160 567297101 566731274 566308916 566061735 565859139 565702796 565704823 565695763 565518081 565393269
3440.8E65393269J08421K73168L61264M08590M79579N94139P06434Q32558R01222P78854
$$ 565393269 565501690 565774858 566136122 566544712 567024291 567618430 568324864 569157422 570058644 570837498
3461.2E70837498P18355R76443J180291R20177N22911N53132Q46147J062810J103759
$$ 570837498 571555853 572532296 573712587 574632764 575155675 575708807 576554954 577617764 578721523
3479.6E78721523Q80897P64907R77397J050949R08375R36567J101971J153886J040936
$$ 578721523 579602420 580367327 581344724 582395673 583304048 584240615 585342586 586496472 587537408
3497.9E87537408J021862J155615J027286P91907Q86440J139224J346827J313090J058400
$$ 587537408 588559270 589714885 590742171 591534078 592420518 593559742 594906569 596219659 597278059
3516.3E97278059J001417J255274J536012J423359J085460J074910J279116J416087
$$ 597278059 598279476 599534750 601070762 602494121 603579581 604654491 605933607 607349694
3532.6F07349694J497268J410604J263857J442492J723707J627326J229584J101434
$$ 607349694 608846962 610257566 611521423 612963915 614687622 616314948 617544532 618645966
3548.9F18645966J284301J285196J191139J360178J648903J698375J510262J477659
$$ 618645966 619930267 621215463 622406602 623766780 625415683 627114058 628624320 630101979
3565.2F30101979J681983J657665J412213J385152J617074J826465J910210K001464
$$ 630101979 631783962 633441627 634853840 636238992 637856066 639682531 641592741 643594205
3581.5F43594205K120555K099871J821697J575530J619696J808048J960098J986981
$$ 643594205 645714760 647814631 649636328 651211858 652831554 654639602 656599700 658586681
3597.9F58586681J905441J850844J875937J812815J726032J746296J818359J805544
$$ 658586681 660492122 662342966 664218903 666031718 667757750 669504046 671322405 673127949
3614.2F73127949J597703J513004J594961J421272J211524J160384J202523J218379
$$ 673127949 674725652 676238656 677833617 679254889 680466413 681626797 682829320 684047699
3630.5F84047699J082718R59993Q66115Q57830R08196R08255R23396R69469R71556
$$ 684047699 685130417 686090410 686956525 687814355 688722551 689630806 690554202 691523671 692495227
3648.8F92495227O47664K05338J84536M66585N60820K84910K1398J30415L56973L17692
$$ 692495227 693142891 693348229 693532765 693999350 694560170 694845080 694866478 694996893 695353866 695671558
3669.2F95671558J43588N9783n4538j35898r4355J9134K79605O33836Q49306M05431
$$ 695671558 695815146 695874929 695820391 695684493 695590138 695609272 695888877 696522713 697372019 697777450
3689.6F97777450k83480j92344J45436J75118O9916K1458N5790J59144K46704J79529
$$ 697777450 697493970 697301626 697447062 697622180 697692096 697713554 697769344 697928488 698175192 698354721
3710F98354721j8597q5473n2988m6015j5736J4604q9646k27213p3611K74837M61280
$$ 698354721 698336124 698250651 698197663 698151648 698135912 698150516 698060870 697833657 697760046 698034883 698496163
3732.5F98496163K61426j05262j73747j13428k04027k11239K3485J4960k51054l31223
$$ 698496163 698757589 698652327 698478580 698365152 698161125 697949886 697973371 697988331 697737277 697406054
3752.9F97406054j41204p689n5849j46747j06454p331K861j43290l07739k71380o6459
$$ 697406054 697264850 697257161 697201312 697054565 696948111 696940780 696943641 696800351 696492612 696221232 696154773
3775.3F96154773J68026J60157j57117k96534j82569j08659j22726j25885n4121N9545
$$ 696154773 696322799 696482956 696325839 696029305 695846736 695738077 695615351 695489466 695435345 695494890
3795.7F95494890R3401m2916j63555j38163k11120l10540j93775j3113L9876Q642L3438
$$ 695494890 695588291 695545375 695381820 695243657 695032537 694721997 694528222 694515109 694554985 694563627 694597065
3818.1F94597065R418j68800k94507k89202k11775q5235P9692K41279J44422j90258
$$ 694597065 694606483 694437683 694143176 693853974 693642199 693556964 693636656 693877935 694022357 693832099
3838.5F93832099l30388l33786l19541j47402Q4460R0957l10898n28932j64688M0651
$$ 693832099 693501711 693167925 692848384 692700982 692785442 692876399 692565501 692036569 691871881 691912532
3858.9F91912532L0696n3882r6500n8353p3850j70887k28107j60932n8055n4479j15752
$$ 691912532 691943228 691889346 691792846 691734493 691660643 691489756 691261649 691100717 691042662 690988183 690872431
3881.4F90872431j30415j17183j52409j75178j57714j19448j7881O7830P331j52826
$$ 690872431 690742016 690624833 690472424 690297246 690139532 690020084 690002203 690070033 690077364 689924538
3901.8F89924538k55823k89321k81990j63376J6630M3690p4446j66834j75774j33633
$$ 689924538 689668715 689379394 689097404 688934028 688950658 688994348 688919902 688753068 688577294 688443661
3922.1F88443661j02282r1493n8293n5075j12414j48535j78516j71423r5367n8949
$$ 688443661 688341379 688249886 688191593 688136518 688024104 687875569 687697053 687525630 687430263 687371314
3942.5F87371314o7592o5565o8426r5249j22606j38283j28865o6102l5405r8407j11878
$$ 687371314 687303722 687238157 687169731 687074482 686951876 686813593 686684728 686618626 686583221 686484814 686372936
3965F86372936m0710n7042j51455k04265j83106j02222k5272L4034L0398j02698j78516
$$ 686372936 686332226 686275184 686123729 685919464 685736358 685634136 685608864 685642898 685673296 685570598 685392082
3987.4F85392082j03653j01387j77443j65820j12355
$$ 685392082 685288429 685187042 685009599 684843779 684731424
3997.6F84731424
$$ 684731424
##END=$$ End of the data block
