##TITLE=Renata Meng 02 $$ Begin of the data block
##JCAMP-DX=5.00 $$ ACD/SpecManager v 10.08
##SPECTROMETER/DATA SYSTEM=Alpha
##DATE=09 Sep 2014 08:39:12
##DATA TYPE=INFRARED SPECTRUM
##DATA CLASS=XYDATA
##ORIGIN=
##OWNER=
##NPOINTS=1765
##FIRSTX=399.76428223
##LASTX=3997.64306641
##MAXX=3997.64306641
##MINX=399.76428223
##MAXY=0.83666277
##MINY=0.12939060
##XFACTOR=1.0000000000
##YFACTOR=1.000000000000000e-9
##FIRSTY=0.81706572
##DELTAX=2.03961372
##XUNITS=1/CM
##YUNITS=ARBITRARY UNITS
##XYDATA=(X++(Y..Y))
$$ plain form
399.8 817065716 822355151 824887812 828598559 829801500 827966392 828078568 829297185 827156842 823165178
418.1 823165178 820192933 815839171 808958054 797719121 773953080 742902815 735107839 761646628
434.4 761646628 794178843 811778963 820768476 826440573 827076197 826653540 828735292 829482913 827627122
452.8 827627122 827846646 829612136 828146696 826175392 827169359 827368796 825176477 824698746 825781882
471.2 825781882 824270248 822043061 822448552 822251022 819501877 818049312 818099916 815317929 810837984
489.5 810837984 807510495 801155746 786766648 761884034 721791267 679239035 675618589 720557868
505.8 720557868 771496475 798288345 808313251 813312769 814296782 812256575 811467707 811516166 809339106
524.2 809339106 806439221 804645598 800810754 793332338 784606993 772935748 752694309 722389579
$$ packed form
399.8H17065716N289435K532661L710747J202941j835108J12176J218617k140343l991664
418.1H23165178k972245m353762o881117j1238933k3766041l1050265p794976K6538789
434.4G61646628L2532215J7600120Q989513N672097O35624m22657K081752P47621j855791
452.8H27627122K19524J765490j465440j971304R93967J99437k192319m77731J083136
471.2H25781882j511634k227187M05491j97530k749145j452565N0604k781987m479945
489.5H10837984l327489o354749j4389098k4882614m0092767m2552232l620446M4939279
505.8G20557868N0938607K6791870J0024906M999518R84013k040207p88868M8459k177060
524.2H09339106k899885j793623l834844p478416q725345j1671245k0241439l0304730
$$ plain form
540.5 722389579 684537768 645193517 619294584 623523951 657262266 701633334 739764273 767163575
556.8 767163575 784115076 792003512 795712411 798444092 797819853 792656779 784807324 775491059
573.1 775491059 770228803 776197433 788630366 796614766 798371434 799084067 799984694 798432469 795137286
591.5 795137286 792356074 788290024 780643582 770511925 757485807 738240004 715309918 702983558
607.8 702983558 715095460 745181322 773598969 790668666 797964096 799935937 801143408 802222073
624.1 802222073 800939739 797529995 793355346 790107489 790967643 795245290 798632979 799188197 798357427
642.5 798357427 798495054 799043536 798213184 797066212 797009647 796459734 794371963 792329431 790407062
660.8 790407062 786694169 781212747 773599803 763470709 754540920 743788481 724131823 694324315
$$ packed form
540.5G22389579l7851811l9344251k5898933M229367L3738315M4371068L8130939K7399302
556.8G67163575J6951501P888436L708899K731681o24239n163074p849455r316265
573.1G75491059n262256N968630J2432933P984400J756668P12633R00627j552225l295183
591.5G95137286k781212m066050p646442j0131657j3026118j9245803k2930086j2326360
607.8G02983558J2111902L0085862K8417647J7069697P295430J971841J207471J078665
624.1H02222073j282334l409744m174649l247857Q60154M277647L387689N55218q30770
642.5G98357427J37627N48482q30352j146972n6565n49913k087771k042532j922369
660.8G90407062l712893n481422p612944j0129094q929789j0752439j9656658k9807508
$$ plain form
677.2 694324315 673313260 682620764 708541572 723372221 723271430 717199087 708702922 696079552
693.5 696079552 674614608 642525256 610985398 597931027 608533025 633033037 660346091
707.7 660346091 685761452 708516836 727766752 743063569 755639791 766583800 775397658 782269239
724.1 782269239 788418949 793826163 797818363 801135182 804562747 807368279 809221327 811067998
740.4 811067998 813029468 814142525 814575076 815063894 815049827 813573599 810526788 804904997 794548512
758.7 794548512 776276827 737276316 660041988 572927058 557514429 634708703 727682114
773 727682114 780067265 800251603 807897866 810945749 811863959 811971903 811041594 807445049 799694300
791.4 799694300 787147403 771758318 762254179 768854678 789201736 809982419 823008776 829509199
$$ packed form
677.2F94324315k1011055R307504K5920808J4830649j00791o072343q496165j2623370
693.5F96079552k1464944l2089352l1539858j3054371J0601998K4500012K7313054
707.7F60346091K5415361K2755384J9249916J5296817J2576222J0944009Q813858O871581
724.1G82269239O149710N407214L992200L316819L427565K805532J853048J846671
740.4H11067998J961470J113057M32551M88818j4067j476228l046811n621791j0356485
758.7G94548512j8271685l9000511p7234328q7114930j5412629P7194274R2973411
773G27682114N2385151K0184338P646263L047883R18210J07944r30309l596545p750749
791.4G99694300j2546897j5389085r504139O600499K0347058K0780683J3026357O500423
$$ plain form
807.7 829509199 832397997 832978725 832162201 830734015 828431368 824872017 820513368 815473318 808653235
826 808653235 798842967 785386384 768685162 753771484 750084162 761065900 777865052 789720893
842.4 789720893 793170929 788750231 776000500 752893865 721034408 697182238 702799499 729225099
858.7 729225099 745334387 735247076 701374412 662056327 655866742 701701999 765971720 809258699
875 809258699 827978671 834439993 836332440 836662769 836083412 834587753 832677960 830675244 828263640
893.4 828263640 825472951 822753072 819995999 816710234 812938452 808817267 803915918 797878027
909.7 797878027 790950954 783140957 773951411 763267696 751300871 737895072 722924650 707032800
926 707032800 691209495 676287055 663320124 653788865 648846805 648739934 653114676 661212027
$$ packed form
807.7H29509199K888798N80728q16524j428186k302647l559351m358649n040050o820083
826H08653235r810268j3456583j6701222j4913678l687322J0981738J6799152J1855841
842.4G89720893L450036m420698j2749731k3106635l1859457k3852170N617261K6425600
858.7G29225099J6109288j0087311l3872664l9318085o189585M5835257O4269721M3286979
875H09258699J8719972O461322J892447L30329n79357j495659j909793k002716k411604
893.4H28263640k790689k719879k757073l285765l771782m121185m901349o037891
909.7G97878027o927073p809997r189546j0683715j1966825j3405799j4970422j5891850
926G07032800j5823305j4922440j2966931r531259m942060j06871M374742Q097351
$$ plain form
942.3 661212027 671790898 683570862 695749462 707251251 715791404 719738603 722451448 729672134
958.6 729672134 739239633 743338585 742718339 747007489 760561526 777361393 790148318 796846628
974.9 796846628 798252046 794761598 785089254 770750821 762719512 769867897 783922076 792502642
991.3 792502642 794162452 792453527 788988113 783877254 777303457 769364655 759550333 747379601
1007.6 747379601 733269811 718868434 707099319 700380981 698989809 704839289 721265733 744227052
1023.9 744227052 763725042 774736702 778628647 778038204 774371862 767978370 759640694 751607895
1040.2 751607895 747122228 748649538 755952895 765896320 774829328 781067014 785012543 787344337
1056.5 787344337 788160443 787786722 786827683 785388768 783298314 780881286 778462291 775792778 772728980
$$ packed form
942.3F61212027J0578871J1779964J2178600J1501789Q540153L947199K712845P220686
958.6G29672134R567499M098952o20246M289150J3554037J6799867J2786925O698310
974.9G96846628J405418l490448r672344j4338433q031309P148385J4054179Q580566
991.3G92502642J659810j708925l465414n110859o573797p938802r814322j2170732
1007.6G47379601j4109790j4401377j1769115o718338j391172N849480J6426444K2961319
1023.9G44227052J9497990J1011660L891945n90443l666342o393492q337676q032799
1040.2G51607895m485667J527310P303357R943425Q933008O237686L945529K331794
1056.5G87344337Q16106l73721r59039j438915k090454k417028k418995k669513l063798
$$ plain form
1074.9 772728980 769723237 766946673 763971031 760740399 757597685 754445434 750989020 747525573
1091.2 747525573 744317830 740925312 736927330 732372701 726834416 719176948 708726585 696472466
1107.5 696472466 685804784 680668771 681195855 683168828 683218360 682571173 684392214 686828256 681303144
1125.9 681303144 664527953 652690053 665155590 694211781 718063414 729837537 734230340
1140.1 734230340 735461175 735563517 735005736 733530104 731470227 729496419 727537751 725248456 722694218
1158.5 722694218 719613612 715106666 708491325 699172676 685716569 666099072 638880670 605199456
1174.8 605199456 572206140 552101135 553377450 577010810 620601237 673459113 715673804
1189.1 715673804 736601233 741871655 740580738 737387598 733667254 730073810 727164865 724739015
$$ packed form
1074.9G72728980l005743k776564k975642l230632l142714l152251l456414l463447
1091.2G47525573l207743l392518l997982m554629n538285p657468j0450363j2254119
1107.5F96472466j0667682n136013N27084J972973M9532o47187J821041K436042n525112
1125.9F81303144j6775191j1837900J2465537K9056191K3851633J1774123M392803
1140.1G34230340J230835J02342n57781j475632k059877j973808j958668k289295k554238
1158.5G22694218l080606m506946o615341r318649j3456107j9617497k7218402l3681214
1174.8F05199456l2993316k0105005J276315K3633360M3590427N2857876M2214691
1189.1G15673804K0927429N270422j290917l193140l720344l593444k908945k425850
$$ plain form
1205.4 724739015 722173810 719430745 716678798 713596463 710142374 707069695 704690516 702271700
1221.7 702271700 699298143 695986569 692452669 688457072 683905661 678741574 672736645 665796995
1238.1 665796995 657818079 648172200 636243403 622236729 606406868 588054478 565882802 538698792
1254.4 538698792 505519748 466356248 424958140 392089516 383839339 411783367 469887316
1268.6 469887316 533745646 578786254 597208381 594726324 578226209 551668048 517918468
1282.9 517918468 479573011 438717872 398168862 362633854 337052882 323624313 321488619
1297.2 321488619 330408096 352002263 383668005 412648469 421785504 402944714 365100265 333763540
1313.5 333763540 336133868 371975869 413149297 443233758 473032504 513039827 558463097
$$ packed form
1205.4G24739015k565205k743065k751947l082335l454089l072679k379179k418816
1221.7G02271700k973557l311574l533900l995597m551411n164087o004929o939650
1238.1F65796995p978916r645879j1928797j4006674j5829861j8352390k2171676k7184010
1254.4E38698792l3179044l9163500m1398108l2868624q250177K7944028N8103949
1268.6D69887316O3858330M5040608J8422127k482057j6500115k6558161l3749580
1282.9E17918468l8345457m0855139m0549010l5535008k5580972j3428569k135694
1297.2C21488619Q919477K1594167L1665742K8980464R137035j8840790l7844449l1336725
1313.5C33763540K370328L5842001M1173428L0084461K9798746M0007323M5423270
$$ plain form
1327.8 558463097 598744750 627548158 645294905 657345533 670079231 686266065 702928901
1342.1 702928901 716037691 723762989 725462973 721545041 712951481 700038671 682112277 658325195
1358.4 658325195 628134787 594866395 569963634 561385870 565007925 573091090 582289636 592981935
1374.7 592981935 604038954 613249660 618898451 619848549 616043925 607180715 594315171 580908597
1391 580908597 567966580 554324329 539444268 522830606 506075740 492229223 484559476 487963885
1407.3 487963885 502663493 521849990 535228312 536227465 522199154 493156970 460463315 432854086
1423.7 432854086 415331006 415974319 438803226 478681445 524603188 574427545 621287525 653852344
1440 653852344 677502692 696698546 711688161 723607779 732657552 739563525 745285451 750523150
$$ packed form
1327.8E58463097M0281653K8803408J7746747J2050628J2733698J6186834J6662836
1342.1G02928901J3108790P725298J699984l917932q593560j2912810j7926394k3787082
1358.4F58325195l0190408l3268392k4902761q577764L622055Q083165R198546J0692299
1374.7E92981935J1057019R210706N648791R50098l804624q863210j2865544j3406574
1391E80908597j2942017j3642251j4880061j6613662j6754866j3846517p669747L404409
1407.3D87963885J4699608J9186497J3378322R99153j4028311k9042184l2693655k7609229
1423.7D32854086j7523080O43313K2828907L9878219M5921743M9824357M6859980L2564819
1440F53852344K3650348J9195854J4989615J1919618R049773O905973N721926N237699
$$ plain form
1456.3 750523150 753571033 753500402 752137005 749802291 746343195 742779553 739448905 734926164 728372157
1474.7 728372157 720051944 710641921 701246023 693812013 689365149 685816944 678968370 666556835
1491 666556835 651386857 632941008 607986450 579746902 553648472 529843390 500226736 456355095
1507.3 456355095 417782038 392780811 373315692 351435453 323588818 299264222 286950588
1521.6 286950588 289740026 306017607 332758069 364493430 401073217 445261031 486246049
1535.8 486246049 522966623 568540335 613178849 645698845 672264099 694847524 714445651
1550.1 714445651 730452597 742858589 752342165 759714544 763036013 762820661 761976421 761541128
1566.4 761541128 761455119 760786414 758182883 751932263 738379478 718996286 695191860 662836492
$$ packed form
1456.3G50523150L047883p0631j363397k334714l459096l563642l330648m522741o554007
1474.7G28372157q320213r410023r395898p434010m446864l548205o848574j2411535
1491F66556835j5169978j8445849k4954558k8239548k6098430k3805082k9616654m3871641
1507.3D56355095l8573057k5001227j9465119k1880239k7846635k4324596j2313634
1521.6B86950588K789438J6277581K6740462L1735361L6579787M4187814M0985018
1535.8D86246049L6720574M5573712M4638514L2519996K6565254K2583425J9598127
1550.1G14445651J6006946J2405992R483576P372379L321469k15352q44240m35293
1566.4G61541128q6009o68705k603531o250620j3552785j9383192k3804426l2355368
$$ plain form
1582.8 662836492 618818998 562384248 503860712 467304498 470165253 501694202 534864783
1597 534864783 552630007 551018178 528534293 488555789 451896429 454468161 508910716 581689358
1613.4 581689358 640186489 672379434 680210054 676571190 667523026 655394435 641047537 624701381
1629.7 624701381 608417034 591334820 569527864 548208714 531470120 516533613 501697659
1643.9 501697659 483320713 461836636 443675399 421021372 384891868 351478726 318935037
1658.2 318935037 280307323 235908195 194068328 163331211 141296610 129390597 131540820
1672.5 131540820 146853000 170218498 193050906 213629007 235825837 263285220 288657278
1686.8 288657278 310497582 332283020 350644708 366328448 381666929 402881294 438763469
$$ packed form
1582.8F62836492m4017494n6434750n8523536l6556214K860755L1528949L3170581
1597E34864783J7765224j611829k2483885l9978504l6659360K571732N4442555P2778642
1613.4E81689358N8497131L2192945P830620l638864r048164j2128591j4346898j6346156
1629.7F24701381j6284347j7082214k1806956k1319150j6738594j4936507j4835954
1643.9E01697659j8376946k1484077j8161237k2654027l6129504l3413142l2543689
1658.2C18935037l8627714m4399128m1839867l0737117k2034601j1906013K150223
1672.5A31540820J5312180K3365498K2832408K0578101K2196830K7459383K5372058
1686.8B88657278K1840304K1785438J8361688J5683740J5338481K1214365L5882175
$$ plain form
1701.1 438763469 478128880 517364800 556483150 587778926 612798929 634943724 656334043
1715.3 656334043 678487897 697809696 712365925 725521088 738153636 749361336 759105027
1729.6 759105027 767237782 774707973 780614257 784606934 788545132 792658210 796401262 799879193
1745.9 799879193 803082407 805849552 807795763 809026122 810160518 811105847 811627805 811733484 811730862
1764.3 811730862 812049687 812690616 813342869 813786566 814002216 814200103 814487040 814567983 814261496 813735783
1784.7 813735783 813364029 813428164 813943028 814564466 815042794 815570116 816103995 816339850 816083312 815641463
1805.1 815641463 815571547 816196740 817220092 818286240 819606960 821361482 823201478 824745774 826026857
1823.4 826026857 826991796 827485263 827516913 827201843 826869607 826725125 826732099 826932251 827385366 827861786
$$ packed form
1701.1D38763469L9365411L9235920L9118350L1295776K5020003K2144795K1390319
1715.3F56334043K2153854J9321799J4556229J3155163J2632548J1207700R743691
1729.6G59105027Q132755P470191N906284L992677L938198M113078L743052L477931
1745.9G99879193L203214K767145J946211J230359J134396R45329N21958J05679k622
1764.3H11730862L18825O40929O52253M43697K15650J97887K86937Q0943l06487n25713
1784.7H13735783l71754O4135N14864O21438M78328N27322N33879K35855k56538m41849
1805.1H15641463o9916O25193J023352J066148J320720J754522J839996J544296J281083
1823.4H26026857R64939M93467L1650l15070l32236j44482O974K00152M53115M76420
$$ plain form
1843.8 827861786 828016758 827965200 827998996 828156292 828436971 828751326 828918755 828925252 828911006 828963220 829081357
1866.3 829081357 829146087 828902900 828415334 827937126 827555895 827161491 826614380 826008916 825522482 825136423
1886.7 825136423 824738979 824354887 824153841 824169099 824301898 824618042 825084567 825421035 825479507 825319052
1907.1 825319052 824927688 824356318 823988438 824113190 824650109 825445473 826505482 827691615 828636229
1925.4 828636229 829299748 829793036 829912722 829474211 828757048 828248918 828183770 828566313 829228222 829839110
1945.8 829839110 830164254 830188036 829901338 829031706 827423990 825649202 824676633 824896932 825986505
1964.2 825986505 827429473 828657746 829354227 829745352 830100596 830328226 830336869 830307961 830345094 830340505
1984.6 830340505 830350995 830535889 830759764 830774486 830680370 830680668 830677629 830604911 830622733 830729842 830709577
$$ packed form
1843.8H27861786J54972n1558L3796J57296K80679L14355J67429O497j4246N2214J18137
1866.3H29081357O4730k43187m87566m78208l81231l94404n47111o05464m86434l86059
1886.7H25136423l97444l84092k01046J5258J32799L16144M66525L36468N8472j60455
1907.1H25319052l91364n71370l67880J24752N36919P95364J060009J186133R44614
1925.4H28636229O63519M93288J19686m38511p17163n08130o5148L82543O61909O10888
1945.8H29839110L25144K3782k86698q69632j607716j774788r72569K20299J089573
1964.2H25986505J442968J228273O96481L91125L55244K27630Q643k8908L7133m589
1984.6H30340505J0490J84894K23875J4722r4116K98l039p2718J7822J07109k0265
$$ plain form
2007 830709577 830549717 830404460 830227077 829930663 829648197 829446137 829173982 828813851 828515947 828230679
2027.4 828230679 827786744 827279210 826856494 826405466 825835824 825335562 824998975 824604690 824080110 823620319
2047.8 823620319 823235989 822750807 822234035 821828604 821396768 820802212 820185781 819608629 818894625 818039119
2068.2 818039119 817193627 816352427 815460026 814671576 814176321 813917577 813812077 813952684 814319968 814738750
2088.6 814738750 815176606 815648615 815963387 815933585 815644085 815207481 814620495 814014018 813655317 813592792
2109 813592792 813646257 813761830 814000428 814291239 814506531 814676881 814831376 814864755 814738274 814558446
2129.4 814558446 814359725 814098239 813837171 813631475 813406527 813100517 812757730 812386215 811945856 811466396
2149.8 811466396 811008930 810520411 809889019 809153855 808428288 807745099 807155252 806802213 806705534 806721687
$$ packed form
2007H30709577j59860j45257j77383k96414k82466k02060k72155l60131k97904k85268
2027.4H28230679m43935n07534m22716m51028n69642n00262l36587l94285n24580m59791
2047.8H23620319l84330m85182n16772m05431m31836n94556o16431n77152p14004q55506
2068.2H18039119q45492q41200q92401p88450m95255k58744j05500J40607L67284M18782
2088.6H14738750M37856M72009L14772k9802k89500m36604n86986o06477l58701o2525
2109H13592792N3465J15573K38598K90811K15292J70350J54495L3379j26481j79828
2129.4H14558446j98721k61486k61068k05696k24948l06010l42787l71515m40359m79460
2149.8H11466396m57466m88519o31392p35164p25567o83189n89847l53039r6679J6153
$$ plain form
2170.2 806721687 806777120 806857705 806881368 806815565 806745708 806716800 806668699 806535602 806318641 806019425 805642247
2192.6 805642247 805260062 804955423 804690659 804393888 804085433 803760886 803379059 802993953 802699029 802432895
2213 802432895 802090406 801693082 801258385 800742149 800163925 799630761 799168229 798702717 798200190 797652543
2233.4 797652543 797036111 796359718 795705080 795150101 794703901 794378340 794193745 794119239 794098437 794058383
2253.8 794058383 793907881 793578506 793067455 792458117 791845202 791292906 790836871 790437758 789990246 789449930
2274.2 789449930 788889468 788353741 787786663 787163615 786528289 785856485 785080135 784218252 783294916 782286763
2294.6 782286763 781266987 780396342 779740751 779223740 778760850 778350711 777950108 777471244 776938140
2312.9 776938140 776359558 775595069 774574876 773438811 772338867 771271288 770131230 768969655 768029511
$$ packed form
2170.2H06721687N5433Q0585K3663o5803o9857k8908m8101j33097k16961k99216l77178
2192.6H05642247l82185l04639k64764k96771l08455l24547l81827l85106k94924k66134
2213H02432895l42489l97324m34697n16236n78224n33164m62532m65512n02527n47647
2233.4G97652543o16432o76393o54638n54979m46200l25561j84595p4506k0802m0054
2253.8G94058383j50502l29375n11051o09338o12915n52296m56035l99113m47512n40316
2274.2G89449930n60462n35727n67078o23048o35326o71804p76350q61883r23336j008153
2294.6G82286763j019776q70645o55591n17011m62890m10139m00603m78864n33104
2312.9G76938140n78582p64489j020193j136065j099944j067579j140058j161575r40144
$$ plain form
2331.3 768029511 767373562 766818464 766267657 765732169 765230417 764948010 765128314 765413165 765064597 763852775
2351.7 763852775 762105644 760289192 758730710 757571995 756724179 756177187 755918324 755724728 755467117
2370.1 755467117 755201697 754967749 754767179 754607439 754452825 754174054 753647208 752879560 751975834 751011789
2390.4 751011789 750042915 749130309 748258650 747361660 746441603 745532930 744597793 743587196 742538393
2408.8 742538393 741498053 740425110 739328146 738301158 737377226 736526251 735724390 734962225 734192550
2427.2 734192550 733354211 732452810 731510341 730496466 729396760 728249848 727071226 725823939 724520802
2445.5 724520802 723210394 721854508 720370889 718740880 717000544 715184689 713377833 711707115
2461.8 711707115 710196078 708756745 707351089 706031024 704819262 703677177 702584922 701517761
$$ packed form
2331.3G68029511o55949n55098n50807n35488n01752k82407J80304K84851l48568j211822
2351.7G63852775j747131j816452j558482j158715q47816n46992k58863j93596k57611
2370.1G55467117k65420k33948k00570j59740j54614k78771n26846p67648r03726r64045
2390.4G51011789r68874r12606q71659q96990r20057r08673r35137j010597j048803
2408.8G42538393j040340j072943j096964j026988r23932q50975q01861p62165p69675
2427.2G34192550q38339r01401r42469j013875j099706j146912j178622j247287j303137
2445.5G24520802j310408j355886j483619j630009j740336j815855j806856j670718
2461.8G11707115j511037j439333j405656j320065j211762j142085j092255j067161
$$ plain form
2478.1 701517761 700352073 698990047 697474003 695879281 694258988 692684114 691236973 689938545
2494.5 689938545 688746095 687634110 686562777 685389459 683978140 682353735 680574000 678588092
2510.8 678588092 676407337 674154103 671834350 669373333 666820824 664260030 661657929 659001052
2527.1 659001052 656375647 653812408 651239991 648642898 646102428 643681169 641383410 639254451
2543.4 639254451 637420237 635986090 635063946 634859741 635524273 636993706 639131427 641868889 645077646
2561.8 645077646 648559034 652244151 656136274 660096347 663918197 667508304 670787334 673558831
2578.1 673558831 675670326 677081645 677712321 677482128 676506341 675053298 673325062 671535790 670077324
2596.4 670077324 669290423 669275820 670004964 671348274 673003912 674561501 675770462 676576793 676870584
$$ packed form
2478.1G01517761j165688j362026j516044j594722j620293j574874j447141j298428
2494.5F89938545j192450j111985j071333j173318j411319j624405j779735j985908
2510.8F78588092k180755k253234k319753k461017k552509k560794k602101k656877
2527.1F59001052k625405k563239k572417k597093k540470k421259k297759k128959
2543.4F39254451j834214j434147r22144k04205O64532J469433K137721K737462L208757
2561.8F45077646L481388L685117L892123L960073L821850L590107L279030K771497
2578.1F73558831K111495J411319O30676k30193r75787j453043j728236j789272j458466
2596.4F70077324p86901j4603P29144J343310J655638J557589J208961Q06331K93791
$$ plain form
2614.8 676870584 676579773 675854266 674869299 673665881 672333360 671074152 669928312 668754280 667550743
2633.2 667550743 666393995 665180564 663818061 662400305 661026835 659695923 658415794 657263219
2649.5 657263219 656210184 655100346 653920472 652784407 651653230 650442421 649295032 648392677
2665.8 648392677 647722542 647351503 647562921 648486614 650040209 652230680 655099809 658458292 662058771
2684.1 662058771 665870965 669829965 673646510 677128255 680356264 683346629 685934126 688095033
2700.5 688095033 689899862 691181421 691725910 691584170 690831900 689476669 687735260 686020970 684599221
2718.8 684599221 683530152 682943225 682983875 683555245 684469402 685747087 687364459 689001799 690405488
2737.2 690405488 691515088 692144930 692038417 691200197 689836979 688022435 685790181 683372676 680947542
$$ packed form
2614.8F76870584k90811p25507r84967j203418j332521j259208j145840j174032j203537
2633.2F67550743j156748j213431j362503j417756j373470j330912j280129j152575
2649.5F57263219j053035j109838j179874j136065j131177j210809j147389r02355
2665.8F48392677o70135l71039K11418R23693J553595K190471K869129L358483L600479
2684.1F62058771L812194L959000L816545L481745L228009K990365K587497K160907
2700.5F88095033J804829J281559N44489j41740p52270j355231j741409j714290j421749
2718.8F84599221j069069n86927M0650N71370R14157J277685J617372J637340J403689
2737.2F90405488J109600O29842j06513q38220j363218j814544k232254k417505k425134
$$ plain form
2755.5 680947542 678502917 676162302 674186349 672560215 671065271 669659555 668337584 666866601
2771.8 666866601 665038228 662950635 660730898 658352673 655918121 653672040 651658535 649730086
2788.2 649730086 647891045 646233380 644662261 643085659 641597271 640239298 638898432 637551308
2804.5 637551308 636292279 635053515 633695126 632315040 631080687 629925489 628789723 627857625
2820.8 627857625 627236187 626828015 626639009 626776814 627126634 627484143 627911687 628565967 629355431 630155504
2841.2 630155504 631094456 632187247 633208990 634158731 635238409 636459470 637698650 638934791 640137255
2859.5 640137255 641073763 641519010 641559422 641355157 640898764 640273273 639657021 639038503 638372540 637785733
2879.9 637785733 637368679 637046456 636770010 636624336 636626840 636729717 637064874 637704670 638436139 639180958
$$ packed form
2755.5F80947542k444625k340615j975953j626134j494944j405716j321971j470983
2771.8F66866601j828373k087593k219737k378225k434552k246081k013505j928449
2788.2F49730086j839041j657665j571119j576602j488388j357973j340866j347124
2804.5F37551308j259029j238764j358389j380086j234353j155198j135766r32098
2820.8F27857625o21438m08172j89006J37805L49820L57509M27544O54280P89464Q00073
2841.2F30155504R38952J092791J021743R49741J079678J221061J239180J236141J202464
2859.5F40137255R36508M45247M0412k04265m56393o25491o16252o18518o65963n86807
2879.9F37785733m17054l22223k76446j45674K504J02877L35157O39796P31469P44819
$$ plain form
2900.3 639180958 640103698 641177893 642146468 642882764 643445551 643688679 643285036 642298520 641033828
2918.7 641033828 639502108 637656450 635714054 634036064 632896960 632381797 632456124 632873535 633253157
2937 633253157 633528590 633897483 634319365 634549797 634534061 634384930 634121895 633685589 633186460 632756412
2957.4 632756412 632338285 631937563 631576359 631127596 630544901 629959345 629451632 628928840 628370583 627984166
2977.8 627984166 627866209 627840996 627836168 627906859 627945602 627842128 627635777 627370954 627092361 626886666
2998.2 626886666 626875401 627147853 627671063 628398657 629267693 630081117 630631149 630837440 630665183 630108178
3018.6 630108178 629261792 628273070 627258837 626321256 625635266 625409186 625756502 626699209 628136754
3037 628136754 629739404 631138742 632103562 632512331 632593572 633171856 635118604 638276637 641599655
$$ packed form
2900.3F39180958R22740J074195R68575P36296N62787K43128m03643r86516j264692
2918.7F41033828j531720j845658j942396j677990j139104n15163P4327M17411L79622
2937F33253157K75433L68893M21882K30432j5736j49131k63035m36306m99129m30048
2957.4F32756412m18127m00722l61204m48763n82695n85556n07713n22792n58257l86417
2977.8F27984166j17957k5213m828P0691L8743j03474k06351k64823k78593k05695
2998.2F26886666j1265K72452N23210P27594Q69036Q13424N50032K06291j72257n57005
3018.6F30108178q46386r88722j014233r37581o85990k26080L47316R42707J437545
3037F28136754J602650J399338R64820M08769Q1241N78284J946748L158033L323018
$$ plain form
3055.3 641599655 644373178 646505177 648059189 649065316 649429440 648947418 647453845 645072222 642613590
3073.7 642613590 641367853 642054379 644075811 646067381 647050798 647001147 646787226 647404969 649042308
3092.1 649042308 651170850 653142631 654401839 654577672 653744459 652504325 651617825 651571274 652490437
3110.4 652490437 654332042 656854033 659531951 661934972 663939178 665648460 667333961 669182897
3126.7 669182897 671135902 673043013 674877167 676750779 678775072 680867434 682771802 684391558
3143 684391558 685811698 687088847 688268006 689274251 689852715 689971983 689887404 689703941 689330816
3161.4 689330816 688652754 687581778 686081052 684084356 681473911 678209066 674449980 670617759
3177.7 670617759 667377412 665347040 664649248 664823115 665193498 665305197 665074408 664697111 664530933
$$ packed form
3055.3F41599655K773523K131999J554012J006127L64124m82022j493573k381623k458632
3073.7F42613590j245737O86526K021432J991570R83417m9651k13921O17743J637339
3092.1F49042308K128542J971781J259208J75833q33213j240134q86500m6551R19163
3110.4F52490437J841605K521991K677918K403021K004206J709282J685501J848936
3126.7F69182897J953005J907111J834154J873612K024293K092362J904368J619756
3143F84391558J420140J277149J179159J006245N78464J19268q4579j83463l73125
3161.4F89330816o78062j070976j500726j996696k610445l264845l759086l832221
3177.7F70617759l240347k030372o97792J73867L70383J11699k30789l77297j66178
$$ plain form
3196.1 664530933 664926887 665982723 667459488 668961883 670134187 670759201 670860648 670697391 670520306
3214.4 670520306 670354962 670049548 669426262 668335140 666691184 664550424 662054718 659294367 656203210
3232.8 656203210 652614236 648537755 644112289 639378548 634322584 628884971 622915745 616339684
3249.1 616339684 609321833 602082014 594773948 587626219 580879509 574612856 568754077 563126206
3265.4 563126206 557493329 551680982 545615554 539400041 533269346 527300239 521267056 514613926
3281.7 514613926 506647646 497002184 485819995 473568708 460761458 447715670 434500873 421249151
3298 421249151 408634454 397894204 390356213 386945486 388151109 394171357 404767752 419221699
3314.4 419221699 436564475 455824524 476004243 496041864 515110016 532804072 548870146
$$ packed form
3196.1F64530933L95954J055836J476765J502395J172304O25014J01447j63257j77085
3214.4F70520306j65344l05414o23286j091122j643956k140760k495706k760351l091157
3232.8F56203210l588974m076481m425466m733741n055964n437613n969226o576061
3249.1F16339684p017851p239819p308066p147729o746710o266653n858779n627871
3265.4E63126206n632877n812347o065428o215513o130695n969107o033183o653130
3281.7E14613926p966280r645462j1182189j2251287j2807250j3045788j3214797j3251722
3298D21249151j2614697j0740250p537991l410727J205623O020248J0596395J4453947
3314.4D19221699J7342776J9260049K0179719K0037621J9068152J7694056J6066074
$$ plain form
3328.6 548870146 563133061 575701177 586793661 596509755 605045915 612635851 619279385 624941111
3345 624941111 629644096 633413017 636412561 638888478 640849471 642152548 642877042 643222451 643267751
3363.3 643267751 643006802 642499506 641919017 641349971 640685737 639874279 639027476 638180912 637268484 636312187
3383.7 636312187 635356188 634341896 633267045 632268965 631350756 630380273 629378200 628445625 627529144
3402.1 627529144 626525700 625523925 624628842 623756647 622815311 621880770 621053696 620319784 619653821
3420.4 619653821 619066060 618565917 618192315 617994308 617886961 617814064 617827773 617878020 617932558 618068993
3440.8 618068993 618350565 618818939 619426847 620024920 620630503 621371448 622217834 623127222 624143302
3459.2 624143302 625219882 626345873 627627373 628998816 630152583 631002426 631889582 632992923 634221196
$$ packed form
3328.6E48870146J4262915J2568116J1092484R716094Q536160P589936O643534N661726
3345F24941111M702985L768921K999544K475917J960993J303077P24494L45409M5300
3363.3F43267751k60949n07296n80489n69046o64234q11458q46803q46564r12428r56297
3383.7F36312187r55999j014292j074851r98080r18209r70483j002073r32575r16481
3402.1F27529144j003444j001775q95083q72195r41336r34541q27074p33912o65963
3420.4F19653821n87761n00143l73602j98007j07347p2897J3709N0247N4538J36435
3440.8F18068993K81572M68374O07908N98073O05583P40945Q46386R09388J016080
3459.2F24143302J076580J125991J281500J371443J153767Q49843Q87156J103341J228273
$$ plain form
3477.5 634221196 635466695 636602342 637680233 638852596 640082479 641277730 642467797 643725216
3493.8 643725216 645048738 646364391 647711277 649143934 650480568 651652098 652916253 654398382
3510.2 654398382 655997992 657543421 658958554 660404384 662009597 663736105 665359318 666795552
3526.5 666795552 668276668 669845104 671465218 673262119 675085664 676728964 678456068 680461109
3542.8 680461109 682458401 684100747 685531557 687113345 688819468 690509200 692277730 694181681
3559.1 694181681 696127534 698076427 700158834 702365100 704321206 706035137 707855761 709879160
3575.4 709879160 712064087 714417636 716864049 719329178 721867621 724399030 726649642 728715897
3591.7 728715897 730989099 733481705 735953033 738361716 740726709 742993355 745280147 747801602
$$ packed form
3477.5F34221196J245499J135647J077891J172363J229883J195251J190067J257419
3493.8F43725216J323522J315653J346886J432657J336634J171530J264155J482129
3510.2F54398382J599610J545429J415133J445830J605213J726508J623213J436234
3526.5F66795552J481116J568436J620114J796901J823545J643300J727104K005041
3542.8F80461109J997292J642346J430810J581788J706123J689732J768530J903951
3559.1F94181681J945853J948893K082407K206266J956106J713931J820624K023399
3575.4G09879160K184927K353549K446413K465129K538443K531409K250612K066255
3591.7G28715897K273202K492606K471328K408683K364993K266646K286792K521455
$$ plain form
3608.1 747801602 750324965 752585530 754671276 756634951 758637607 760556221 762055218 763433397
3624.4 763433397 765084922 767154276 768981576 770064652 771026909 772126853 773292184 774499834
3640.7 774499834 775674820 776913941 778392017 779915929 780724406 780768037 780917108 781545699 782152712
3659 782152712 782464266 782650709 782888234 783280373 783861518 784326792 784383833 784279048 783929706 783361971
3679.4 783361971 783098698 783371627 784122229 785298526 786308110 786432207 786188304 786149561 786304712
3697.8 786304712 786518455 786619306 786529779 786514342 786778569 787177324 787454426 787383974 787092149 786890090
3718.2 786890090 786877930 786951542 786914825 786752105 786653340 786829710 787319958 787732124 787692308 787322819
3738.6 787322819 786876678 786671519 786857665 786857605 786622584 786552310 786312282 785857022 785601795 785559714 785441220
$$ packed form
3608.1G47801602K523363K260565K085746J963675K002656J918614J498997J378179
3624.4G63433397J651525K069354J827300J083076R62257J099944J165331J207650
3640.7G74499834J174986J239121J478076J523912Q08477M3631J49071O28591O07013
3659G82152712L11554J86443K37525L92139N81145M65274N7041j04785l49342n67735
3679.4G83361971k63273K72929P50602J176297J009584J24097k43903l8743J55151
3697.8G86304712K13743J00851q9527j5437K64227L98755K77102p0452k91825k02059
3718.2G86890090j2160P3612l6717j62720r8765J76370M90248M12166l9816l69489
3738.6G87322819m46141k05159J86146o0k35021p0274k40028m55260k55227m2081j18494
$$ plain form
3761 785441220 785242975 785169542 785117924 785016656 784847677 784515202 784278274 784369588 784536123 784384131
3781.4 784384131 784043312 783771515 783527970 783338964 783260942 783263266 783363938 783432782 783379197 783362925 783167183
3803.9 783167183 782779336 782487154 782200873 781975806 781994522 782246411 782385826 782239676 781909287 781403184
3824.3 781403184 780964792 780726016 780655444 780768096 780890942 780894637 780801952 780537963 780105114 779631376
3844.6 779631376 779259324 779145777 779248536 779366374 779200733 778657556 778130770 777923703 777987957 778056145
3865 778056145 777885020 777612925 777427793 777145565 776792049 776543677 776485801 776483238 776354611 776284933 776120126
3887.5 776120126 775757432 775531948 775387764 775192738 775151253 775277078 775248826 774919271 774436116 773960054
3907.9 773960054 773587525 773318410 773147225 773125708 773142517 773019314 772817791 772637546 772422194 772188306
$$ packed form
3761G85441220j98245p3433n1618j01268j68979l32475k36928R1314J66535j51992
3781.4G84384131l40819k71797k43545j89006p8022K324J00672O8844n3585j6272j95742
3803.9G83167183l87847k92182k86281k25067J8716K51889J39415j46150l30389n06103
3824.3G81403184m38392k38776p0572J12652J22846L695r2685k63989m32849m73738
3844.6G79631376l72052j13547J02759J17838j65641n43177n26786k07067O4254O8188
3865G78056145j71125k72095j85132k82228l53516k48372n7876k563j28627o9678j64807
3887.5G76120126l62694k25484j44184j95026m1485J25825k8252l29555m83155m76062
3907.9G73960054l72529k69115j71185k1517J6809j23203k01523j80245k15352k33888
$$ plain form
3928.3 772188306 772089660 772056460 771833777 771491230 771252513 771096885 770959198 770860255 770801783 770745158
3948.7 770745158 770605445 770390451 770212471 770101547 769993365 769875705 769748271 769578040 769416928 769343317
3969.1 769343317 769321501 769262791 769136012 768965662 768774033 768580019 768443704 768320918 768095076 767829955
3989.5 767829955 767630458 767453671 767270565 767119944
3997.6 767119944
$$ packed form
3928.3G72188306r8646l3200k22683l42547k38717j55628j37687r8943n8472n6625
3948.7G70745158j39713k14994j77980j10924j08182j17660j27434j70231j61112p3611
3969.1G69343317k1816n8710j26779j70350j91629j94014j36315j22786k25842k65121
3989.5G67829955j99497j76787j83106j50621
3997.6G67119944
##END=$$ End of the data block
