##TITLE=Renata M01 $$ Begin of the data block
##JCAMP-DX=5.00 $$ ACD/SpecManager v 10.08
##SPECTROMETER/DATA SYSTEM=Alpha
##DATE=04 Sep 2014 08:34:00
##DATA TYPE=INFRARED SPECTRUM
##DATA CLASS=XYDATA
##ORIGIN=
##OWNER=
##NPOINTS=1765
##FIRSTX=399.76428223
##LASTX=3997.64306641
##MAXX=3997.64306641
##MINX=399.76428223
##MAXY=0.85712969
##MINY=0.49801198
##XFACTOR=1.0000000000
##YFACTOR=1.000000000000000e-9
##FIRSTY=0.82827139
##DELTAX=2.03961372
##XUNITS=1/CM
##YUNITS=ARBITRARY UNITS
##XYDATA=(X++(Y..Y))
399.8H28271389M992962M310071N55992j741349n24044l11136j99259K110422J904726
$$ 828271389 833264351 837574422 838130414 836389065 835865021 835553885 835354626 837465048 839369774
418.1H39369774j346350o08325P27117r74119j043975J69039r81510j040995J030445
$$ 839369774 838023424 837415099 838142216 837168097 836124122 836293161 835311651 834270656 835301101
436.5H35301101K97845j260043n96n2631j603305l20375O97076j066923r80615M77612
$$ 835301101 835598946 834338903 834338307 834285676 832682371 832361996 833059072 831992149 831011534 831489146
456.9H31489146r34303j378655M87387l01838j741946q4162J49906j890719j108050
$$ 831489146 830554843 829176188 829663575 829361737 827619791 827535629 827685535 825794816 824686766
475.2H24686766k9803j663625j742422m22776k098441l526211k428293l564954o438494
$$ 824686766 824656963 822993338 821250916 820828140 818729699 815203488 812775195 809210241 802771747
493.6H02771747p642448j1401117k0799756l2271683l3245206j7543912p709265r155750
$$ 802771747 795129299 783728182 762928426 730656743 697411537 679867625 672158360 663002610
509.9F63002610Q761168M2704046N4572224L7343681J6113341O899774M016697M53413
$$ 663002610 671763778 714467824 769040048 806383729 822497070 829396844 833413541 833866954
526.2H33866954j135290k29478j191020j888632K98619J253605K87890J166225J626074
$$ 833866954 832731664 832502186 831311166 829422534 829721153 830974758 831262648 832428873 834054947
544.6H34054947n07236p56442N82635n39183j294852K37882o0260j390993j13786O34730
$$ 834054947 833547711 832791269 833373904 832834721 831539869 831777751 831717491 830326498 830212712 830847442
565H30847442r83596q17656N18501m84527r87649M69625P1705j199842j47402L7551
$$ 830847442 829863846 829046190 829564691 829080164 828092515 828562140 828633845 827434003 827286601 827324152
585.4H27324152j813054j682937r77636k656877l411710l040135o981134j5009880
$$ 827324152 825511098 823828161 822850525 820193648 816781938 813741803 806760669 791750789
601.7G91750789j9355297j0330439R728134K1749973J6044557L086627o441355r277463
$$ 791750789 772395492 762065053 771793187 793543160 809587717 812674344 806232989 796955526
618G96955526j907230J1554897J6624034R851157K421320Q83698J157761n38349j109421
$$ 796955526 795048296 806603193 823227227 833078384 835499704 836383402 837541163 837002814 835893393
636.4H35893393j18912j538574l554225j977325J123846K515852K932012K017677l98397
$$ 835893393 835774481 834235907 830681682 828704357 829828203 832344055 835276067 837293744 836895347
654.7H36895347p51377O74069n9306j029790k47359j053154k152443O62803J255513
$$ 836895347 836143970 836818039 836758733 835728943 835481584 834428430 832275987 832938790 834194303
673.1H34194303p98166j206756J9908o08027j453221k72333j69814j535177j075149
$$ 834194303 833396137 832189381 832209289 831601262 830148041 829875708 829705894 828170717 827095568
691.4H27095568l60071j557053j788139r10342k155840l515065j634240J58548q17000
$$ 827095568 826735497 825178444 823390305 822479963 820324123 816809058 815174818 815333366 814516366
709.8H14516366j246810j013756k357960k943337k116442k737939l680110k943039
$$ 814516366 813269556 812255800 809897840 806954503 804838061 802100122 798420012 795476973
726.1G95476973k988636m424870m463912m266321n980730p201672p188976q396625
$$ 795476973 792488337 788063467 783599555 779333234 773352504 766150832 758961856 750565231
742.4G50565231r542227q406341p104516o202757l363610L11256K561390M932523P953107
$$ 750565231 741023004 732616663 725512147 719309390 715945780 716257036 718818426 723750949 731704056
760.8G31704056Q991719Q303761O834805K280772L07679J0107338K0145953J6557455
$$ 731704056 740695775 748999536 755834341 758115113 758422792 768530130 788676083 805233538
777.1H05233538Q556247N250990L183246J181126J107037P51555q83162r04560j76430
$$ 805233538 813789785 819040775 822224021 823405147 824512184 825263739 824380577 823476017 823299587
795.4H23299587j516879l150642m032612o873190j0968983j3891459j8189490k6764988
$$ 823299587 821782708 818632066 814599454 807726264 796757281 782865822 764676332 737911344
811.8G37911344l8014889m7459066m5441508k4289072O974399L1350255M1013062L9016307
$$ 737911344 699896455 652437389 606995881 582706809 589681208 621031463 662044525 701060832
828.1G01060832L2969355K7415037K1917463J5185475R136856P308781P637739N099714
$$ 701060832 734030187 761445224 783362687 798548162 807685018 814993799 822631538 827731252
844.4H27731252O92606j855791k624988j598895K655327O641269N959332L365219K531111
$$ 827731252 828423858 826568067 823943079 822344184 824999511 831640780 837600112 840965331 843496442
862.8H43496442J795828M09246M79161J017213K27332M3035R87589O95765j1325O04570
$$ 843496442 845292270 845701516 846180677 847197890 847425222 847468257 848455846 849151611 849140286 849744856
883.2H49744856O81401k89262p8261M79937l30150o04689K57194L1292o12259O1751
$$ 849744856 850426257 850136995 850058734 850538671 850208521 849603832 849861026 849892318 849280059 849341810
903.5H49341810K91228n56648l23951L51787l32177p59661j72973n99265j447141q88407
$$ 849341810 849633038 849076390 848752439 849104226 848772049 848012388 847839415 847240150 845793009 844904602
923.9H44904602m57228j202285j441240k051413n635619r526074n973161M249037R205043
$$ 844904602 844447374 843245089 841803849 839752436 834116817 824590743 818617582 822866619 832071662
942.3H32071662N817652J011789k060533l153741l473878m404068m908860n021989
$$ 832071662 837889314 838901103 836840570 833686829 830212951 825808883 820900023 815878034
958.6H15878034m710138k898395K70605M937351P936298O262541K839923q0824j660466
$$ 815878034 811167896 808269501 808540106 813477457 821413755 827676296 830516219 830435395 828774929
977H28774929j821697k745747m695714o181240p752299q057594k651573N530656P917702
$$ 828774929 826953232 824207485 819511771 813330531 805578232 797520638 794869065 800399721 808317423
995.3H08317423M397452O53863k311051n013824o610512q615137j2297153j3577938
$$ 808317423 812714875 813368738 811057687 806043863 799433351 790818214 778521061 764943123
1011.6G64943123o822229O258309J4073968Q744598K426922N997300Q845508M281163
$$ 764943123 758120894 764379203 778453171 787197769 789624691 795621991 804467499 808748662
1028H08748662j751542o338119j0868847j6086698j7543078q944511O465673J7218352
$$ 808748662 806997120 800659001 789790154 773703456 756160378 747215867 753681540 770899892
1044.3G70899892J8311858J3728380Q105636M395068K961754J793743O60538O68347
$$ 770899892 789211750 802940130 811045766 815440834 818402588 820196331 820856869 821525216
1060.6H21525216O72877j06633k32458J69993k78533o93679j96338j67310o60121l41773
$$ 821525216 822198093 822091460 821859002 822028995 821750462 821056783 820860445 820693135 820033014 819691241
1081H19691241j2696n34654n60641q1301m83513r44554n61536o82831j505017j569092
$$ 819691241 819678545 819143891 818583250 818501949 818018436 817073882 816512346 815829515 814324498 812755406
1101.4H12755406j469672k482474m005730o209254q749068o280601J854301N739033
$$ 812755406 811285734 808803260 804797530 798588276 789839208 783558607 785412908 791151941
1117.7G91151941K227485r12368J54912L468454O139815N813062L039122P68006L92854
$$ 791151941 793379426 792467058 792621970 796090424 802230239 808043301 811082423 811850429 812243283
1136.1H12243283L41713l24607l55482K2054m32909p25030j65105j86622p30575n12361
$$ 812243283 812584996 812260389 811904907 811926961 811494052 810769022 810603917 810417295 809686720 809174359
1156.5H09174359l22163q98838r69470m86731p41482r81689n24163q62121k349794
$$ 809174359 808852196 807953358 806983888 806497157 805755675 804773986 804249823 803387702 801037908
1174.8H01037908m334331o764650n144954L191590Q666039N589843J250445J01150
$$ 801037908 796703577 789938927 784793973 787985563 796651602 802241445 803491890 803593040
1191.1H03593040l13998j157701j212418j015544j785636k585232l205717m570126
$$ 803593040 803279042 802121341 800908923 799893379 798107743 795522511 792316794 787746668
1207.5G87746668l900767M11094K866447J418173N10991N29825p91371k371847l027260
$$ 787746668 783845901 784256995 787123442 788541615 789052606 789582431 788791060 786419213 783391953
1225.8G83391953l234983k119780K97547R46522q13425k114236k327085k872646l184914
$$ 783391953 780156970 778037190 778334737 779281259 778467834 776353598 774026513 771153867 767968953
1244.2G67968953k628625k641856l561914m435182o160200r711444j3883591j7658591
$$ 767968953 765340328 762698472 759136558 754701376 748541176 738829732 724946141 707287550
1260.5G07287550j7844498n347014J9850254L6697388L0767262J4632523L354609k026200
$$ 707287550 689443052 684096038 703946292 740643680 771410942 786043465 789398074 787371874
1276.8G87371874m114449m385293m803598n447983n371333n532681o219268n861998
$$ 787371874 783257425 778872132 774068534 768620551 763249218 757716537 751497269 745635271
1293.1G45635271n122244o150544p896006p678151m236341m64320l239334j2936949
$$ 745635271 740513027 734362483 726466477 718788326 714551985 714087665 710848331 697911382
1309.4F97911382k2053063k7164400k9645443k7871966j8388093j904726K0609141
$$ 697911382 675858319 648693919 619048476 591176510 572788417 570883691 591492832
1323.7E91492832M4601023N5898487M8114062L0412972J4572501M933178r87172n197942
$$ 591492832 636093855 691992342 740106404 770519376 785091877 790025055 789037883 783839941
1340G83839941p189155p969677q626342q407533q095980q721947r204567r706378j3151586
$$ 783839941 776650786 768681109 760054767 751647234 743551254 734829307 725624740 715918362 702766776
1358.4G02766776k0352423k5306702j5510976Q935928K9579759L0943036J5895843
$$ 702766776 682414353 657107651 641596675 650532603 680112362 711055398 726951241
1372.7G26951241m727780j8199921r091496J3445138K0962060J0492623p50482o704688
$$ 726951241 722223461 704023540 694932044 708377182 729339242 739831865 739081383 732376695
1389G32376695r519697j3454675j9317687k5047064l1347870k4662495R222388M9593091
$$ 732376695 722856998 709402323 690084636 665037572 633689702 609027207 618249595 667842686
1405.3F67842686N7268977L4985185J3174236P36475m869104p062494q854330r834111
$$ 667842686 725111663 760096848 773271084 774007559 769138455 762075961 753221631 743387520
1421.6G43387520j0423898j1178196j1175036j0588408q626401p253707r956658j3215780
$$ 743387520 732963622 721785426 710610390 700021982 691395581 684141874 674185216 660969436
1437.9F60969436j0556936n423308r75489K60293l363073q592128j0122419n246281
$$ 660969436 650412500 644989192 644013703 644273996 640910923 632318795 622196376 616950095
1454.3F16950095Q778274K6755810K8253853K1106958J4113009O630361J092732j941502
$$ 616950095 625728369 652484179 680738032 701844990 715957999 722588360 723681092 721739590
1470.6G21739590l930330m444003m002035l652871l713488m540324n180717n301475
$$ 721739590 717809260 713365257 709363222 705710351 701996863 697456539 692275822 686974347
1486.9F86974347n897642o746292o112516n985498q196116j0452687j1381209j2246072
$$ 686974347 681076705 674330413 668217897 662232399 654036283 643583596 632202387 619956315
1503.2F19956315j6834379k3697138j7262041l895879R676397K2482693K6910603K0202995
$$ 619956315 603121936 579424798 562162757 558266878 567943275 590425968 617336571 637539566
1519.5F37539566J1224031K871037l719032o930828o821812n991697n181789k720893
$$ 637539566 648763597 651634634 647915602 640984774 634162962 628171265 622989476 620268583
1535.8F20268583o35564r84132l268123o951988j1754036j4026045j0361493J278937
$$ 620268583 619633019 618648887 615380764 608428776 596674740 582648695 572287202 573566139
1552.2E73566139J5877306K5054336L2615959L2812953J9605816J5264749J5369952
$$ 573566139 589443445 614497781 647113740 679926693 699532509 714797258 730167210
1566.4G30167210J4809668J3303220Q086861K411127k997160p614374j0811210j3905346
$$ 730167210 744976878 758280098 766366959 768778086 765780926 758166552 747355342 733449996
1582.8G33449996j6256214j8300533j9786537k0351052k0934284k1789491k1241486
$$ 733449996 717193782 698893249 679106712 658755660 637821376 616031885 594790399
1597E94790399j8220305j2787760n763709n5254J713693J461447M142761J0752618
$$ 594790399 576570094 563782334 558018625 557963371 559677064 561138511 565281272 576033890
1613.4E76033890J9440234K4682581J7891646Q496404K317786p96795j481950k514422
$$ 576033890 595474124 620156705 638048351 646544755 648862541 648065746 646583796 644069374
1629.7F44069374l870368n757392r377360j0125041p903576o387830m346251j989782
$$ 644069374 640199006 634441614 625064254 614939213 607035637 600647807 596301556 594311774
1646E94311774r91225k233387q745253k1389544k3234307k0316899j5246809m142374
$$ 594311774 593320549 591087162 582341909 560952365 537718058 517401159 502154350 498011976
1662.3D98011976P491738J5093982K4354995L3441007L1477570K7638912K4211824
$$ 498011976 505503714 520597696 544952691 578393698 609871268 637510180 661722004
1676.6F61722004J8122912J4891922J5004278J6182780J3210952J0156393R245038
$$ 661722004 679844916 694736838 709741116 725923896 739134848 749291241 758536279
1690.9G58536279Q149982Q656919Q769333P290661O910324N462826M035294L742874
$$ 758536279 766686261 775343180 784112513 791403174 798313498 803776324 807811618 811554492
1707.2H11554492L315389K758860K586067L109872L222585K116025J597464J441896
$$ 811554492 814869881 817628741 820214808 823324680 826547265 828663290 830260754 831702650
1723.5H31702650P74622M41134R22739J109481J122177J584529J994968K162874K210140
$$ 831702650 832477272 832918406 833841145 834950626 836072803 837657332 839652300 841815174 844025314
1741.9H44025314K104401J554788J180112J184761O71506K861P0692R5725k36154q4043
$$ 844025314 846129715 847684503 848864615 850049376 850720882 850723743 850794435 850890160 850654006 850569963
1762.2H50569963M56274N90265N87702R95636R74774L18885K46048M04536r2327m92036
$$ 850569963 851026237 851616502 852204204 853199840 854174614 854493499 854739547 855144083 855051756 854559720
1782.6H54559720l87967o42002r22680o01172j27137J89185Q22187J301765R19462
$$ 854559720 854171753 853529751 852607071 852005899 851878762 852067947 852890134 854191899 855111361
1801H55111361M30882N88417N75721K03430J60754N9128m39882o34909l96192l84927
$$ 855111361 855542243 856130660 856706381 856909811 857070565 857129693 856689811 856054902 855658710 855273783
1821.4H55273783k19047M35114O31511J47641j4067J79351k8551j71721J47402K16842
$$ 855273783 855054736 855489850 856121361 856269002 856254935 856434286 856405735 856234014 856381416 856598258
1841.8H56598258j09375j03414m1425l80337m44829k13981l94046n73576k56896k17378
$$ 856598258 856488883 856385469 856344044 855963707 855518878 855304897 854910851 854337275 854080379 853863001
1862.2H53863001n65052m99010k92003m92335l48508J47283M4882l09944j25706j2994
$$ 853863001 853297949 852798939 852506936 852014601 851666093 851813376 851858258 851548314 851422608 851409614
1882.6H51409614l91900n01574n80191j523972k836883m235863o021202o280422k455533
$$ 851409614 851017714 850516140 849935949 848411977 845575094 841339231 835318029 829037607 826582074
1900.9H26582074L434479O355405N479932L500342J806736Q87931P72774M80115k50339
$$ 826582074 830016553 836371958 841851890 845352232 847158968 848046899 848819673 849299788 849049449
1919.3H49049449n22971m63188n05626j65761L79265K51114k49743k90633k48551m26829
$$ 849049449 848526478 848063290 847557664 847391903 847771168 848022282 847772539 847481906 847233355 846806526
1939.7H46806526k04384K18332Q5354j41800j6153j08123m02927l20554k52664n84781
$$ 846806526 846602142 846820474 846905828 846764028 846747875 846639752 846236825 845916271 845663607 845078826
1960.1H45078826o88970m57227m96984n23388j06633P5221j96218k09809r715o1512
$$ 845078826 844389856 843932629 843435645 842912257 842805624 842880845 842684627 842474818 842465103 842403591
1980.5H42403591l3319K01285J24633r4295J2637k9445m28260m91321k75969l28064
$$ 842403591 842370272 842571557 842696190 842601895 842614532 842585087 842156827 841665506 841389537 841061473
2000.9H41061473l25263J6511P8440j70947p9453R7812r6202k19286j26779k78175
$$ 841061473 840736210 840752721 840831161 840660214 840580761 840678573 840582371 840363085 840236306 839958131
2021.3H39958131m49001k72692j76489l46065l06666j33633j65820q2076K01464J58846
$$ 839958131 839509130 839236438 839059949 838713884 838407218 838273585 838107765 838025689 838227153 838385999
2041.7H38385999j16348r9480m8459k29001k27511o1810j94132l51131j80960j27733
$$ 838385999 838269651 838170171 838121712 837892711 837665200 837603390 837409258 837058127 836877167 836749434
2062.1H36749434k97248k43485j37210l07560l57628j63555j79767l05415k13682k14279
$$ 836749434 836452186 836208701 836071491 835763931 835406303 835242748 835062981 834757566 834543884 834329605
2082.5H34329605l67880k04146R8408J02996J11223K99811K14994o3777p3433l8087
$$ 834329605 833961725 833757579 833855987 833958983 834070206 834370017 834585011 834521234 834447801 834409714
2102.9H34409714k08795k16246n1975j50025l00586k00987j73986k43604o6221R1374
$$ 834409714 834200919 833984673 833932698 833782673 833482087 833281100 833107114 832863510 832797289 832888663
2123.3H32888663o5923j62959r0480k16544l77059k41875j63734k74360k04325r5725
$$ 832888663 832822740 832659781 832569301 832352757 831975698 831733823 831570089 831295729 831091404 830995679
2143.7H30995679k39670k85268q6010o6876j66595n1200P689j40727j46091j01924
$$ 830995679 830756009 830470741 830384731 830317855 830151260 830100060 830107749 829967022 829820931 829719007
2164.1H29719007l07202m39704k57849j02461j132K72870L93986J43350m8995m6313
$$ 829719007 829411805 828972101 828714252 828611791 828610659 828883529 829277515 829420865 829371870 829325557
2184.5H29325557j42336k00153l9100J1384j11282q6844m3749j64569j35720L3021
$$ 829325557 829183221 828983068 828943968 828955352 828844070 828757226 828713477 828548908 828413188 828446209
2204.8H28446209n3525k27987j87636k14278l72470l09646j62661k08855j74582R537
$$ 828446209 828392684 828164697 827977061 827762783 827390313 827080667 826918006 826709151 826534569 826544106
2225.2H26544106K563q6009j6630l0518j95503k30670k19941l56972l71993j67906
$$ 826544106 826546669 826460660 826444030 826413512 826218009 825987339 825767398 825410426 825038433 824870527
2245.6H24870527q8215j24574l0100J8597j09733j31011m0769j40369k88427k52962
$$ 824870527 824782312 824657738 824627638 824646235 824536502 824405491 824364722 824224353 823935926 823682964
2266H23682964k71022l90530l54827l11970m08650l06606j848P7129J7762O8962l2365
$$ 823682964 823411942 823021412 822666585 822354615 821945965 821639359 821637511 821714640 821732402 821801364 821768999
2288.5H21768999l54707n08607m59134m74274m93884n00977o78421p61985m17948l7074
$$ 821768999 821414292 820905685 820446551 819972277 819478393 818977416 818298995 817537010 817119062 817081988
2308.9H17081988l3736j48476k55882o17981j025141j060009q87155o68824l11434
$$ 817081988 817048252 816899776 816643894 816025913 815000772 813940763 813053608 812384784 812073350
2327.2H12073350q3387j46508j89960k17438m26948n07236j42872L85463R12369J032471
$$ 812073350 811989963 811843455 811653495 811436057 811009109 810501873 810359001 810744464 811656833 812689304
2347.6H12689304J57655j212776j965404j643538j205206r10997k77043L05832O28948
$$ 812689304 812846959 811634183 809668779 808025241 806820035 805909038 805631995 805937827 806566775
2366H06566775J070201J379848J256108J118898J114369R12487O84977O69181N05030
$$ 806566775 807636976 809016824 810272932 811391830 812506199 813418686 814103663 814772844 815277874
2384.3H15277874P9096j49787j58190k83480l26574j01447O795l8683R4056J52945
$$ 815277874 815356970 815207183 815048993 814765513 814438939 814337492 814344287 814305604 814399660 814552605
2404.7H14552605p8142j57058k9385j15633k06709k2292J5557j67430r6798M8042j20342
$$ 814552605 814474463 814317405 814288020 814172387 813965678 813943386 813958943 813791513 813694715 813742757 813622415
2427.2H13622415k24650j12653k12848l59714k06590j46031l14355k71439j44542k80320
$$ 813622415 813397765 813285112 813072264 812712550 812505960 812359929 812045574 811774135 811629593 811349273
2447.6H11349273l38435j44840j32441k60115j62661j02997k33590j22965J30296N5730
$$ 811349273 811010838 810865998 810733557 810473442 810310781 810207784 809974194 809851229 809981525 810037255
2467.9H10037255j06334n6863j16229k81394j74045n1201k03788k49863j21534k42710
$$ 810037255 809930921 809874058 809757829 809476435 809302390 809251189 809047401 808797538 808676004 808433294
2488.3H08433294m30464l17336k87175m47213k61307J01268J20282O6102J45256j4245
$$ 808433294 808002830 807685494 807398319 806951106 806689799 806791067 806911349 806977451 807122707 807108462
2508.7H07108462k87235k56598j90079l44336l95954l58283n68748p19130m69685j87993
$$ 807108462 806821227 806564629 806374550 806030214 805634260 805275977 804707229 803988099 803518414 803330421
2529.1H03330421k3007K53320L65555J01626r1851j15752l35634n66423m41014k18451
$$ 803330421 803307414 803560734 803926289 804027915 803936064 803820312 803484678 802918255 802477241 802258790
2549.5H02258790j10567J03831K77460J16110m7386J5199p8797k81215j64866K2769
$$ 802258790 802148223 802252054 802529514 802645624 802598238 802613437 802534640 802253425 802088559 802111328
2569.9H02111328l3856m8756o3301m12762o76155l69966L4571J33097K26975K72989
$$ 802111328 802077472 802028716 801965415 801552653 800876498 800506532 800541103 800674200 800901175 801174164
2590.3H01174164K6405j30475n2214j62780l44455k52962k18749l91722l80576l11672
$$ 801174164 801200569 801070094 801017880 800855100 800510645 800257683 800038934 799647212 799266636 798954964
2610.7G98954964n22912p27832p41720q13187q00252l55958K08497M79877O26683P11739
$$ 798954964 798432052 797704220 796962500 796149313 795349061 794993103 795201600 795681477 796308160 797019899
2631.1G97019899N51760L73066L65376K23935m9532j01089q7977k80618m12822l80814
$$ 797019899 797571659 797944725 798310101 798534036 798484504 798383415 798295438 798014820 797601998 797221184
2651.5G97221184m84824o36161o00397o34671q08715p07269l21567K920K47300L84271
$$ 797221184 796736360 796100199 795499802 794865131 794056416 793349147 793027580 793030500 793277800 793662071
2671.9G93662071K02298r0181j37389j35481k77758k72632j01566r3460j45197o9022
$$ 793662071 793864369 793774188 793636799 793501318 793223560 792950928 792849362 792755902 792610705 792541683
2692.3G92541683r3162k45393k73466k70128m00662m75347m18246m72367o21080o18995
$$ 792541683 792448521 792203128 791929662 791659534 791258872 790783525 790365279 789892912 789271832 788652837
2712.7G88652837n65767n73635m31359j81973j38342l08633o11544j072168j070678
$$ 788652837 788087070 787513435 787082076 786900103 786761761 786453128 785841584 784769416 783698738
2731.1G83698738R1016J390278J372278N37276l0637l24428m82380m25458l79145m50552
$$ 783698738 783789754 785180032 786552310 787089586 787058949 786734521 786252141 785826683 785447538 784996986
2751.4G84996986m01616k84970m10676o48677p19190p67648q53240p68483o28114o48558
$$ 784996986 784595370 784310400 783899724 783251047 782531857 781764209 780910969 780142486 779514372 778865814
2771.8G78865814o58512o24537p68125r39370r53495j051784j336634j544595j654565
$$ 778865814 778207302 777582765 776814640 775875270 774921775 773869991 772533357 770988762 769334197
2790.2G69334197j822293j811862j366317o92248M947P72178J389921J550018J441896
$$ 769334197 767511904 765700042 764333725 763641477 763646424 764418602 765808523 767358541 768800437
2808.6G68800437J250267Q48711L93927J24693j34230m68909o25313o97314r84848
$$ 768800437 770050704 770899415 771293342 771418035 771283805 770814896 770189583 769492269 768507421
2826.9G68507421j249015j280487j362502j506627j445472j451433j721978j804710
$$ 768507421 767258406 765977919 764615417 763108790 761663318 760211885 758489907 756685197
2843.2G56685197j677632j724482j733779j395047j076937j056671j071453j192749
$$ 756685197 755007565 753283083 751549304 750154257 749077320 748020649 746949196 745756447
2859.5G45756447j562595j550853n39601J284599L200591M162431L516256J962841
$$ 745756447 744193852 742642999 742103398 743387997 746588588 750751019 754267275 756230116
2875.9G56230116O67632k21789j029253j555145j661718j636505j481593j004278m80831
$$ 756230116 756897748 756675959 755646706 754091561 752429843 750793338 749311745 748307467 747826636
2894.2G47826636k61009j79946j09852k45690m93407p75159j459300k572894l782273
$$ 747826636 747565627 747385681 747275829 747030139 746536732 745761573 744302273 741729379 737947106
2912.6G37947106m917264n120873k930105J236201M444479M649342K936005J244843
$$ 737947106 733029842 727908969 724978864 726215065 730659544 735308886 738244891 739489734
2928.9G39489734J80781o07669j972616m667938q273899j0404647p405579R59575Q665502
$$ 739489734 739670515 739062846 737090230 732422292 724148393 713743746 706338167 707297742 715963244
2947.2G15963244J0254324P097304L212154J53064k297043m353226n798578n796850
$$ 715963244 726217568 733314872 736527026 736680090 734383047 730029821 724231243 718434393
2963.6G18434393l347158J010060M854322O330251N676091M022718K306699J121045
$$ 718434393 715087235 716097295 720951617 727281868 732957959 736980677 739287376 740408421
2979.9G40408421M78804R6202j66297l84629o82891j113236j476049j474857j020074
$$ 740408421 740887225 740983427 740817130 740432501 739749610 738636374 737160325 735685468 734665394
2998.2G34665394j37329R36925J556277J359702P00891K5630m35114n57781n38289
$$ 734665394 734528065 735464990 737021267 738380969 739081860 739107490 738672376 738114595 737576306
3016.6G37576306p77424j305639j879335k491772l174126l663659l687024l074706
$$ 737576306 736798882 735493243 733613908 731122136 727948010 724284351 720597327 717522621
3032.9G17522621j921356j005351j032591j601636j694799j032472l98755m18245r40800
$$ 717522621 715601265 714595914 713563323 711961687 710266888 709234416 708835661 708417416 707476616
3051.3G07476616j592815k077460k300144k308964k087772j596391r04024j29044P71284
$$ 707476616 705883801 703806341 701506197 699197233 697109461 695513070 694609046 694480002 695251286
3069.6F95251286J822054K748669L291726L439843L195286K665103K085209J518011
$$ 695251286 697073340 699822009 703113735 706553578 709748864 712413967 714499176 716017187
3085.9G16017187R57667L83020l37184j221716k154529l059745l814161m004061l260612
$$ 716017187 716974854 717357874 717020690 715798974 713644445 710584700 706770539 702766478 699505866
3104.3F99505866k136231j801073k548516l531039m106402m310906m055918l162503
$$ 699505866 697369635 695568562 693020046 689489007 685382605 681071699 677015781 673853278
3120.6F73853278j664758L47496K443909L990472M691123M684508M246593L571868
$$ 673853278 672188520 672536016 674979925 678970397 683661520 688346028 692592621 696164489
3136.9F96164489K762496J872778J075268N00143J11639j70350n10633j034319j563728
$$ 696164489 698926985 700799763 701875031 702375174 702486813 702316463 701805830 700771511 699207783
3155.3F99207783j870096k011836k133369k356231k662599k927184l186405l477633
$$ 699207783 697337687 695325851 693192482 690836251 688173652 685246468 682060063 678582430
3171.6F78582430l717482l869534l966927l930569l615499k999722k124966r72628
$$ 678582430 674864948 670995414 667028487 663097918 659482419 656482697 654357731 653385103
3187.9F53385103L53515J604319K602279L141463L060638K526641J841665J065194
$$ 653385103 653738618 655342937 657945216 661086679 664147317 666673958 668515623 669580817
3204.2F69580817K56837m03941r35674j397788j697541j872062k077937k277017k414882
$$ 669580817 669837654 669433713 668498039 667100251 665402710 663530648 661452711 659175694 656760812
3222.6F56760812k652049l025949l377915l717124m161596m660249n011380n156159
$$ 656760812 654108763 651082814 647704899 643987775 639826179 635165930 630154550 624998391
3238.9F24998391n191446n119204m943371m688799m294992l619969k579391j292765
$$ 624998391 619806945 614687741 609744370 605055571 600760579 597140610 594561219 593268454
3255.2E93268454j8239R67979J393736J099586J81675j001715k017081k743483l167867
$$ 593268454 593250215 594218194 595611930 596711516 596893191 595891476 593874395 591130912 587963045
3273.6E87963045l278017l323019l495574l738701l863335l687322l083527k006471
$$ 587963045 584685028 581362009 577866435 574127734 570264399 566577077 563493550 561487079
3289.9E61487079o65248P19011K123118L439605M543066N455136O105304O307006O132900
$$ 561487079 560821831 561540842 563663960 567103565 571646631 577101767 583207071 589514077 595646977
3308.2E95646977N904556N723119N408883M883229M195452L484428L091931L162384
$$ 595646977 601551533 607274652 612683535 617566764 621762216 625246644 628338575 631500959
3324.6F31500959L430188L601790L550887L264784K850056K433717K026678J618266
$$ 631500959 634931147 638532937 642083824 645348608 648198664 650632381 652659059 654277325
3340.9F54277325J236379Q85665N76556L19838K4081l52621o53148p77125q58665j093447
$$ 654277325 655513704 656399369 656975925 657295763 657319844 656967223 656314075 655536950 654678285 653584838
3361.3F53584838j356423j354039j272082j493156j864731j972735j828671j710474
$$ 653584838 652228415 650874376 649602294 648109138 646244407 644271672 642443001 640732527
3377.6F40732527j654446j600325j541794j423716j218617j019895j066685j325548
$$ 640732527 639078081 637477756 635935962 634512246 633293629 632273734 631207049 629881501
3393.9F29881501j351237r99868p49111j059592j475751j302183r12011q64267r75847
$$ 629881501 628530264 627530396 626781285 625721693 624245942 622943759 622031748 621167481 620191634
3412.3F20191634j026810j011013q54850o72996o17922n21838l01242j52648j93417
$$ 620191634 619164824 618153811 617298961 616625965 616008043 615486205 615184963 615032315 614838898
3430.6F14838898j62720K4914k38k00272j63078J32739M13180N04076M70937N12361
$$ 614838898 614676178 614701092 614700854 614500582 614337504 614470243 614883423 615387499 615858436 616370797
3451F16370797O38426P46250Q59260R55165R04560R05692J174212J334667R96172N29886
$$ 616370797 617009223 617755473 618614733 619569898 620474458 621380150 622554362 623889029 624885201 625415087
3471.4F25415087N42879Q83698J161099J196921R59456Q70168J033723J047552R76443
$$ 625415087 625957966 626841664 628002763 629199684 630159140 631029308 632063031 633110583 634087026
3489.8F34087026J039565J141190J196981J145541J126111J208246J124620J029790
$$ 634087026 635126591 636267781 637464762 638610303 639736414 640944660 642069280 643099070
3506.1F43099070J165866J316965J397133J383662J307309J340866J478493J594007
$$ 643099070 644264936 645581901 646979034 648362696 649670005 651010871 652489364 654083371
3522.4F54083371J465261J204074J189291J381576J581371J703560J588702J394809
$$ 654083371 655548632 656752706 657941997 659323573 660904944 662608504 664197206 665592015
3538.7F65592015J524031J772404J730323J424610J274943J404942J476645J437485
$$ 665592015 667116046 668888450 670618773 672043383 673318326 674723268 676199913 677637398
3555F77637398J498640J669824J720726J596272J559616J691758J746059J673579J715124
$$ 677637398 679136038 680805862 682526588 684122860 685682476 687374234 689120293 690793872 692508996
3573.4F92508996J889884J976311K019048K134919K237201K216279K006889J872360
$$ 692508996 694398880 696375191 698394239 700529158 702766359 704982638 706989527 708861887
3589.7G08861887J955390K032102K062261K143800K180338K067685J947343J920760
$$ 708861887 710817277 712849379 714911640 717055440 719235778 721303463 723250806 725171566
3606G25171566J957178J960993J912415J855195J759886J692772J635909J474560J371026
$$ 725171566 727128744 729089737 731002152 732857347 734617233 736310005 737945914 739420474 740791500
3624.4G40791500J432716J478196J292169J112759J108646J080215R78530R25243R42528
$$ 740791500 742224216 743702412 744994581 746107340 747215986 748296201 749274731 750199974 751142502
3642.7G51142502R55105R50217Q86202N43654K29239L04759N15103N39363L43024J76966
$$ 751142502 752097607 753047824 753934026 754477680 754706919 755011678 755526781 756066144 756409168 756586134
3663.1G56586134K09928K71618J61887l5763j22249k78712l41594j36077J12235M33326
$$ 756586134 756796062 757067680 757229567 757193804 757071555 756792843 756451249 756315172 756427407 756860733
3683.5G56860733P34568Q52406N06699O1273J26839L09527L40402K78294J29223P2837
$$ 756860733 757595301 758447707 758954406 759015679 759142518 759452045 759792447 760070741 760199964 760272801
3703.9G60272801K03013L00467K41578L8922q8811n0187r895l6299j10686j32262p8559
$$ 760272801 760475814 760776281 761017859 761056781 760967970 760917783 760907888 760871589 760760903 760628641 760550082
3726.4G60550082J5974J48892K38776J16229r6619j22904m2379o8963k13265j08660
$$ 760550082 760566056 760714948 760953724 761069953 760973334 760850430 760808051 760739088 760525823 760417163
3746.7G60417163J9431j47104j92106l3557p331j09613j28210m2498l4869n6743r7215
$$ 760417163 760436594 760289490 760097384 760063827 760056496 759946883 759818673 759776175 759741306 759684563 759587348
3769.2G59587348j99140j64866J2636J20700j3352k23875k42770j64985q1659n2929
$$ 759587348 759388208 759223342 759235978 759356678 759343326 759119451 758876681 758711696 758630037 758577108
3789.6G58577108o2525R000M5062l0876j33037k63214k33412j82033k63035j96874
$$ 758577108 758514583 758523583 758568645 758537769 758404732 758141518 757908106 757726073 757463038 757266164
3810G57266164p7903r8765j71423o5625k6405j92106j74522j38283j63853j00136j7404
$$ 757266164 757188261 757089496 756918073 756852448 756826043 756633937 756459415 756321132 756157279 756057143 756039739
3832.4G56039739P7724K4796k52486l14712j52469j18613j60635q6248j5854k97189
$$ 756039739 756117463 756142259 755889773 755575061 755422592 755303979 755143344 755057096 755041242 754744053
3852.8G54744053m99964j16885J05918N5969n6208r2506o1452j63436k81036k55108
$$ 754744053 754244089 754127204 754233122 754289091 754232883 754140377 754078925 753915489 753634453 753379345
3873.2G53379345k11239r2983j9193l0219J4305j24336l01003j96576j42634j67847
$$ 753379345 753168106 753075123 753055930 753025711 753040016 752915680 752614677 752418101 752275467 752107620
3893.6G52107620n3465K0087l9876j13785j44661j68800j72853j01269q762l576p2002
$$ 752107620 752054155 752074242 752034366 751920581 751775920 751607120 751434267 751332998 751324236 751320660 751248658
3916G51248658j34945j59979j76787k13624k06649j23262n2929m1843o1631p3135o2525
$$ 751248658 751113713 750953734 750776947 750563323 750356674 750233412 750180483 750138640 750077009 750003874 749941349
3938.5G49941349o1691j09017j13964l9696m9949j23382j18255q9884n9486j0311j9670
$$ 749941349 749879658 749770641 749656677 749616981 749567032 749443650 749325395 749235511 749176025 749165714 749146044
3960.9G49146044j02103j27494n1856j3828l2425j2457j3769j01745j59025r4772k6822
$$ 749146044 749043941 748916447 748864591 748850763 748818338 748805881 748792112 748690367 748531342 748436570 748409748
3983.3G48409748q4340j37151j21712j46926j58787j22308r2686
$$ 748409748 748325408 748188257 748066545 747919619 747760832 747638524 747545838
3997.6G47545838
$$ 747545838
##END=$$ End of the data block
