##TITLE=Ref 1006 CC P $$ Begin of the data block
##JCAMP-DX=5.00 $$ ACD/SpecManager v 10.08
##SPECTROMETER/DATA SYSTEM=Alpha
##DATE=12 Jun 2015 09:06:34
##DATA TYPE=INFRARED SPECTRUM
##DATA CLASS=XYDATA
##ORIGIN=
##OWNER=
##NPOINTS=1667
##FIRSTX=599.57470703
##LASTX=3997.16503906
##MAXX=3997.16503906
##MINX=599.57470703
##MAXY=0.98373938
##MINY=0.82789922
##XFACTOR=1.0000000000
##YFACTOR=1.000000000000000e-9
##FIRSTY=0.90853202
##DELTAX=2.03937006
##XUNITS=1/CM
##YUNITS=ARBITRARY UNITS
##XYDATA=(X++(Y..Y))
599.6I08532023m54723m06206k34783k71618p2122N44846Q36075N78403Q4460j9252
620I09117103J56819j15692m25577m40896l55184l5703M20213N10215M09901J00375
640.4I09341574o85990j001716n54025k26319k40624k33173l69787n47648m62055n44548
660.8I04475689o76394o22510p31230p52092m55439m60267o52909q29399q38160n71966
681.1H97885323l48330n02825r60529j554906j932979j890540j746833j932561k395750
699.5H84620070k468287k335251k613366l163814l778517m588485o348133r028912
715.8H50295305j0534107q628190l233790M486620J2754381J8373370K0080686J9699811
732.1I03294086J8253565J5136063J0375202N545974J899898n42998j843930k104520
$$ y = [908532023, 908077300, 907671094, 907436311, 907164693, 907092571, 907637417, 908473492, 909051895, 909136355, 909117103, 909273922, 909158230, 908732653, 908291757, 907936573, 907900870, 908321083, 908831298, 909241199, 909341574, 908655584, 907653868, 907099843, 906873524, 906632900, 906399727, 906029940, 905482292, 905020237, 904475689, 903799295, 903176785, 902445555, 901693463, 901238024, 900777757, 900124848, 899295449, 898457289, 897885323, 897536993, 897034168, 896073639, 894518733, 892585754, 890695214, 888948381, 887015820, 884620070, 882151783, 879816532, 877203166, 874039352, 870260835, 865672350, 859324217, 850295305, 839761198, 831133008, 827899218, 832385838, 845140219, 863513589, 883594275, 903294086, 921547651, 936683714, 947058916, 952604890, 954504788, 953961790, 952117860, 950013340]
748.4I50013340k027214j744151j232565j078486j155496j184106j269877j166403
764.8I39155042j026392j088202j023650j088679j410663j419604j289248j520753
781.1I29287851j808643j791955j647532j451134r44257n6684P43389Q82805M92453
799.4I23706293P868m87149n00858m0352k0981k53439j48892k4796j47760l99828m77016
821.9I21213090l11672k63751m04537o48677q36253q49128p29561p21395j174450j375615
842.3I13898051p40111K88606J419544K146959K036989J420796P17103J77980k65897
860.6I21100020j102447k415776l839910m566729k020717M232705Q175134O370783
876.9I25933063L102064J538873Q75294K02835l08693m40120m79281o91533p75576
$$ y = [950013340, 947986126, 946241975, 945009410, 943930924, 942775428, 941591322, 940321445, 939155042, 938128650, 937040448, 936016798, 934928119, 933517456, 932097852, 930808604, 929287851, 927479208, 925687253, 924039721, 922588587, 921644330, 921587646, 922331035, 923213840, 923706293, 923714161, 923227012, 922726154, 922685802, 922664821, 922411382, 922262490, 922237694, 922089934, 921690106, 921213090, 920901418, 920637667, 920233130, 919584453, 918748200, 917899072, 917169511, 916448116, 915273666, 913898051, 913157940, 913446546, 914866090, 917013049, 919050038, 920470834, 921187937, 921365917, 921100020, 919997573, 917581797, 913741887, 909175158, 907154441, 911387146, 919562280, 925933063, 929035127, 930574000, 931449294, 931652129, 931343436, 930903316, 930424035, 929732502, 928956926]
895.3I28956926l43561J67787K86162R4950j55032k21550j41263j70827l70026n96821
915.7I27506745p17044p59363q10087p90238p28667o81341o34074o08742n86391n97954
936.1I20592844o40749o13988n24759m57406m70102o20008p29262p88451j039505j244247
956.5I13464367j240909j274168j286686j158654q17895O5148J420915K540648K711296
974.8I14424062J975178R82106O140q56042j306713j330733j168430j129270j472235
993.2I10124063j929700k185702k396226k592683k750516l017187l423095m111945
1009.5H87717009m851520l949643j17063M805207P919252R362996J0259151Q582592
1025.8I19727981L442168j480221l539920l541708k873063k263308j765311j338362
$$ y = [928956926, 928613365, 928781152, 929067314, 929162264, 929007232, 928785682, 928644419, 928473592, 928103566, 927506745, 926789701, 926030338, 925220251, 924430013, 923701346, 923020005, 922385931, 921777189, 921190798, 920592844, 919952095, 919338107, 918813348, 918355942, 917885840, 917265832, 916536570, 915748119, 914708614, 913464367, 912223458, 910949290, 909662604, 908503950, 907686055, 907751203, 909172118, 911712766, 914424062, 916399240, 917381346, 917387486, 916531444, 915224731, 913893998, 912725568, 911596298, 910124063, 908194363, 906008661, 903612435, 901019752, 898269236, 895252049, 891828954, 887717009, 882865489, 878915846, 878798783, 883603990, 891523242, 900886238, 911145389, 919727981, 923170149, 921689928, 918150008, 914608300, 911735237, 909471929, 907706618, 906368256]
1042.1I06368256j025021p51853p00772r57966j286984j579463j891852k364814k809644
1060.5H92999887k918183k966643l085077l018379k815485k642810k561987k493679
1076.8H70497644k138674j482129q04723k12013J27136K50697N37813J082242J801610
1095.1H69659603K607464L325463L910959M337132M401624L967464L195464K386093
1111.5H97791266J495362N87523M07815J282155K583623L820121M870475N654037O211400
1129.8I24703777O422341O101787N322993M343986L435612K640903J840889J016081
1146.1I55828369K85923k47598n46097p52628j016855j163841j210689j389086j574219
1164.5I48213279j681089j780927j686335j341879j049757r19342q84354r97723j252055
$$ y = [906368256, 905343235, 904591382, 903890610, 902932644, 901645660, 900066197, 898174345, 895809531, 892999887, 890081704, 887115061, 884029984, 881011605, 878196120, 875553310, 872991323, 870497644, 868358970, 866876841, 866072118, 865860105, 865987241, 866237938, 866775751, 867857993, 869659603, 872267067, 875592530, 879503489, 883840621, 888242245, 892209709, 895405173, 897791266, 899286628, 899874151, 900281966, 901564121, 904147744, 907967865, 912838340, 918492377, 924703777, 931126118, 937227905, 942550898, 946894884, 950330496, 952971399, 954812288, 955828369, 956114292, 955866694, 955320597, 954567969, 953551114, 952387273, 951176584, 949787498, 948213279, 946532190, 944751263, 943064928, 941723049, 940673292, 939753950, 938869596, 937871873, 936619818]
1182.8I36619818j668572k202034k655030k948462k979339k777218k602876k622187
1199.2I16164100k837896l006101k960503k854884k843976k914071k982616l153384
1215.5H92610669l334641l118158k636194k416730k579152k787054k682567k240538
1231.8H70815635j531780n43416O32763J789153K715111L431678M021287M336237M285992
1250.1H89952660L898441L197074K456844K193809K644777L530920M375755M885972
1266.5I17136252M972696M662574M180669L687263L233075K982974K833307K710819
1282.8I46399629K668321K528072K355456K416909K588570K517164K262473K048671
1299.1I65785265J743913J309395R05215O52433N91755M93824K71678Q2374j40548
$$ y = [936619818, 934951246, 932749212, 930094182, 927145720, 924166381, 921389163, 918786287, 916164100, 913326204, 910320103, 907359600, 904504716, 901660740, 898746669, 895764053, 892610669, 889276028, 886157870, 883521676, 881104946, 878525794, 875738740, 873056173, 870815635, 869283855, 868740439, 869373202, 871162355, 873877466, 877309144, 881330431, 885666668, 889952660, 893851101, 897048175, 899505019, 901698828, 904343605, 907874525, 912250280, 917136252, 922108948, 926771522, 930952191, 934639454, 937872529, 940855503, 943688810, 946399629, 949067950, 951596022, 953951478, 956368387, 958956957, 961474121, 963736594, 965785265, 967529178, 968838573, 969743788, 970396221, 970987976, 971481800, 971753478, 971835852, 971695304]
1317.4I71695304m05908n66482p24674j164734k070248l424644n048156o364227o203234
1335.8I45722997l643334R53198N284905P122874O547571M652500K637088J161993
1352.1I70439792K75790j90973n26428r38237j238644j109898q41379o25372l25382
1370.5I64919269j29819n8472q8274k97428n12719n59211m95553l04818m291j15335
1390.9I62353349o99461j246691j554489j905501k327501k842367k915800j387596
1407.2I47473943J427949M364013N848408N027831L184199J755536P06076p8022m37558
1425.5I69272375o51479q34107q09372q64446r83298o37769k28763k87473m41670n09024
1445.9I63024974m77255l02016k16365l47078l38793K52903M73499M6253l91721o69182
$$ y = [971695304, 971289396, 970722914, 969998240, 968833506, 966763258, 963338614, 958290458, 951926231, 945722997, 942079663, 943032861, 948317766, 955440640, 961988211, 966640711, 969277799, 970439792, 970715582, 970524609, 969998181, 969059944, 967821300, 966711402, 965870023, 965244651, 964919269, 964789450, 964730978, 964642704, 964345276, 963832557, 963273346, 962777793, 962472975, 962468684, 962353349, 961653888, 960407197, 958852708, 956947207, 954619706, 951777339, 948861539, 947473943, 948901892, 953265905, 959114313, 964142144, 967326343, 969081879, 969787955, 969709933, 969272375, 968620896, 967786789, 966977417, 966112971, 965129673, 964491904, 964263141, 963975668, 963533998, 963024974, 962547719, 962245703, 962029338, 961682260, 961343467, 961596370, 962069869, 962116122, 961724401, 961055219]
1466.3I61055219p26104l41177Q79586J888096J538337Q89241M94481K23577j03534
1484.7I65797722m51326n30183k58029k44796p26223j428127j921475k012074j731813
1503I56493676n61357K293348L239751J553655K17676m87268n27918l26753k46405
1521.4I61648405q2255k9206K0921P5400j28865k26438j44720l72351o67989l51548
1541.8I59741354K503O8486q285j16229j40846k74479m58479n02408k6583K03967j00732
1564.2I58388269l80099n24580m68254m03941n32270m00483J20640M18543N00799L18586
1584.6I57037210j7762j61946j53243k38717l32713l33786l39329l43502l54707m08411
1605I54353094m46379l19481j53601j71900k56061r8646M2677k10703m44770m11987
$$ y = [961055219, 960329115, 959987938, 960867524, 962755620, 964293957, 965183198, 965677679, 965901256, 965797722, 965346396, 964816213, 964558184, 964313388, 963587165, 962159038, 960237563, 958225489, 956493676, 955932319, 958225667, 961465418, 963019073, 963236749, 962749481, 962221563, 961894810, 961648405, 961566150, 961536944, 961557865, 961633265, 961504400, 961277962, 961133242, 960760891, 960092902, 959741354, 959743857, 959812343, 959804058, 959687829, 959546983, 959272504, 958814025, 958311617, 958285034, 958489001, 958388269, 958008170, 957483590, 957015336, 956611395, 956079125, 955678642, 955799282, 956217825, 956718624, 957037210, 957019448, 956857502, 956704259, 956465542, 956132829, 955799043, 955459714, 955116212, 954761505, 954353094, 953906715, 953587234, 953433633, 953261733, 953005672, 952907026, 952949703, 952739000, 952294230, 951882243]
1625.4I51882243l36766l46840m29809o17206o96480m01199j75953k74420o01172q60929
1645.8I47141469o24598l44693p76947j058459m06325l55780p54476j083910j109064
1664.1I40627217j054167j161695j164138j042724j240432j401425j395285j426518
1680.5I30740833j458108j496852j455366j806498k411127k848387l550887m064917
1696.8I11648691m132808m690706l884077l145814k923608j831591m55678J239836
1713.1H91824245L561557O728053Q106530O751179O235659O347120O096065N878330
1729.4I41528738N574047O341279O888926N269885M607975M376173L404260K381742
1745.7I80373025J434386Q59737O75082L97146n5373l31580l85344l49582k65598m66227
$$ y = [951882243, 951545477, 951198637, 950768828, 950151622, 949455142, 949053943, 948877990, 948603570, 948002398, 947141469, 946516871, 946172178, 945395231, 944336772, 943930447, 943574667, 942820191, 941736281, 940627217, 939573050, 938411355, 937247217, 936204493, 934964061, 933562636, 932167351, 930740833, 929282725, 927785873, 926330507, 924524009, 922112882, 919264495, 915713608, 911648691, 907515883, 902825177, 898941100, 895795286, 892871678, 891040087, 890584409, 891824245, 895385802, 902113855, 910220385, 916971564, 923207223, 929554343, 935650408, 941528738, 947102785, 953444064, 960332990, 965602875, 970210850, 974587023, 977991283, 980373025, 981807411, 982667148, 983342230, 983739376, 983684003, 983352423, 982967079, 982617497, 982351899, 981885672]
1766.1I81885672o64533o06298n17309l54945k47181l44097m05133l76106l68058l12627
1786.5I77689385l60131m48346l13342j76489k86758l76642l13162j68026j36077k37525
1806.9I74872887k66611k21134j30653j22786j92046j92344k15352k77042j43111L040
1827.3I73114848n6803K0921R7633m3750j61529j52409j98007k37882n9843O8009n424
1849.7I72385764p8916q8990j09434j08362m8875l279j08540l23116l76285q4579J67788
1872.2I71223176P9631n8174r8884j12355j58071j92583j68204j46926q9049p3373
1892.6I70205188j06275p4685p2658n3227j3471n8651j10089j44303j00255o6936j78039
1915I69226599k11358j12057r9838p8499M6551M4346q6188j66417j23918n0187r4354
$$ y = [981885672, 981221139, 980614841, 980097532, 979742587, 979495406, 979151309, 978746176, 978370070, 978002012, 977689385, 977329254, 976880908, 976567566, 976391077, 976104319, 975727677, 975414515, 975246489, 975110412, 974872887, 974606276, 974385142, 974254489, 974131703, 973939657, 973747313, 973531961, 973254919, 973111808, 973114848, 973058045, 973078966, 973176599, 973132849, 972971320, 972818911, 972620904, 972383022, 972323179, 972391188, 972385764, 972306848, 972217858, 972108424, 972000062, 971951187, 971947908, 971839368, 971516252, 971139967, 971055388, 971223176, 971302807, 971244633, 971145749, 971033394, 970875323, 970682740, 970514536, 970367610, 970278561, 970205188, 970098913, 970024228, 969951570, 969898343, 969884872, 969826221, 969716132, 969571829, 969471574, 969404638, 969226599, 969015241, 968903184, 968803346, 968724847, 968771398, 968815744, 968729556, 968563139, 968439221, 968389034, 968294680]
1937.4I68294680j98364k00749n4121n9j20759j73390r5844L039L7253j0073p5579
1959.9I67406034l2365R2447J21534J09196J50024J06931j6987n9843n3525o8128m2439
1982.3I67712879l457k1934n6982p8559n0307J2815L3558K3901m3869j13725q2195
2004.7I67332125j0371L7610p629j31369j69516r1552r120L8505M9472R53o4552o4909
2029.2I66909647L58K7120O437o437p3552j06037n8472q4102j12951n6625m410o0618
2053.7I66380358j18077n4061J0728J1862j0491K0087l219j56879k00450j02997l5048
2076.1I65741813L7968R0838l5286j37985j5676J02937R0242J5855r3639j53244p6651
2098.5I65567172m590k5153L3676J23799K6763j09554n7876M4227M7386N5849L9697
$$ y = [968294680, 968096316, 967895567, 967841446, 967841387, 967720628, 967547238, 967451394, 967454433, 967491686, 967481613, 967406034, 967373669, 967466116, 967587650, 967696846, 967846870, 967953801, 967936814, 967876971, 967823446, 967755318, 967712879, 967709422, 967687488, 967630506, 967551947, 967501640, 967514455, 967548013, 967571914, 967528045, 967414320, 967332125, 967321754, 967359364, 967351735, 967220366, 967050850, 966959298, 966950178, 966988683, 967038155, 967039108, 966974556, 966909647, 966910005, 966937125, 966943562, 966937125, 966863573, 966757536, 966699064, 966614962, 966502011, 966445386, 966440976, 966380358, 966262281, 966208220, 966218948, 966230810, 966220319, 966240406, 966237187, 966080308, 965879858, 965776861, 965741813, 965779781, 965870619, 965835333, 965697348, 965681672, 965784609, 965874851, 965890706, 965797067, 965643823, 965567172, 965562582, 965537429, 965571105, 965694904, 965721667, 965612113, 965554237, 965598464, 965645850, 965701699, 965741396]
2121I65741396m5896n7041N603L3378l5405j14679m9591O6220M6432k6762l1829l7193
2145.4I65494633m0114J728O1751R2983N5969n0664j61708j13248P3552J51574O8665
2167.9I65635121m7922r3639n5134l8982m2200P689J3888k0743J7882L0100K563j9491
2192.3I65389132p5578q1778m8160l7194o0618n9485L6895R4533j4126j37627p7784
2214.8I64928210M2259P8500N9962k1577m9472J4067n1200j42932l8743N8949l0160
2237.2I64847863j47105j03116O199K4081K4437N3764M7266L7372M4585l875q6128
2259.6I64745343p5579q047j5020k6226j2696q404K6584J6808l3975m5537o5685n9545
2284.1I64438021J0550N7340O5982L1173q0645j69515q3447O2287N9784j8776p4446
$$ y = [965741396, 965695500, 965638459, 965644062, 965677440, 965642035, 965527356, 965477765, 965543985, 965590417, 965563655, 965531826, 965494633, 965454519, 965456247, 965517998, 965610981, 965666950, 965616286, 965454578, 965341330, 965414882, 965566456, 965635121, 965587199, 965493560, 965438426, 965399444, 965357244, 965364933, 965378821, 965358078, 965375960, 965406060, 965408623, 965389132, 965313554, 965231776, 965183616, 965146422, 965085804, 965026319, 965063214, 965157747, 965143621, 965005994, 964928210, 964970469, 965048969, 965108931, 965087354, 965037882, 965051949, 965000749, 964857817, 964819074, 964878023, 964847863, 964700758, 964597642, 964603841, 964627922, 964652359, 964706123, 964753389, 964790761, 964835346, 964831471, 964745343, 964669764, 964661717, 964646697, 964620471, 964607775, 964599371, 964625955, 964642763, 964608788, 964563251, 964497566, 964438021, 964448571, 964505911, 964571893, 964603066, 964522421, 964352906, 964269459, 964331746, 964391530, 964372754, 964298308]
2306.5I64298308j02997m7445O2287O3181j6213m5061o1095q5473j06096j05679m1485
2329I63812232M8578O3598J06752J47283r954j59740j48774p2121j2160m887L7193
2351.4I63808000J65045K65360K33054J06573k2709j40726j82510j45912j90675j59264
2371.8I63736236K6047N2393l3379N3108R3520j908N9247J67728J09255j550r2923
2394.2I64167774j31905l5584N0544O3599P5399O080p2539r0241l2246J20818J38760
2416.7I64260459m8518j36197o7890l7789k5749O0916J10805K5153q0705j02222o139
2439.1I63952124O5625J3053J0550O5804N8293k2590q6844n4181N126J0252j7881m2677
2463.6I63956654q166M9532N0962p332j14917j64867j04904r477M1663N5373P4685
$$ y = [964298308, 964195311, 964147866, 964210153, 964273334, 964257121, 964212060, 964150965, 964065492, 963959396, 963853717, 963812232, 963860810, 963924408, 964031160, 964178443, 964168489, 964008749, 963859975, 963787854, 963775694, 963770807, 963808000, 963973045, 964238405, 964471459, 964578032, 964555323, 964414597, 964232087, 964086175, 963895500, 963736236, 963762283, 963814676, 963781297, 963834405, 963927925, 963926017, 963985264, 964152992, 964262247, 964260697, 964167774, 964035869, 964000285, 964050829, 964114428, 964189827, 964195907, 964123368, 964033127, 964000881, 964121699, 964260459, 964211941, 964075744, 964007854, 963970065, 963944316, 964005232, 964116037, 964141190, 964060485, 963958263, 963952124, 964017749, 964030802, 964041352, 964107156, 964165449, 964142859, 964056015, 964001834, 964006960, 964017212, 963999331, 963956654, 963948488, 963998020, 964048982, 964041650, 963926733, 963761866, 963656962, 963647485, 963689148, 963744521, 963819206]
2486I63819206N9545M8518K2352q4222j56581j19448k8789K6942p213R835R0540o676
2510.5I63674009j10328L7133J27673K504p9572m9889j550K6464J2219j1265M7743
2532.9I63675141P9990k8730q2016k1338N960Q107J251n9366q4877p0095m6313L1233
2557.4I63408947N8949P451J5437Q0645L2187n5492m1664k0802K4617J02281J04845
2579.8I63717401J4126j01566j29700m4346l57m1783k4498N8651R6977P4387L7133
2602.2I63656425k9265j03951o6519M4763j9490j54674o4373P1764P2479P1525M8399
2624.7I63527083l9041l9756J6332J5259k0504j7941M2915M2975j2100k1279k9325
2647.1I63464618n2095k9921o616k0981n3227l1889R8527J28448o259o3598j8179L6120
$$ y = [963819206, 963878751, 963927269, 963949621, 963865399, 963708818, 963589370, 963560581, 963587523, 963580310, 963590145, 963680685, 963674009, 963563681, 963600814, 963728487, 963730991, 963651419, 963601530, 963599980, 963626444, 963638663, 963627398, 963675141, 963755131, 963726401, 963644385, 963623047, 963629007, 963637114, 963638365, 963578999, 963494122, 963424027, 963377714, 963408947, 963467896, 963475347, 963490784, 963571429, 963603616, 963548124, 963506460, 963485658, 963510275, 963612556, 963717401, 963731527, 963629961, 963500261, 963455915, 963455558, 963413775, 963389277, 963447928, 963544905, 963619292, 963656425, 963627160, 963523209, 963456690, 963501453, 963481963, 963327289, 963262916, 963334680, 963407159, 963478684, 963527083, 963488042, 963448286, 963464618, 963479877, 963459373, 963441432, 963484347, 963527322, 963515222, 963493943, 963464618, 963412523, 963382602, 963375986, 963355005, 963301778, 963269889, 963368416, 963496864, 963490605, 963427007, 963408828, 963444948]
2671.6I63444948O6638k1457j02401m6253j7584l4928l3736k3961k2769m8161m7803
2694I63112533N066Q4281J10865L4452q3387j52290j11878j2159K4676Q404J2815k1040
2718.5I63012338r6023q4937P808P5102N7042r54K384j5020r1613p2300O3658J44064
2743I63001549K7955o6519J5497K9326n3168m8220j5616j6511J8061K1040j848L1710
2767.4I62943256N841p9155r9420p7725n6624q1420o5327M6194P6592L576q0884o0021
2791.9I62474883M9829L2544q4221j18256m6789p213n3763n9664k921n185o9797p9394
2816.4I62030053q4996j39833r5605j9491p4566j44839j41620j22250j80661k78712
2836.8I60747480k68757k78532l81351m42803m30286l63111k83003m8518L94404O75797
$$ y = [963444948, 963511586, 963490129, 963387728, 963341475, 963323891, 963288963, 963255227, 963231266, 963208497, 963160336, 963112533, 963117599, 963201880, 963312745, 963347197, 963263810, 963111520, 962999642, 962987483, 963012159, 963020563, 963033378, 963012338, 962916315, 962831378, 962839186, 962914288, 962971330, 962970376, 962972760, 962957740, 962866127, 962793827, 962857485, 963001549, 963029504, 962962985, 962978482, 963007808, 962954640, 962906420, 962890804, 962874293, 962892354, 962913394, 962911546, 962943256, 962949097, 962869942, 962770522, 962692797, 962636173, 962554753, 962489426, 962535620, 962612212, 962615788, 962534904, 962474883, 962524712, 962557256, 962473035, 962354779, 962307990, 962300777, 962247014, 962187350, 962184429, 962179244, 962109447, 962030053, 961945057, 961805224, 961709619, 961690128, 961615562, 961470723, 961329103, 961206853, 961026192, 960747480, 960478723, 960200191, 959818840, 959376037, 958945751, 958582640, 958299637, 958251119, 958645523, 959321320]
2857.2I59321320N75185K61903K8968p75n8830j13905J02401K48432P9632k9683J7285
2879.6I60431933L9757n5909k44320k41876L577L8802k07305l51309m02213m63962
2900I58547175l26455n8829K6822q1063k32696k61843j79708k75195m24147k20716
2920.4I56513345K22564N51999N68568L74437L33607M29094M31895L97801K78771Q4281
2940.8I60186362L9220P7784m589j96457k83778k17438j73211j17838j8835P7188J72317
2963.2I59540725K17437L19601M99546N44191M92990N16593N13196L69489K38061J74940
2983.6I63426769Q7142L1233R000m77K0742L2425M3571M3333M2498Q7023J03116K0623
3008.1I63946998l3736J2994n544l0338R4473J47164N0187J2398J5914o1333j18077
$$ y = [959321320, 959896505, 960158408, 960187376, 960186601, 960127771, 960013866, 960116267, 960364699, 960444331, 960414648, 960431933, 960471690, 960415781, 960171461, 959929585, 959933162, 959971964, 959764659, 959413350, 959011137, 958547175, 958220720, 958161891, 958188713, 958107650, 957874954, 957613111, 957433403, 957158208, 956734061, 956513345, 956735909, 957287908, 957856476, 958230913, 958564520, 958993614, 959425509, 959823310, 960102081, 960186362, 960225582, 960303366, 960298777, 960102320, 959818542, 959601104, 959427893, 959310055, 959291220, 959368408, 959540725, 959758162, 960077763, 960577309, 961121500, 961614490, 962131083, 962644279, 963013768, 963251829, 963426769, 963513911, 963545144, 963554144, 963553667, 963574409, 963606834, 963650405, 963693738, 963736236, 963823259, 963926375, 963946998, 963913262, 963926256, 963920712, 963890374, 963984847, 964132011, 964182198, 964194596, 964210510, 964149177, 964031100]
3030.5I64031100l4570K3245j01506k13147j29818k3067N6624Q9765o4493j60753m0830
3052.9I63432550M9770J6272r119L4571J6450q5949q8752M9889J49310P4565l3080
3075.4I63606477j5080l3558p6174m6969l3796J0312J7285k9087k8968l8743n7935
3097.8I63273764k2710N4658N3227n8353m5359J08122R2209m8816q3328p2539m2200
3120.2I63208675O1930R8407O7234Q8334K146j69218j79350q5771l219N9247L3498
3142.7I63181913j9670M1485J18792N0247r2149q4817j013o8188j24276r7275m7147
3165.1I62857902R6023J88828Q6248j27852k05160j04725J431O2584L1651K4735Q2016
3187.5I62993681K7121p6771j00613q464J25826R9957p8142k01106j76311n1319N7339
$$ y = [964031100, 963996530, 964019775, 963918269, 963705122, 963575304, 963552237, 963608861, 963698626, 963634133, 963473380, 963432550, 963482320, 963498592, 963489473, 963524044, 963540494, 963454545, 963365793, 963415682, 963564992, 963639557, 963606477, 963591397, 963557839, 963481665, 963434696, 963400900, 963411212, 963428497, 963399410, 963370442, 963331699, 963273764, 963251054, 963305712, 963358939, 963300586, 963255227, 963363349, 963455558, 963406742, 963323414, 963250875, 963208675, 963270605, 963369012, 963436246, 963524580, 963526726, 963357508, 963178158, 963092387, 963089168, 963148415, 963181913, 963162243, 963203728, 963322520, 963372767, 963280618, 963195801, 963194788, 963126600, 963002324, 962905049, 962857902, 962953925, 963142753, 963229001, 963101149, 962895989, 962791264, 962792695, 962855279, 962886930, 962911665, 962993681, 963020802, 962944031, 962843418, 962834954, 962960780, 963060737, 962982595, 962781489, 962605178, 962553859, 962611198]
3210I62611198J02163Q6844k086o8129p0869m1426k7775r0480o5327P7188Q7738l9756
3234.4I62559283q1837j7286n1439o4551Q7618O8427m8757J14441J63317j29402j44899
3256.9I62454915R4533j3530k36511j37389M4942J10328J20401O3300l9160j04844
3277.3I62356985q2136J491P9274Q2195j7345o3420K5749O4671k6822j37627q7023
3299.7I62195992J36376J86622j1444j14679o5387j7285K1338K9505j2338n6267n2989
3322.1I62239444L4213J33038R8824j1921p7784p9333k9624k0146M77O2286N4419r357
3346.6I62394536l8803N0902J65046J31130k9445r6857k0504P748o0856p7427M4287
3369I62469757J06930L7074J729j5557l5465K4915J19746J45614J04308M4763p8141
$$ y = [962611198, 962713361, 962800205, 962798119, 962729990, 962659121, 962617695, 962589920, 962499440, 962434113, 962511301, 962599039, 962559283, 962477446, 962460160, 962408721, 962344170, 962431788, 962500215, 962451458, 962565899, 962729216, 962599814, 962454915, 962549448, 962535918, 962299407, 962162018, 962206960, 962317288, 962437689, 962500989, 962461829, 962356985, 962274849, 962276340, 962355614, 962437809, 962420464, 962357044, 962382793, 962447464, 962420642, 962283015, 962195992, 962332368, 962518990, 962507546, 962392867, 962327480, 962310195, 962331533, 962361038, 962348700, 962292433, 962239444, 962273657, 962406695, 962505519, 962493598, 962415814, 962336481, 962306857, 962286711, 962287188, 962349474, 962403893, 962394536, 962355733, 962406635, 962571681, 962702811, 962673366, 962576509, 962556005, 962563753, 962502897, 962425470, 962469757, 962576687, 962613761, 962615490, 962599933, 962564468, 962589383, 962709129, 962854743, 962959051, 963003814, 962925673]
3391.5I62925673j84119j06275K0742N9962M5896P153o7354j16825l5226Q6665J59085
3413.9I62795377J41501k0802j75774j12712N7459J28626J25945L6836j04249n9724
3434.3I62812483J89662L13044J47700p9632q5175M6373l1173j02044J28389K69770
3454.7I63609397J40965R895K6047J06573R4354Q464m5180m1247l2246M0949J32382
3477.1I64050353K2888o0261J04130J20401p2479p4983M1366K7060n0008k5689N6564
3499.5I64139342O4552O2823R6739J15037O8128R54M351K8371j3649j33753k16305
3522I64216590j05202J55449L05473K20955L8922q1420M6968K92063K14696r0480l03149
3544.4I64910865k75374r894J51694J60038K20657J83761k3186j60337k19881k57194
$$ y = [962925673, 962741554, 962635279, 962656021, 962715983, 962761879, 962769032, 962701678, 962584853, 962549627, 962636292, 962795377, 962936878, 962916076, 962740302, 962627590, 962685049, 962813675, 962939620, 962976456, 962872207, 962812483, 963002145, 963315189, 963462889, 963383257, 963298082, 963344455, 963313282, 963211238, 963339627, 963609397, 963750362, 963760257, 963786304, 963892877, 963987231, 963995695, 963950515, 963909268, 963877022, 963917971, 964050353, 964073241, 964012980, 964117110, 964237511, 964165032, 964090049, 964131415, 964158475, 964108467, 964082778, 964139342, 964203894, 964266717, 964363456, 964478493, 964546621, 964547575, 964551926, 964580297, 964566648, 964432895, 964216590, 964111388, 964266837, 964572310, 964793265, 964832187, 964750767, 964797735, 965089798, 965304494, 965214014, 964910865, 964635491, 964625597, 964777291, 964937329, 965157986, 965341747, 965318561, 965158224, 964938343, 964681149]
3564.8I64681149k3485L35872L04580J20223J06454M5716p0333k7001K146j35839j22488
3587.2I65216994J75953J43171k11716k49863J80006N00798L44456Q34j87337k00033
3607.6I65713263j03891L57J8955M4643J78874L29554K76327n185l01063k93375M3512
3630.1I65901971K18451K93851J95086n365r477m7624j17779k39551l12388J55449
3650.5I66032624M65155K08914L5823R8049N5194J8537N1797n7400j50680q2970j16646
3672.9I66558397o7175K12789K99513K23935P4983n7102q9466j2517J22309J68859
3693.3I67434525J57297M6134q5175Q226J68740Q2016q6128k02299k09629R060J18017
3715.7I67440784M3154O0916L8147j58429k43009r8407R5546o0796l37661J2815L07560
$$ y = [964681149, 964657664, 964993536, 965298116, 965418339, 965524793, 965570509, 965500176, 965473175, 965475321, 965339482, 965216994, 965392947, 965536118, 965324402, 965074539, 965254545, 965755343, 966099799, 966100633, 965913296, 965713263, 965609372, 965609729, 965628684, 965673327, 965852201, 966181755, 966458082, 966452897, 966151834, 965858459, 965901971, 966120422, 966414273, 966609359, 966603994, 966594517, 966546893, 966429114, 966189563, 965877175, 966032624, 966497779, 966706693, 966742516, 966840565, 966895759, 966914296, 966966093, 966908693, 966758013, 966675043, 966558397, 966491222, 966704011, 967003524, 967227459, 967302442, 967245340, 967155874, 967143357, 967265666, 967434525, 967591822, 967637956, 967552781, 967561007, 967729747, 967811763, 967725635, 967523336, 967313707, 967322767, 967440784, 967483938, 967544854, 967583001, 967424572, 967181563, 967083156, 967178702, 967117906, 966780245, 966793060, 967100620]
3738.1I67100620Q6665j87873l26276j23382Q6248J25468J84417J72674O9320J14918
3758.5I67302799K83003J64211k1100K6345n4359j56701L5703J57893O8724j08302
3778.9I67698216j82509o2644N8352Q8573J15871J34468R5785n126k13623k48492o5505
3801.4I67413366r9301k09034j8060L19183K93076n7459k38538r1076Q4341K20298
3821.8I67616796J63258L3140j7822j94848l99470k64764r775j4901L7193K84255L67880
3844.2I67600942J55806j93953l75629k07364J62482K52724J72674O4075k4140j5616
3864.6I67592001p4089o6757J41800J47283J29699J64032j62601l77238j67370R3282
3885I67420042K40624L6299p7963R6679M1246j61290k99931m30524r1195O48260O13689
$$ y = [967100620, 967187285, 966999412, 966673136, 966549754, 966636002, 966761470, 966945887, 967118561, 967187881, 967302799, 967585802, 967750013, 967728913, 967755258, 967700899, 967544198, 967579901, 967737794, 967806518, 967698216, 967515707, 967453063, 967511415, 967599988, 967715859, 967850327, 967946112, 967940986, 967727363, 967478871, 967413366, 967314065, 967105031, 967086971, 967406154, 967699230, 967641771, 967403233, 967312157, 967396498, 967616796, 967780054, 967813194, 967795372, 967600524, 967201054, 966936290, 966926515, 966911614, 966948807, 967233062, 967600942, 967756748, 967562795, 967187166, 966979802, 967142284, 967395008, 967567682, 967631757, 967607617, 967592001, 967517912, 967451155, 967592955, 967740238, 967869937, 968033969, 967871368, 967494130, 967326760, 967420042, 967660666, 967696965, 967619002, 967715681, 967756927, 967595637, 967295706, 966865182, 966773987, 967422247, 968035936]
3907.4I68035936O5089o4850O2644K384p4923r9718j76191p3553J37031J00792j39475
3929.8I67775166j61529J09673J76549O0499P75r8408p4684L0696J05619K89679K28286
3952.3I68442321r6083k44975j42336J21534K57432R9361j6570O8426J59383N5373
3972.7I68703866j60635j17182J4543r5904j81615j03295K4677J36494P7725p1407
3993.1I68227267j2219J10686
3997.1I68325734
$$ y = [968035936, 968101025, 968036175, 968098819, 968101203, 968026280, 967926562, 967750371, 967676818, 967813849, 967914641, 967775166, 967613637, 967723310, 967899859, 967960358, 967961133, 967862725, 967788041, 967818737, 967924356, 968214035, 968442321, 968346238, 968101263, 967958927, 968080461, 968337893, 968437254, 968420684, 968489110, 968648493, 968703866, 968543231, 968426049, 968440592, 968344688, 968163073, 968059778, 968084455, 968220949, 968298674, 968227267, 968215048, 968325734]
##END=$$ End of the data block
