##TITLE=Raquel Unisul $$ Begin of the data block
##JCAMP-DX=5.00 $$ ACD/SpecManager v 10.08
##SPECTROMETER/DATA SYSTEM=Alpha
##DATE=01 Nov 2016 08:10:52
##DATA TYPE=INFRARED SPECTRUM
##DATA CLASS=XYDATA
##ORIGIN=
##OWNER=
##NPOINTS=1765
##FIRSTX=399.77209473
##LASTX=3997.72216797
##MAXX=3997.72216797
##MINX=399.77209473
##MAXY=0.82353771
##MINY=0.20038725
##XFACTOR=1.0000000000
##YFACTOR=1.000000000000000e-9
##FIRSTY=0.72561240
##DELTAX=2.03965425
##XUNITS=1/CM
##YUNITS=ARBITRARY UNITS
##XYDATA=(X++(Y..Y))
399.8G25612402J0201931L104091J463055j77920j150488j156688k009630j269877
416.1G34616876n01514j658082k481937k602279M57584L189981J169920j295745l318787
434.4G27576017o094515q906782j0677039l362835J0413111J4111757Q283257J113534
450.8G32456505l502547k031982K366364M628062L093541J50442m57228n46813j371264
469.1G34785080j290917l063083n805433o702721l655136L601551M533291l863275
485.4G18539357q861184k613485R635329J3345540N154490k566576m127562l33190
501.8G28172719M210949K265633j964570l076851m739463p797539j3025344j9309938
518.1F84735596j6556084q815765m619241N977332K0572722K3050070J5113056O428719
$$ y = [725612402, 735814333, 738918424, 740381479, 740203559, 739053071, 737896383, 735886753, 734616876, 734115362, 732457280, 729975343, 727373064, 727830648, 731020629, 732190549, 730894804, 727576017, 721481502, 712574720, 701897681, 698534846, 708947957, 723059714, 731342971, 732456505, 728953958, 726921976, 729288340, 733916402, 737009943, 737160385, 736703157, 736156344, 734785080, 733494163, 730431080, 724625647, 717922926, 714267790, 717869341, 722402632, 718539357, 709678173, 707064688, 716700017, 730045557, 735200047, 732633471, 728505909, 728172719, 732383668, 734649301, 732684731, 729607880, 724868417, 717070878, 704045534, 684735596, 668179512, 659363747, 654744506, 660721838, 681294560, 704344630, 719457686, 725886405]
534.4G25886405K350866J095534l31283m87506o78659j542449j383304j756311j953781
552.7G21199512j509666k202868k243877j966536k620399k511442k860725l740370
569.1G01543629l936291n079448o643235r078920j4976144k4318457l2472014k2491098
585.4E82548022J1721432L7575484L2499373J4528453K128720k835154m524052o080866
601.7F67561412o790340p484675q872389r625972j0698020j2112856j3150334j4543534
618E84283292j4831721j2816847o551087R615302L3432722M4375182K5216758r597957
634.3F53125644l0449212l0689478k3628473j7441392j3305962q479655M286587K4548710
650.7E57966769L7491917L4787894K4016380J5450180J1269986Q270383N633652N090773
$$ y = [725886405, 728237271, 729332805, 729001522, 728514016, 727835357, 726292908, 724909604, 723153293, 721199512, 719689846, 717486978, 715243101, 713276565, 710656166, 708144724, 705283999, 701543629, 697607338, 692527890, 685884655, 676805735, 661829591, 637511134, 605039120, 582548022, 594269454, 631844938, 664344311, 678872764, 681001484, 678166330, 673642278, 667561412, 660771072, 653286397, 644414008, 634788036, 624090016, 611977160, 598826826, 584283292, 569451571, 556634724, 550083637, 559698939, 593131661, 637506843, 662723601, 653125644, 622676432, 591986954, 568358481, 550917089, 537611127, 529131472, 533418059, 557966769, 595458686, 630246580, 654262960, 669713140, 680983126, 689253509, 694887161, 699977934]
667F99977934N965591N292535M213392L530205L511190L344953K896071K931833K422392
685.3G34086096K041221K034843J276016P04706J18792j176775k355098m299522o432056
703.7G25998223n893052l066659k181589q949042k4720669l8349986l2685399q067488
720F02084339J8786013L5997331L5836577J9700706O764472P874429J1528075R017229
736.3G47589171N231023K471804k70128j057148l44217p44998k426982n072177q201241
754.7G37175107j1308193j7410338l1804264m9471259n5622101m8169076j6369999
769E07019877M4970930Q3524883O7715525L5424114J5266716L723145l456474l773987
785.3G50414729K481461P816374O414413K119661M9770p62463j348793j631141k310813
$$ y = [699977934, 705943525, 711236060, 715449452, 718979657, 722490847, 725835800, 728731871, 731663704, 734086096, 736127317, 738162160, 739438176, 740142882, 740261674, 739084899, 736729801, 732430279, 725998223, 720105171, 717038512, 714856923, 705907881, 681187212, 642837226, 610151827, 602084339, 620870352, 656867683, 692704260, 712404966, 719169438, 727043867, 738571942, 747589171, 752820194, 755291998, 755021870, 753964722, 753620505, 752875507, 750448525, 745376348, 737175107, 725866914, 708456576, 676652312, 627181053, 571558952, 523389876, 507019877, 551990807, 635515690, 703231215, 738655329, 753922045, 757645190, 754188716, 750414729, 752896190, 760712564, 767126977, 769246638, 769296408, 768533945, 767185152, 765554011, 763243198]
803.6G63243198l550291n428552r288729j5987694k4234712k8881133l0898690k6499212
819.9F18474185M523218M2696893M4744969K2058189M990875l901958j0013461j6145289
836.3G07427621k4504364l3772409l2984674j7030954j1553764l8776517o8569213
850.5D80235726m5717359K3069888O2552929N2672923M5496046N2236438M5665801
864.8G16212392K7283192J3456523O441891K811313Q68439o05404k395689n789161
881.1G58283496j3544083k6964366l6780298k3671687R064258K7634024K2800327J5321493
897.5G32143164J1137724O203413J399159l334045p368863n937219J705885P054448
913.8G43003666N287886P98762l457666p406055o651462J436055Q036912O157398J2219
$$ y = [763243198, 759692907, 754264355, 744975626, 728987932, 704753220, 675872087, 644973397, 618474185, 622997403, 665694296, 710439265, 732497454, 737488329, 733586371, 723572910, 707427621, 682923257, 649150848, 616166174, 599135220, 587581456, 548804939, 480235726, 434518367, 457588255, 520141184, 572814107, 618310153, 670546591, 716212392, 743495584, 756952107, 763393998, 766205311, 767073750, 766468346, 764072657, 758283496, 744739413, 717775047, 680994749, 657323062, 666387320, 694021344, 716821671, 732143164, 743280888, 749484301, 750883460, 747549415, 740180552, 734243333, 735949218, 743003666, 748291552, 749090314, 745632648, 738226593, 731575131, 733011186, 741048098, 747205496, 747217715]
932.1G47217715n718112n926609J032233N487800K840638o32346j639545j460075j512289
950.5G39689410j865387k211869k809107l602028m931450p669330j2100577j4357925
966.8F90141737q699357r01818p1466P33316O044685O576002P65026m697800p599771
985.2F82290554q824527r474635j1136890j4627993j9068003k2830486k4212718j6650319
1001.5E55464983M779398K3622573J9256174j643300k0055651l0547679l7278771l3118248
1017.8D80479479m705489L3669949N0618946M0486515K0760596M086673o334007n078673
1034.1F13983989R195864K1428764J7879844K903282q729100n760014N520284J1877716
1050.4F68300629J2740671R839714K417564n138397q311450n197764J935721N736410
$$ y = [747217715, 741499603, 735572994, 736605227, 742093027, 744933665, 744301319, 742661774, 741201699, 739689410, 737824023, 735612154, 732803047, 729201019, 724269569, 716600239, 704499662, 690141737, 681442380, 680540562, 680469096, 681202412, 687247097, 693823099, 694588125, 689890325, 682290554, 673466027, 663991392, 652854502, 638226509, 619158506, 596328020, 572115302, 555464983, 560244381, 583866954, 603123128, 601479828, 581424177, 550876498, 513597727, 480479479, 475773990, 509443939, 560062885, 600549400, 621309996, 625396669, 619062662, 613983989, 623179853, 644608617, 662488461, 665391743, 656662643, 650902629, 656422913, 668300629, 681041300, 690881014, 693298578, 688160181, 679848731, 674650967, 676586688, 682323098]
1066.7F82323098K309799n668997j5530408k5902510l1490981k5381684o196142J8957317
1083.1E93419492L5208881L2936931J9519090Q390427L728032J497746j132906l905236
1099.4F89662457p261336j2319625j9786954l0640065m2711020m0869713q583963L4488082
1115.7E61977863M8991919L3185482J2456477j240731r102881j1173904l237843J1044800
1132F42901182J7039597J0568261J428604m734396r212375j4382124k2457838l0332804
1148.3E90818107k5801182o139457J2447178J8239320J2598097J329839o987214p269561
1164.6E89235127n303860q898735j7350912k7703345m0075779n1549911m9708039k2042960
1181C66601586K4906993O6124022P8151286O1740339L9441883K3558915J0490537j22309
$$ y = [682323098, 684632897, 678963900, 663433492, 637530982, 606040001, 580658317, 574462175, 593419492, 628628373, 661565304, 681084394, 689474821, 693202853, 694700599, 693567693, 689662457, 682401121, 670081496, 650294542, 619654477, 576943457, 536073744, 527489781, 561977863, 610969782, 644155264, 656611741, 655371010, 646268129, 635094225, 631856382, 642901182, 659940779, 670509040, 671937644, 667203248, 657990873, 643608749, 621150911, 590818107, 565016925, 558877468, 571324646, 589563966, 602162063, 603491902, 596504688, 589235127, 583931267, 575032532, 557681620, 529978275, 489902496, 438352585, 388644546, 366601586, 391508579, 457632601, 535783887, 597524226, 636966109, 660525024, 671015561, 670893252]
1197.3F70893252n800307p890999r088218r755016q938968p741570p795454q566916
1213.6F05315804r428381j0808528j2663305j4491737j5902817j6590297j6227365
1227.9E09203374j5269518j5669971j8608392k3514777k8712571k9498785k4980605
1242.2C52948755k4608821l3432603m0593922l0691310n56618L3861205N2193552M8971265
1258.5C58091503L5118819K9758274L9172352M6970635M0338814K5861443J4153957
1272.8E89465797O811738j307428j3714015k5895954k6492774j0978997J0393322K5034725
1289.1E53316414K5530100J1959613n632699j8745959k7767598l5180211l7187964
1303.3D66291696k2722870P151156L2296688M2364597L9114297K3005485L086031j0436535
$$ y = [670893252, 665092945, 657201946, 648113728, 638358712, 629419744, 621678174, 613882720, 605315804, 595887423, 585078895, 572415590, 557923853, 542021036, 525430739, 509203374, 493933856, 478263885, 459655493, 436140716, 407428145, 377929360, 352948755, 328339934, 294907331, 254313409, 223622099, 223065481, 256926686, 309120238, 358091503, 393210322, 422968596, 462140948, 509111583, 549450397, 575311840, 589465797, 596277535, 594970107, 581256092, 555360138, 528867364, 517888367, 528281689, 553316414, 578846514, 590806127, 585173428, 566427469, 538659871, 503479660, 466291696, 443568826, 450719982, 483016670, 525381267, 564495564, 587501049, 590587080, 580150545]
1319.7E80150545j6830683j9085229j7685055r936393l39329k478361n357206J5412688
1336E23850977M3798507M7972262K9083609O878436o483615N16117J9469917K2414446
1352.3F87500656J0249436K226173J675666L378093L713071J059235l169537p279694
1368.6F99353099r819090r273768m714847L275097Q716523O793917j67489p765174
1384.9F86398268j8157065k9104948k3736239M292429L4661531L6657095K0328582
1399.2G11339653P056295m77552m841983p250011q547724j1069715j4834523j4336049
1415.5F57038391m952610O229043N843103j353800p140816j0763227j1874736q994639
1431.8F24030709o919920j3778567k4796963k3592949j4707506j1549771k0010829
$$ y = [580150545, 563319862, 544234633, 526549578, 516613185, 516273856, 513795495, 508438289, 523850977, 567649484, 615621746, 644705355, 651583791, 645100176, 645616293, 665086210, 687500656, 697750092, 699976265, 701651931, 705030024, 708743095, 709802330, 706632793, 699353099, 689534009, 680260241, 675545394, 678820491, 687537014, 694330931, 694163442, 686398268, 668241203, 639136255, 615400016, 619692445, 654353976, 691011071, 711339653, 718395948, 717918396, 713076413, 705826402, 697278678, 686208963, 671374440, 657038391, 652085781, 658314824, 664157927, 662804127, 655663311, 644900084, 633025348, 624030709, 617110789, 603332222, 578535259, 554942310, 540234804, 528685033, 508674204]
1446.1E08674204k7648329k1623522o620467R237528J8534839J0690123l825933j2587696
1462.4D74830747k5031031l5311371k8074085j1706859K324104K7129501O2856227
1476.7D67017233O7303181L6632061M469812j3931930k3973823l2721460l7712603
1491D67082471l4479469l3072681l7180781l8004756l4854144k8583169j5223607J7240479
1507.3B62924343M8119516N7687371N6977392M6582550L0396819Q584678j5145064
1521.6D96127605l0741661l7606478m1108370l4112513j9777149r35912J4833003K3728252
1537.9C70406777L4023434L4160733K6664734K3539096K0647377J8391966J6361297
1552.2E44195414J4724195J3670206J5041351J3518572N575001M60565m350006j1383653
$$ y = [508674204, 481025875, 459402353, 452781886, 462019414, 480554253, 491244376, 487418443, 474830747, 449799716, 414488345, 386414260, 374707401, 377031505, 404161006, 467017233, 534320414, 570952475, 575422287, 561490357, 537516534, 504795074, 467082471, 432603002, 399530321, 362349540, 324344784, 289490640, 260907471, 245683864, 262924343, 311043859, 368731230, 425708622, 472291172, 502687991, 511272669, 496127605, 465385944, 427779466, 386671096, 352558583, 332781434, 331845522, 346678525, 370406777, 404430211, 438590944, 465255678, 488794774, 509442151, 527834117, 544195414, 558919609, 572589815, 587631166, 601149738, 606724739, 607185304, 602835298, 591451645]
1568.5E91451645j9964278k6905477l7288964l2370180J9399077O4861536O7031443
1582.8F26214802L8275898J0307252n450249j4668822k2066474k9231429l4208953
1597.1E69172025l6235154l9842725m7393948n5200725n5429459l5561591L268778
1611.3C02777201L1627595L4283281J7614722m541874k2178560l9938897m7791332
1625.6B71852136m3108881k6985615j370386K3774505M6664760M7677099L6541999
1639.9C55045617L2629847L1091601L4062028L4628391K6218504K6771784L1498134
1654.2E71945906K0872354J5651167J6315400J6587436J4159859J0535359J0015607
1668.4F76083088J0802865R964466R683490R052574P086337O366432P222533Q725345
$$ y = [591451645, 571487367, 544581890, 507292926, 474922746, 494321823, 559183359, 626214802, 664490700, 674797952, 669347703, 654678881, 632612407, 603380978, 569172025, 532936871, 493094146, 445700198, 390499473, 335070014, 299508423, 302777201, 334404796, 368688077, 386302799, 381760925, 359582365, 319643468, 271852136, 228743255, 201757640, 200387254, 224161759, 270826519, 318503618, 355045617, 387675464, 418767065, 452829093, 487457484, 513675988, 540447772, 571945906, 592818260, 608469427, 624784827, 641372263, 655532122, 666067481, 676083088, 686885953, 696850419, 706533909, 715586483, 722672820, 729039252, 736261785, 744987130]
1684.8G44987130P388473N874455N349576M073262K887249J666129M53949o38366l82960
1703.1G71658897Q85785K336204L406882M105270M263997L427923J509130m09901q80539
1721.5G90303648p43270l35694L97384J459241K353013K872288K533198J908898J799881
1739.8H02548587J519680J000345N89311L56257J67072P83682K042472K775371K495587
1758.2H14278364J648545R12309M93527M20808M35710M62175l1710p49230j143754
1776.5H16726744j459062j388848o42061J95086P87556J337350J840710K011001J537025
1794.9H20945501J109660Q88586N04792Q9168j67668m56213q02875j197696j396835
1813.3H19516420j190483j224876j145124L6895J460254J620651R03845N06162N82338
$$ y = [744987130, 752375603, 758250058, 763599634, 767672896, 770560145, 772226274, 772680223, 772041857, 771658897, 772544682, 774880886, 778287768, 782393038, 786657035, 790084958, 791594088, 791184187, 790303648, 789560378, 789224684, 789622068, 791081309, 793434322, 796306610, 798839808, 800748706, 802548587, 804068267, 805068612, 805657923, 806014180, 806181252, 806964934, 809007406, 811782777, 814278364, 815926909, 816839218, 817332745, 817753553, 818189263, 818651438, 818619728, 817870498, 816726744, 815267682, 813878834, 813236773, 813431859, 814219415, 815556765, 817397475, 819408476, 820945501, 822055161, 822943747, 823448539, 823537707, 823370039, 822913826, 822110951, 820913255, 819516420, 818325937, 817101061, 815955937, 815992832, 817453086, 819073737, 819977582, 820483744, 821066082]
1831.6H21066082P19189N85437L88682L06308K76446M2081l41594l50892o7354J46747
1852H22771132J93655P6533k47717o22630j003027j457393k414286m867912p170498
1870.4H05257857n193114o7950L712476M467606L761888K645790J408041N59091J12594
1888.7H16664279k79367n06223n34236p60138j347184k340615l907621n027235l220498
1907.1G98741162J751125N582153N245388K983093J288116L01957l44038q87990j464784
1925.4H13196182k132237l278732m982352n599916l092587J105785L675461M012883
1941.8H02904487L257453K155960J055360K38120l8803k145O2525J37746J36733P16
1962.2H09908152j25468k43187l62992l45052j92463j8478N6863n5611l65913p53939
$$ y = [821066082, 821785271, 822370708, 822759390, 823065698, 823342144, 823384225, 823042631, 822691739, 822624385, 822771132, 822964787, 823041320, 822793603, 822170973, 821167946, 819710553, 817296267, 812428355, 805257857, 800064743, 799996793, 803709269, 808176875, 811938763, 814584553, 815992594, 816551685, 816664279, 816384912, 815878689, 815344453, 814584315, 813237131, 810896516, 806988895, 801961660, 798741162, 800492287, 806074440, 811319828, 814302921, 815591037, 815892994, 815548956, 814660966, 813196182, 811063945, 807785213, 802802861, 797202945, 794110358, 795216143, 798891604, 802904487, 806161940, 808317900, 809373260, 809611380, 809572577, 809570432, 809632957, 809770703, 809907436, 809908152, 809782684, 809539497, 809176505, 808831453, 808638990, 808620512, 808677375, 808621764, 808255851, 807501912]
1982.6H07501912j023054j119256j141727j107693j038849r48668q17597o95288o10590
2000.9G98999190n18679l45409k05159l74258r29058j529872j775146j553893r59277
2019.3G90808439l99053m48465n77688J96516R04441O31928L07858M69208P47800Q18968
2039.7G93459952O46591L25978q6188n40257r43422j296044j622319j816034j675964
2058G86452293r22381N40375K163649L087818L063798K453030J658678R22680M18722
2076.4G99838662K51591K94149K94388J14023k08020n53667p72059q16644p50363o61253
2096.8G97030807o02007n44191m61161l40342j59264p510k5153k21014n42880p70449
2117.2G93356836o15060q5474M71712P84695R45449J039922R24885N76675K42531P8857
$$ y = [807501912, 806478858, 805359602, 804217875, 803110182, 802071333, 801122665, 800305068, 799609780, 798999190, 798480511, 798135102, 797929943, 797555685, 796626627, 795096755, 793321609, 791767716, 790808439, 790409386, 789960921, 789383233, 789579749, 790484190, 791116118, 791423976, 791893184, 792640984, 793459952, 794106543, 794432521, 794346333, 793806076, 792862654, 791566610, 789944291, 788128257, 786452293, 785529912, 786070287, 788233936, 791321754, 794385552, 796838582, 798497260, 799419940, 799838662, 800090253, 800384402, 800678790, 800792813, 800584793, 800031126, 799259067, 798442423, 797692060, 797030807, 796428800, 795884609, 795423448, 795083106, 794923842, 794916332, 794891179, 794670165, 794127285, 793356836, 792741776, 792656302, 793128014, 793912709, 794858158, 795898080, 796822965, 797399640, 797642171, 797721028]
2137.6G97721028L4273Q225r9003l22759n41866n98371m36246j59383N7995K17080
2158G95880973L46065L73065L33250K41816M8935o9558j22965l15785m35889k92897
2178.4G95987010l7670J25348J03057j550q7142j99735l08514l26812k02298J00732
2198.8G95152426L43680K98441J18494k0862j08302j91033l24368m50909n10275n83172
2219.1G93724120p34568j018286j444578j791656j655400p80523M43221J212060J274645
2237.5G89229035R55999N38886K44975J28746K8968q0407j64509k79307m36723o02126
2257.9G89563537o54281m79042k05517P212Q4102k3365j82092k48313k20537j29819
2278.3G87511885r8407j88768l34144o31392j049518j254678j059651n77987j30951
$$ y = [797721028, 797755301, 797763526, 797664523, 797341764, 796799898, 796201527, 795765281, 795605898, 795663893, 795880973, 796227038, 796600103, 796933353, 797175169, 797224104, 797154546, 797031581, 796715796, 796279907, 795987010, 795949340, 796074688, 796177745, 796176195, 796089053, 795889318, 795580804, 795253992, 795051694, 795152426, 795496106, 795794547, 795913041, 795892179, 795783877, 795592844, 795268476, 794817567, 794307292, 793724120, 792989552, 791971266, 790526688, 788735032, 787079632, 786299109, 786742330, 787954390, 789229035, 790185034, 790723920, 790968895, 791097641, 791126609, 791046202, 790881693, 790602386, 790165663, 789563537, 788909256, 788430214, 788224697, 788231909, 788316011, 788292646, 788110554, 787862241, 787641704, 787511885, 787413478, 787224710, 786890566, 786259174, 785209656, 783954978, 782895327, 782317340, 782186389]
2296.7G82186389R5844K52366L63171K62201k1279m25696q63373j185715j428426j590311
2317G77645171j526296j093209l19839M22299O89745N64396L88086J60396j64926m74929
2337.4G76290894o45936o28591n53131l55303j8001j8477l51250o22690p20739p12514
2357.8G71664262o48916m22895K36392J037002J460492J388967R79364N53549K44379
2376.2G76492596m2260k58505m50135p36475j035332j210451r89974j45674Q39591
2394.5G72463381J240194R78708M24207o8903l65079n33283o48975p76708r01580r91702
2414.9G70820260j221240j562535j672328j358926n91934L75033J031994J234234J198888
2433.3G68253446J101374J057148R77338P33256M42982J64866j13249l01420l68774
$$ y = [782186389, 782282233, 782534599, 782897770, 783159971, 783138692, 782712996, 781849623, 780663908, 779235482, 777645171, 776118875, 775025666, 774705827, 775128126, 775817871, 776382267, 776770353, 776930749, 776765823, 776290894, 775644958, 775016367, 774463236, 774107933, 774089932, 774071455, 773720205, 773097515, 772376776, 771664262, 771015346, 770592451, 770828843, 771865845, 773326337, 774715304, 775694668, 776248217, 776492596, 776450336, 776191831, 775741696, 775005221, 773969889, 772759438, 771769464, 771623790, 772463381, 773703575, 774682283, 775106490, 775037587, 774672508, 774139225, 773490250, 772713542, 771811962, 770820260, 769599020, 768036485, 766364157, 765005231, 764413297, 764788330, 765820324, 767054558, 768253446, 769354820, 770411968, 771389306, 772122562, 772565544, 772730410, 772617161, 772315741, 771946967]
2451.7G71946967l72529m16696o27280r59098j242280j323819j121164q24570p63476
2470G64296055j022399j436770j718223j654982j329422q85248m18246J9431M88162
2488.4G56338358Q40127R06229R24766J103044J325786J432777J368343J170814Q21114
2506.7G66231358K86877k58446o43253q75056r56714q55923o16133m64976o11662q76189
2527.1G60359883r04739o80446m82440n41389r00209j431644j988649k408028k532244
2545.5G48490095k356887j824259q30353L50476J215279J515388J326859R74238P71344
2563.8G49632180P75337Q60274Q66353P82371O26683K78890l03864j039863j782715
2582.2G50695646k276063k385855k261698j999736j505256q09788j82450K05159L96669
$$ y = [771946967, 771574438, 771157742, 770530462, 769571364, 768329084, 767005265, 765884101, 765059531, 764296055, 763273656, 761836886, 760118663, 758463681, 757134259, 756249011, 755830765, 755850196, 756338358, 757178485, 758084714, 759009480, 760112524, 761438310, 762871087, 764239430, 765410244, 766231358, 766518235, 766259789, 765616536, 764741480, 763784766, 762928843, 762312710, 761847734, 761236072, 760359883, 759455144, 758774698, 758292258, 757750869, 756850660, 755419016, 753430367, 751022339, 748490095, 746133208, 744308949, 743478596, 743829072, 745044351, 746559739, 747886598, 748860836, 749632180, 750407517, 751267791, 752134144, 752916515, 753543198, 753822088, 753518224, 752478361, 750695646, 748419583, 746033728, 743772030, 741772294, 740267038, 739457250, 739274800, 739479959, 739876628]
2600.5G39876628L87430J42038j92404m67479o74903p69914p95602q69453r57191j041234
2620.9G34637916j085102r37582n48660M8458O62208R46760Q04603L35634k80738p56442
2641.3G33827055j064599j401246j836240k262354k415478k166033j704633j100004
2657.7G19876468l82721r2328m53114m95375N62966J879096K175153J410424M08173
2676G24888742k66969n85377p18177p47263o14703k27809M38273J172721J555920J425922
2696.4G26321280R48071L04282k63989o28710r32037j240850j577020j965642k235293
2714.8G18730092k249122k003789j624226j349330j117468o54697p809M55678M07457
2733.1G10586786q9347p25925j351297j860857k070844j910091j509308j184702j206160
$$ y = [739876628, 740264058, 740406096, 740213692, 739746213, 739071310, 738301396, 737505794, 736636341, 735679150, 734637916, 733552814, 732615232, 732066572, 732115030, 732777238, 733723998, 734528601, 734864235, 734583497, 733827055, 732762456, 731361210, 729524970, 727262616, 724847138, 722681105, 720976472, 719876468, 719493747, 719401419, 718948305, 718452930, 719015896, 720894992, 723070145, 724480569, 724888742, 724621773, 724036396, 723318219, 722570956, 721956253, 721728444, 722166717, 723339438, 724895358, 726321280, 727269351, 727573633, 727309644, 726680934, 725748897, 724508047, 722931027, 720965385, 718730092, 716480970, 714477181, 712852955, 711503625, 710386157, 709731460, 709723651, 710179329, 710586786, 710497439, 709771514, 708420217, 706559360, 704488516, 702578425, 701069117, 699884415, 698678255]
2751.5F98678255j512706j861930k128720k340734k533675k669334k718449k713978
2767.8F80198729k668381k513289k226234j968622j900136k060056k486408l136396
2784.1F61239207l704846l626704k826870k100527j951933k033710k104939k393722
2800.4F40495956l009617l811121m634679n331874n854666o239295o515145o812096
2816.7E98287463p258057p763625q250832q925319j0115087j1891127j4120280j6836882
2833.1E13126254k0273536k4738849l0134946l4769714l6484807l5478503l1575829
2847.3B99670070k1237939m092187J2419105K1875232K6171893K7867049K4361521
2861.6C87034744J5248954P235676O775648J1196822J3599127J3435275J3457566J2284100
$$ y = [698678255, 697165549, 695303619, 693174899, 690834165, 688300490, 685631156, 682912707, 680198729, 677530348, 675017059, 672790825, 670822203, 668922067, 666862011, 664375603, 661239207, 657534361, 653907657, 651080787, 648980260, 647028327, 644994617, 642889678, 640495956, 637486339, 633675218, 629040539, 623708665, 617853999, 611614704, 605099559, 598287463, 591029406, 583265781, 575014949, 566089630, 555974543, 544083416, 529963136, 513126254, 492852718, 468113869, 437978923, 403209209, 366724402, 331245899, 299670070, 278432131, 274339944, 286759049, 308634281, 334806174, 362673223, 387034744, 402283698, 409519374, 416295022, 427491844, 441090971, 454526246, 467983812, 480267912]
2877.9D80267912P452578K53051o300747j0972798j4127940j5744001j5542716j4625936
2894.2D10659403j4628739j5715003j6592115j6233861j5265703j4959127j5333593
2908.5C01931262j5854180j6724080j7469376j6153947j1786997o113052j118288L273651
2924.8B19984993O890938P606581M366353J64583p37995J313240L353908Q059442J8332005
2943.2B69334048K6053548K2831738J5076220J2521058J4456213J8100738K3061216
2957.5D01434779K6373625K5976270K3436964K0705044J8585474J7237782J6367197
2971.7E50117135J5334129J3795495J2006283J0326922Q829773P537841O479681N617321
2988.1F30044580M917383M289806L642380L055930K721667K670110K737581K789855
$$ y = [480267912, 487720490, 487973541, 481672794, 470699996, 456572056, 440828055, 425285339, 410659403, 396030664, 380315661, 363723546, 347489685, 332223982, 317264855, 301931262, 286077082, 269353002, 251883626, 235729679, 223942682, 217829630, 216711342, 219984993, 226875931, 234482512, 238848865, 239013448, 238275453, 239588693, 242942601, 251002043, 269334048, 295387596, 318219334, 333295554, 345816612, 360272825, 378373563, 401434779, 427808404, 453784674, 477221638, 497926682, 516512156, 533749938, 550117135, 565451264, 579246759, 591253042, 601579964, 610409737, 617947578, 624427259, 630044580, 634961963, 639251769, 642894149, 645950079, 648671746, 651341856, 654079437, 656869292]
3004.4F56869292K808690K727270K513826K206207J716971R49204K1339p50781j064539
3022.7F67997479p34865J82926J296044K160311K457618J998842Q58426p57873k455413
3041.1F73003495l097892j568437J079560K348125J605391L94166J11937Q56936J831055
3059.4F76564336K392232K556682K591848K582670K304375J603484R00686R58085J911819
3077.8F94366217K716064K463281J549363O99044J22308o2465M01914J381516K120972
3096.2G05758214K054632J444399Q39531M71950K62141O6877j44840k77936k68340
3114.5G10206628j94848n9068J60754K89738K10822J8835k17677n07175p56622q36313
3134.9G08315074p56621o51359o12259To53982o81699m13716J93715O57082N62251
$$ y = [656869292, 659677982, 662405252, 664919078, 667125285, 668842256, 669791460, 669812799, 669062018, 667997479, 667262614, 667445540, 668741584, 670901895, 673359513, 675358355, 676216781, 675458908, 673003495, 669905603, 668337166, 669416726, 671764851, 673370242, 673764408, 673876345, 674733281, 676564336, 678956568, 681513250, 684105098, 686687768, 688992143, 690595627, 691496313, 692454398, 694366217, 697082281, 699545562, 701094925, 701793969, 701916277, 701853812, 702255726, 703637242, 705758214, 707812846, 709257245, 710096776, 710568726, 710830867, 710897744, 710752904, 710474968, 710206628, 710011780, 709952712, 710113466, 710403204, 710614026, 710632861, 710415184, 709908009, 709151387, 708315074, 707558453, 706907094, 706294835, 705682576, 705028594, 704346895, 703933179, 704126894, 704783976, 705346227]
3155.3G05346227J8954n94676r89139j104295j013040q08597o26445m99368l91006
3173.7F99338615l54171m12702n10872n73516n49197m76003m73797o47247r57310j291811
3194.1F93091989j661182k142429k697110l203154l459811l122986k099454q58009
3210.4F73847854K8014M79281O69897N76019J72675m30405j081646j642823k072752
3228.7F70546114k418398k665043k794981k891243k988040l112197l327668l639698
3245F46708846m075169m724086n497396o019532n717159m190028j918673r0718N23627
3263.4F14999712J53660n53012j161933j574218j950800k395034k881229l397465l907799
3281.8E97331882m398287m913032n447745n956352o464899o959736p360697p637918
$$ y = [705346227, 705365181, 704770505, 703781366, 702677071, 701664031, 700855434, 700228989, 699729621, 699338615, 698984444, 698571742, 698060870, 697487354, 696938157, 696462154, 695988357, 695341110, 694383800, 693091989, 691430807, 689288378, 686591268, 683388114, 679928303, 676805317, 674705863, 673847854, 673875868, 674355149, 675025046, 675601065, 675773740, 675343335, 674261689, 672618866, 670546114, 668127716, 665462673, 662667692, 659776449, 656788409, 653676212, 650348544, 646708846, 642633677, 637909591, 632412195, 626392663, 620675504, 616485476, 614566803, 614476085, 614999712, 615153372, 614600360, 613438427, 611864209, 609913409, 607518375, 604637146, 601239681, 597331882, 592933595, 588020563, 582572818, 576616466, 570151567, 563191831, 555831134, 548193216]
3298.1E48193216p756829p778943p824838p993877q385479q859098r201646r441584
3314.4D80950922r666860r874791j0074765j0377675j0968894j1950701j3067186j3917983
3330.7C91052067j4277577j3803035j2150288r228885m958659M46528O085545J1059016
3347C54224712J4702439J6439438J6566753J5963257J4980256J3557047J1860877J0336846
3363.3D68631625R247422Q260042P046044N859166N083144M697442M388928M027665
3379.7E17241478L630161L231466K876520K653480K560496K234161J624584J311064
3396E37363410J491249J556515J059115N50270N71311O80744N19515L01420J26362
3414.3E44219911O259K2888N0246q94M2320K36451L87192L50356L74317M92692L26157
$$ y = [548193216, 540436387, 532657444, 524832606, 516838729, 508453250, 499594152, 490392506, 480950922, 471284062, 461409271, 451334506, 440956831, 429987937, 418037236, 404970050, 391052067, 376774490, 362971455, 350821167, 341592282, 336633623, 337080151, 343165696, 354224712, 368927151, 385366589, 401933342, 417896599, 432876855, 446433902, 458294779, 468631625, 477879047, 486139089, 493185133, 499044299, 504127443, 508824885, 513213813, 517241478, 520871639, 524103105, 526979625, 529633105, 532193601, 534427762, 536052346, 537363410, 538854659, 540411174, 541470289, 542020559, 542591870, 543272614, 543792129, 544093549, 544219911, 544226170, 544249058, 544299304, 544298410, 544340730, 544577181, 544964373, 545314729, 545689046, 546181738, 546507895]
3436.8E46507895M0054J26899N12123Q07643Q97526Q64029Q32022R01222J044035J187920
3457.2E53721368J268268J200139J192749J410067J488447J188278Q98600R92417J254261
3475.5E64614594J428485J350164J069486J038373J221776J206279J124382J229405
3491.8E74282944J375377J400233J313328J345814J473605J342714J173794J287997
3508.1E84995806J469970J580000J553476J466870J503646J621068J752973J683712
3524.5E97627521J456081J428426J569092J726687J891971J841306J622021J682580
3540.8F10845685J900434J813353J443684J323342J474738J488805J443624J554370
3557.1F23288035J713574J791001J819074J882493J936138J800478J669824J811981
$$ y = [546507895, 546547949, 546674848, 547186971, 547994614, 548892140, 549756169, 550588191, 551489413, 552533448, 553721368, 554989636, 556189775, 557382524, 558792591, 560281038, 561469316, 562367916, 563360333, 564614594, 566043079, 567393243, 568462729, 569501102, 570722878, 571929157, 573053539, 574282944, 575658321, 577058554, 578371882, 579717696, 581191301, 582534015, 583707809, 584995806, 586465776, 588045776, 589599252, 591066122, 592569768, 594190836, 595943809, 597627521, 599083602, 600512028, 602081120, 603807807, 605699778, 607541084, 609163105, 610845685, 612746119, 614559472, 616003156, 617326498, 618801236, 620290041, 621733665, 623288035, 625001609, 626792610, 628611684, 630494177, 632430315, 634230793, 635900617, 637712598]
3573.4F37712598K061605K165437K231777K364576K499997K476037K122938J811803
3589.7F55446768J826346J922250J944839J882911J744628J776636K102613K379060
3606F71026051K486229K454877K347469K282143K211749K162874K071798J828074J766563
3624.4F90637827J798510J538337J135826R06587R13262J071870J171887J173318J210928
3642.8G01558352J352608J476884J262486O21736L03864L82245M88281M40717J53362
3661.1G08040535o9081O9916K07066%m470J90079R120n1856K07543M70042O96659Q65102
3685.6G10630655Q65341L48269j31666O8307L21030L59536L50713K40028J85967L10838
3706G13549018M17948K58922j49786k03014M2081J37508J45972K59936L02434J92880
$$ y = [637712598, 639774203, 641939640, 644171417, 646535993, 649035990, 651512027, 653634965, 655446768, 657273114, 659195364, 661140203, 663023114, 664767742, 666544378, 668646991, 671026051, 673512280, 675967157, 678314626, 680596769, 682808518, 684971392, 687043190, 688871264, 690637827, 692436337, 693974674, 695110500, 696017087, 696930349, 698002219, 699174106, 700347424, 701558352, 702910960, 704387844, 705650330, 706272066, 706575930, 706958175, 707446456, 707887173, 708040535, 707971454, 708041370, 708248436, 708248436, 708243966, 708434045, 708443165, 708391309, 708598852, 709068894, 709765553, 710630655, 711495996, 711844265, 711712599, 711780906, 712101936, 712461472, 712812185, 713052213, 713238180, 713549018, 713966966, 714225888, 714076102, 713873088, 713915169, 714052677, 714198649, 714458585, 714761019, 714953899]
3726.4G14953899K13325L11375K84433l7491m84764m78030j81019j21892p1346K66790
3746.8G14655280K09391j72436j88231P9095O7472k22623k52366o0022l874m5121k32458
3769.2G13834107m11034l74436j66237J01029Q4818j48773k00749j21355q941R7871
3789.6G12686300J74523J82151J03891J13130K1934j95801j54435k97487n34356l09050
3810G11790800j1086j11580l67761k78890m65334p17520l62575q1957K6346M2438L9518
3832.4G09502399J82688J38760j13487j71245j73270j68443K2829L41475M05073k10643
3852.8G09756136o05702j65344L7790J5556j07467j92821j64628l72350n72979m98891
3873.2G07129300k55585N1737M3750m4227n6446k80022l95000l82006n11229m95136
$$ y = [714953899, 715167224, 715478599, 715763032, 715725541, 715240777, 714762747, 714581728, 714459836, 714388490, 714655280, 714864671, 714692235, 714504004, 714583099, 714650571, 714427948, 714175582, 714115560, 714111686, 714066565, 713834107, 713423073, 713048637, 712882400, 712983429, 713068247, 712919474, 712718725, 712597370, 712588429, 712686300, 712860823, 713042974, 713146865, 713259995, 713281929, 713086128, 712931693, 712634206, 712099850, 711790800, 711779714, 711668134, 711300373, 711021483, 710556149, 709838629, 709476054, 709394097, 709420443, 709462881, 709502399, 709685087, 709823847, 709710360, 709539115, 709365845, 709197402, 709220231, 709561706, 709966779, 709756136, 709150434, 708985090, 709022880, 709038436, 708930969, 708738148, 708573520, 708201170, 707628191, 707129300, 706873715, 706925452, 706969202, 706924975, 706868529, 706588507, 706193507, 705811501, 705300272, 704805136]
3893.6G04805136k63989j39475j90079k84553l42905k82288j23680Q583J38224K35915
3914G03560889J93238J03891J38879K02417J53005Q6725J18673J73807J06573m8339
3934.4G04789758j22011m9293K8312m0233j28984j09554p5102r6917j01268j24097
3954.8G03970611k08437k44677k74122l41058l32177k73943k53737k62022k85744k94507
3975.2G01200187k75850k07543o4075L4093l5047j64151j87099j64569j87516k10345
3995.6F99738085j76191
3997.6F99561894
$$ y = [704805136, 704541147, 704401672, 704211593, 703927040, 703584135, 703301847, 703178167, 703186750, 703324974, 703560889, 703754127, 703858018, 703996897, 704199314, 704352319, 704439044, 704557717, 704731524, 704838097, 704789758, 704667747, 704618454, 704646766, 704606533, 704477549, 704367995, 704292893, 704195976, 704094708, 703970611, 703762174, 703517497, 703243375, 702902317, 702570140, 702296197, 702042460, 701780438, 701494694, 701200187, 700924337, 700716794, 700652719, 700686812, 700651765, 700487614, 700300515, 700135946, 699948430, 699738085, 699561894]
##END=$$ End of the data block
