##TITLE=Rachel 3 $$ Begin of the data block
##JCAMP-DX=5.00 $$ ACD/SpecManager v 10.08
##SPECTROMETER/DATA SYSTEM=Alpha
##DATE=15 Sep 2014 09:51:18
##DATA TYPE=INFRARED SPECTRUM
##DATA CLASS=XYDATA
##ORIGIN=
##OWNER=
##NPOINTS=1667
##FIRSTX=599.64648438
##LASTX=3997.64306641
##MAXX=3997.64306641
##MINX=599.64648438
##MAXY=1.06288469
##MINY=0.46672228
##XFACTOR=1.0000000000
##YFACTOR=0.000000010000000
##FIRSTY=0.96765029
##DELTAX=2.03961372
##XUNITS=1/CM
##YUNITS=ARBITRARY UNITS
##XYDATA=(X++(Y..Y))
$$ plain form
599.6 96765029 96738261 96744454 96794552 96879208 96963674 97014648 97057539 97118342 97166038 97196859 97217202 97219956
624.1 97219956 97223002 97240531 97264802 97287899 97318125 97347081 97363412 97378230 97376233 97338957 97295624 97281814
648.6 97281814 97301149 97339767 97367716 97363847 97345090 97339118 97338068 97327125 97320855 97313094 97287554 97262782 97259825
675.1 97259825 97290790 97343558 97415483 97512090 97610718 97686017 97739971 97775745 97797477 97813171 97818869 97796190
699.6 97796190 97736526 97646183 97519702 97341949 97084314 96722490 96212947 95463687 94497871 93687898
720 93687898 93560094 94143087 94989741 95750189 96345186 96808016 97169107 97459537 97707188 97921425
740.4 97921425 98111820 98275757 98410100 98529249 98639369 98735982 98817587 98896313 98985171 99074256 99135035
762.8 99135035 99161166 99177313 99215561 99299794 99404627 99477708 99527812 99608260 99723834 99835759 99925280
$$ packed form
599.6I6765029k6768O193N0098Q4656Q4466N0974M2891O0803M7696L0821K0343K754
624.1I7219956L046J7529K4271K3097L0226K8956J6331J4818j997l7276m3333j3810
648.6I7281814J9335L8618K7949l869j8757n972j050j0943o270p761k5540k4772k957
675.1I7259825L0965N2768P1925R6607R8628P5299N3954L5774K1732J5694N698k2679
699.6I7796190n9664r0343j26481j77753k57635l61824n09543p49260r65816q09973
720I3687898j27804N82993Q46654P60448N94997M62830L61091K90430K47651K14237
740.4I7921425J90395J63937J34343J19149J10120R6613Q1605P8726Q8858Q9085O0779
762.8I9135035K6131J6147L8248Q4233J04833P3081N0104Q0448J15574J11925Q9521
$$ plain form
785.3 99925280 100008678 100092018 100152278 100182211 100194931 100211012 100239670 100265360 100278950 100296760 100327861 100350356
809.7 100350356 100355089 100353456 100360787 100394583 100436640 100457513 100462973 100451601 100409818 100355566 100301516 100215900
834.2 100215900 100076461 99902946 99718916 99552530 99446136 99407339 99402481 99411392 99437839 99487531 99556726
856.6 99556726 99626791 99692887 99771184 99860597 99957013 100073564 100221062 100396574 100569534 100709879 100809658
879.1 100809658 100851917 100830853 100763834 100664032 100559592 100488794 100452614 100407660 100300002 100119841 99881667
901.5 99881667 99577689 99225688 98889709 98625231 98458034 98414230 98475581 98565298 98641175 98703671 98770195
923.9 98770195 98877084 99045688 99237400 99373811 99454284 99610764 99929607 100302482 100578570 100712764
944.3 100712764 100727427 100654364 100515807 100321162 100054169 99678189 99194896 98702115 98363912 98274994
$$ packed form
785.3I9925280Q3398Q3340O0260K9933J2720J6081K8658K5690J3590J7810L1101K2495
809.7A00350356M733j633P331L3796M2057K0873N460j1372m1783n4252n4050q5616
834.2A00215900j39439j73515j84030j66386j06394l8797m858Q911K6447M9692O9195
856.6I9556726P0065O6096P8297Q9413R6416J16551J47498J75512J72960J40345R9779
879.1A00809658M2259k1064o7019r9802j04440p0798l6180m4954j07658j80161k38174
901.5I9881667l03978l52001l35979k64478j67197m3804O1351Q9717P5877O2496O6524
923.9I8770195J06889J68604J91712J36411Q0473J56480L18843L72875K76088J34194
944.3A00712764J4663p3063j38557j94645k66993l75980m83293m92781l38203q8918
$$ plain form
964.7 98274994 98365796 98502856 98618352 98698741 98744112 98756874 98734725 98680931 98598260 98473245 98303014
987.2 98303014 98115206 97940588 97789884 97681004 97656047 97732264 97857046 97954631 97992116 97954446 97811025
1009.6 97811025 97548491 97185713 96738690 96208936 95595688 94910520 94169188 93374306 92539841 91689372
1030 91689372 90840876 90020734 89268124 88619685 88096839 87719774 87511134 87466013 87554681 87745315
1050.4 87745315 88008869 88332814 88729346 89253914 89963597 90801036 91623431 92330706 92872924 93246919
1070.8 93246919 93546468 93907517 94370049 94854856 95282465 95642155 95951456 96221441 96453261 96625233
1091.2 96625233 96712369 96725899 96699989 96649659 96554989 96394300 96177006 95936739 95711565 95555162 95545220
1113.6 95545220 95724499 96076494 96570557 97172135 97840542 98533702 99188346 99734688 100141156 100420058
$$ packed form
964.7I8274994R0802J37060J15496Q0389M5371J2762k2149n3794q2671j25015j70231
987.2I8303014j87808j74618j50704j08880k4957P6217J24782R7585L7485l7670j43421
1009.6I7811025k62534l62778m47023n29754o13248o85168p41332p94882q34465q50469
1030I1689372q48496q20142p52610o48439n22846l77065k08640m5121Q8668J90634
1050.4H7745315K63554L23945L96532N24568P09683Q37439Q22395P07275N42218L73995
1070.8I3246919K99549L61049M62532M84807M27609L59690L09301K69985K31820J71972
1091.2I6625233Q7136J3530k5910n0330r4670j60689k17294k40267k25174j56403r942
1113.6I5545220J79279L51995M94063O01578O68407O93160O54644N46342M06468K78902
$$ plain form
1134 100420058 100607133 100745118 100872767 100996554 101090169 101148129 101189840 101225102 101258945 101294279 101321232
1156.5 101321232 101328039 101320159 101308131 101290298 101268971 101251662 101236355 101217556 101195097 101167607 101122046 101056910
1180.9 101056910 100987256 100915074 100838053 100756800 100666535 100572944 100492096 100428689 100375402 100330031 100296116
1203.4 100296116 100270486 100249183 100231123 100209475 100182247 100150597 100110555 100071549 100047874 100033498 100021625
1225.8 100021625 100013912 100004554 99998552 100008678 100026286 100034308 100026286 100015521 100031960 100076461 100110447 100118256 100115287
1252.3 100115287 100103724 100081825 100059485 100042522 100033188 100036287 100046706 100049806 100038457 100015771 99984920 99950618
1276.8 99950618 99920231 99891770 99859369 99811155 99733847 99632341 99520314 99413085 99314016 99212158 99108452
1299.2 99108452 99015981 98948193 98913074 98901957 98899317 98904872 98928082 98972535 99036092 99115855 99204373 99292260
$$ packed form
1134A00420058J87075J37985J27649J23787R3615N7960M1711L5262L3843L5334K6953
1156.5A01321232O807p880j2028j7833k1327j7309j5307j8799k2459k7490m5561o5136
1180.9A01056910o9654p2182p7021q1253r0265r3591q0848o3407n3287m5371l3915
1203.4A00296116k5630k1303j8060k1648k7228l1650m0042l9006k3675j4376j1873
1225.8A00021625p713r358o002J0126J7608Q022q022j0765J6439M4501L3986P809k969
1252.3A00115287j1563k1899k2340j6963r334L099J0419L100j1349k2686l0851l4302
1276.8I9950618l0387k8461l2401m8214p7308j01506j12027j07229r9069j01858j03706
1299.2I9108452r2471o7788l5119j1117k640N555K3210M4453O3557P9763Q8518Q7887
$$ plain form
1323.7 99292260 99371904 99435866 99468267 99451035 99392086 99306899 99194932 99084592 99030775 99023503 98998922
1346.2 98998922 98923212 98816133 98726749 98692912 98695225 98672360 98575759 98386174 98138058 97894794 97689283
1368.6 97689283 97501576 97186542 96591920 95998317 95970523 96591288 97368765 97924161 98272163 98501456
1389 98501456 98638773 98684615 98638892 98559296 98505425 98480558 98457789 98429751 98436809 98486459 98509002 98446006
1413.5 98446006 98310119 98150176 98034251 98018152 98037422 97985506 97803754 97458804 97006780 96541429
1433.9 96541429 95994055 95386869 94909126 94499642 94060832 93530113 92779797 91778737 90595788
1452.2 90595788 89336389 88023543 86888075 86125749 85276651 84040171 83150047 83767009 86167622
1470.6 86167622 89811796 92771429 94155449 94657445 94817913 95019591 95524979 96333796 97218233
$$ packed form
1323.7I9292260P9644O3962L2401j7232n8949q5187j11967j10340n3817p272k4581
1346.2I8998922p5710j07079q9384l3837K313k2865r6601j89585k48116k43264k05511
1368.6I7689283j87707l15034n94622n93603k7794O20765P77477N55396L48002K29293
1389I8501456J37317M5842m5723p9596n3871k4867k2769k8038P058M9650K2543o2996
1413.5I8446006j35887j59943j15925j6099J9270n1916j81752l44950m52024m65351
1433.9I6541429n47374o07186m77743m09484m38810n30719p50316j001060j182949
1452.2I0595788j259399j312846j135468p62326q49098j236480q90124O16962K400613
1470.6H6167622L644174K959633J384020N01996J60468K01678N05388Q08817Q84437
$$ plain form
1488.9 97218233 97989643 98713267 99555397 100514126 101307523 101825404 102179813 102476788 102707410 102824354
1509.3 102824354 102912819 103007901 103098714 103182220 103262043 103320420 103350151 103376138 103407478 103447306 103495908
1531.8 103495908 103532815 103570676 103641844 103705084 103688765 103654170 103644478 103645349 103652215 103673029 103713667 103778327
1556.2 103778327 103806305 103728402 103681898 103686929 103706384 103721762 103707051 103701270 103717029 103689849 103635609 103606319
1580.7 103606319 103584039 103561401 103540790 103517044 103490162 103462648 103431046 103394175 103352988 103301525 103242099
1603.2 103242099 103186154 103129697 103059542 102988958 102943707 102894843 102786481 102681112 102616513 102547884 102465320
1625.6 102465320 102372336 102286887 102250683 102241588 102172554 102060902 101991284 101964104 101969695 101969993 101946115 101958704
1650.1 101958704 101983356 101933849 101906562 101948154 102016485 102089822 102171695 102279305 102404380 102513766 102607155
$$ packed form
1488.9I7218233P71410P23624Q42130R58729P93397N17881L54409K96975K30622J16944
1509.3A02824354Q8465R5082R0813Q3506P9823N8377K9731K5987L1340L9828M8602
1531.8A03495908L6907L7861P1168O3240j6319l4595r692Q71O866K0814M0638O4660
1556.2A03778327K7978p7903m6504N031J9455J5378j4711n781J5759k7180n4240k9290
1580.7A03606319k2280k2638k0611k3746k6882k7514l1602l6871m1187n1463n9426
1603.2A03242099n5945n6457p0155p0584m5251m8864j08362j05369o4599o8629q2564
1625.6A02465320r2984q5449l6204r095o9034j11652o9618k7180N591K98k3878J2589
1650.1A01958704K4652m9507k7287M1592O8331P3337Q1873J07610J25075J09386R3389
$$ plain form
1672.5 102607155 102710176 102819228 102937925 103078794 103219903 103306544 103350389 103413475 103502667 103616607
1692.9 103616607 103738868 103841197 103917396 103945804 103960502 103992891 104019928 104048193 104091644 104145920 104194844
1715.3 104194844 104206574 104188347 104185677 104202485 104227638 104250646 104278910 104325294 104341125 104315329 104322934 104333389
1739.8 104333389 104313779 104307175 104328465 104358721 104377222 104382241 104393077 104405165 104419994 104446328 104460347 104463196
1764.3 104463196 104473972 104493856 104520130 104518545 104490507 104486656 104501748 104512703 104524338 104535198 104541433 104559898
1788.8 104559898 104586017 104592967 104591560 104601085 104607594 104603779 104600823 104606521 104618096 104625332 104620159 104612863 104614758 104623926
1817.3 104623926 104640627 104661858 104674530 104675317 104682589 104690135 104686522 104691124 104700089 104699135 104698825 104710507 104716229 104707670
1845.9 104707670 104706812 104712176 104715323 104716122 104713881 104710972 104711473 104716432 104727900 104746258 104755044 104741931 104727137 104726446
$$ packed form
1672.5A02607155J03021J09052J18697J40869J41109Q6641M3845O3086Q9192J13940
1692.9A03616607J22261J02329P6199K8408J4698L2389K7037K8265M3451N4276M8924
1715.3A04194844J1730j8227k670J6808K5153K3008K8264M6384J5831k5796P605J0455
1739.8A04333389j9610o604K1290L0256J8501N019J0836J2088J4829K6334J4019K849
1764.3A04463196J0776J9884K6274j585k8038l851J5092J0955J1635J0860O235J8465
1788.8A04559898K6119O950j407R525O509l815k956N698J1575P236n173p296J895R168
1817.3A04623926J6701K1231J2672P87P272P546l613M602Q965r54l10J1682N722q559
1845.9A04707670q58N364L147P99k241k909N01M959J1468J8358Q786j3113j4794o91
$$ plain form
1874.4 104726446 104732227 104737175 104740214 104736912 104728150 104723215 104721081 104717648 104717195 104714704 104708469 104710519 104721904 104731548
1903 104731548 104735076 104735267 104736900 104740465 104742706 104747844 104754448 104754770 104749298 104741955 104738712 104734302 104723144 104720020 104728448
1933.6 104728448 104735184 104740250 104745603 104741991 104731357 104725742 104726124 104728448 104727101 104722095 104718649 104714799 104712498 104717708
1962.1 104717708 104724526 104723144 104715312 104710448 104707348 104701674 104701781 104706085 104704261 104699922 104697919 104699600 104704487 104703033
1990.7 104703033 104693758 104687583 104684722 104680133 104671216 104654765 104640818 104638588 104632902 104615390 104597831 104581547 104562664
2017.2 104562664 104546213 104533648 104524553 104524612 104526436 104518628 104509902 104504359 104500842 104503703 104507804 104503989 104496694 104499483
2045.8 104499483 104506981 104507887 104508519 104512441 104513085 104508662 104505122 104504502 104503274 104503000 104503739 104500830 104498887 104503036 104507685 104509509
2078.4 104509509 104513299 104518223 104517686 104515243 104519176 104528546 104536068 104540038 104541564 104535437 104524994 104521525 104525030 104532480
$$ packed form
1874.4A04726446N781M948L039l302q762m935k134l433m53k491o235K050J1385R644
1903A04731548L528J91J633L565K241N138O604L22n472p343l243m410j1158l124Q428
1933.6A04728448O736N066N353l612j0634n615L82K324j347n006l446l850k301N210
1962.1A04717708O818j382p832m864l100n674J07M304j824m339k003J681M887j454
1990.7A04703033r275o175k861m589q917j6451j3947k230n686j7512j7559j6284j8883
2017.2A04562664j6451j2565r095N9J824p808q726n543l517K861M101l815p295K789
2045.8A04499483P498R06O32L922O44m423l540o20j228k74P39k909j943M149M649J824
2078.4A04509509L790M924n37k443L933R370P522L970J526o127j0443l469L505P450
$$ plain form
2106.9 104532480 104543626 104550087 104545808 104538000 104537606 104545367 104549646 104549551 104554129 104558313 104551876 104540157 104535329 104537046
2135.5 104537046 104540002 104544055 104544091 104534829 104524469 104520512 104519892 104519153 104521239 104532290 104545510 104547453 104540372 104538047
2164.1 104538047 104545665 104555309 104561579 104567671 104576075 104580367 104576004 104574633 104582822 104592001 104598713 104602861 104601777 104598093
2192.6 104598093 104601097 104614365 104628944 104635644 104635322 104634011 104636037 104644024 104656982 104670942 104679120 104678261 104677427 104682696
2221.2 104682696 104690623 104695225 104691541 104689205 104699671 104713917 104721177 104722214 104723847 104729438 104731977 104729640 104729426 104729545
2249.7 104729545 104722500 104711711 104703903 104700434 104699063 104697013 104698813 104708993 104720104 104720247 104711485 104705429 104703891 104702640
2278.3 104702640 104699290 104694510 104689527 104687107 104685080 104677045 104668128 104658711 104642928 104631829 104642642 104666138 104675567
2304.8 104675567 104673541 104672754 104673159 104679430 104694843 104720187 104755104 104796517 104828441 104839504 104843438 104855168 104877877
$$ packed form
2106.9A04532480J1146O461m279p808l94P761M279r5M578M184o437j1719m828J717
2135.5A04537046K956M053L6r262j0360l957o20p39K086J1051J3220J943p081k325
2164.1A04538047P618R644O270O092Q404M292m363j371Q189R179O712M148j084l684
2192.6A04598093L004J3268J4579O700l22j311K026P987J2958J3960Q178q59q34N269
2221.2A04682696P927M602l684k336J0466J4246P260J037J633N591K539k337k14J19
2249.7A04729545p045j0789p808l469j371k050J800J0180J1111J43q762o056j538j251
2278.3A04702640l350m780m983k420k027q035q917r417j5783j1099J0813K3496R429
2304.8A04675567k026p87M05O271J5413K5344L4917M1413L1924J1063L934J1730K2709
$$ plain form
2331.3 104877877 104897070 104910243 104925108 104925132 104914331 104891527 104823434 104772723 104804933 104904568 105019212 105096519
2355.8 105096519 105158854 105216050 105193782 105099261 105012405 104947233 104874897 104785693 104715133 104686737 104675114
2378.2 104675114 104664993 104659748 104658067 104659724 104664552 104666841 104667163 104674160 104683685 104680777 104665601 104659116 104668546 104675484
2406.8 104675484 104671013 104660332 104652321 104655766 104662466 104657531 104646170 104639709 104637051 104634392 104629910 104621363 104607809
2433.3 104607809 104594195 104591501 104597867 104598427 104595149 104596853 104593539 104580295 104570055 104563880 104553258 104541910 104534614
2459.8 104534614 104531741 104531848 104526877 104510665 104492128 104482460 104476225 104465437 104452670 104440677 104427004 104407704 104384339
2486.3 104384339 104368913 104365289 104360676 104349065 104337013 104327464 104320931 104315615 104304469 104291773 104280114 104258347
2510.8 104258347 104233372 104218042 104205215 104191339 104181027 104173517 104168403 104162323 104149377 104133320 104120135 104109347
$$ packed form
2331.3A04877877J9193J3173J4865K4j0801k2804o8093n0711L2210R9635J14644P7307
2355.8A05096519O2335N7196k2268r4521q6856o5172p2336q9204p0560k8396j1623
2378.2A04675114j0121n245j681J657M828K289L22O997R525k908j5176o485R430O938
2406.8A04675484m471j0681q011L445O700m935j1361o461k658k659m482q547j3554
2433.3A04607809j3614k694O366N60l278J704l314j3244j0240o175j0622j1348p296
2459.8A04534614k873J07m971j6212j8537r668o235j0788j2767j1993j3673j9300k3365
2486.3A04384339j5426l624m613j1611j2052r549o533n316j1146j2696j1659k1767
2510.8A04258347k4975j5330j2827j3876j0312p510n114o080j2946j6057j3185j0788
$$ plain form
2535.3 104109347 104103768 104105008 104100800 104084730 104069448 104063523 104059517 104051030 104036164 104016900 103999174 103983355 103966045
2561.8 103966045 103948867 103933978 103914237 103887737 103862667 103840458 103817689 103793824 103766525 103732276 103697610
2584.2 103697610 103670382 103650272 103634083 103611720 103574383 103533030 103500628 103473520 103451037 103429174 103396928
2606.6 103396928 103361499 103332973 103303730 103269112 103237641 103208947 103176260 103144157 103115380 103082931 103043854
2629.1 103043854 103001487 102962542 102935290 102914846 102891052 102859569 102819073 102778399 102739072 102691638 102640343
2651.5 102640343 102589881 102533114 102475786 102429986 102383101 102322638 102259624 102200007 102144933 102095079 102047634
2673.9 102047634 102008510 101977348 101954198 101944387 101941311 101936042 101923394 101906955 101888466 101860535 101823461 101783609
2698.4 101783609 101739740 101683354 101607168 101504278 101378882 101249003 101126254 101012897 100907636 100802064
$$ packed form
2535.3A04109347n579J240m208j6070j5282n925m006q487j4866j9264j7726j5819j7310
2561.8A03966045j7178j4889j9741k6500k5070k2209k2769k3865k7299l4249l4666
2584.2A03697610k7228k0110j6189k2363l7337m1353l2402k7108k2483k1863l2246
2606.6A03396928l5429k8526k9243l4618l1471k8694l2687l2103k8777l2449l9077
2629.1A03043854m2367l8945k7252k0444k3794l1483m0496m0674l9327m7434n1295
2651.5A02640343n0462n6767n7328m5800m6885o0463o3014n9617n5074m9854m7445
2673.9A02047634l9124l1162k3150r811l076n269j2648j6439j8489k7931l7074l9852
2698.4A01783609m3869n6386p6186j02890j25396j29879j22749j13357j05261j05572
$$ plain form
2718.8 100802064 100692844 100585306 100475311 100373149 100300932 100258851 100237918 100220573 100186396 100133264 100056922
2741.2 100056922 99929124 99736786 99501288 99224341 98890686 98501730 98067701 97628051 97252697 96989870
2761.6 96989870 96847332 96800143 96788448 96741837 96604782 96361005 96040863 95675397 95296097 94959277
2782 94959277 94718313 94588721 94556487 94611901 94728100 94846231 94933611 95010990 95105249 95198703 95245343
2804.5 95245343 95208549 95083863 94920063 94774246 94668555 94590878 94485235 94284624 93960375 93520236
2824.9 93520236 92960817 92238218 91297883 90101200 88615757 86773890 84403175 81200033 76908970
2843.2 76908970 71679431 66270447 61775529 59041941 58359838 59521675 62032622 65335625 68908238
2861.6 68908238 72219884 74761248 76256019 76883870 77249163 77926916 78964704 79959977 80545139
$$ packed form
2718.8A00802064j09220j07538j09995j02162p2217m2081k0933j7345l4177n3132p6342
2741.2A00056922j27798j92338k35498k76947l33655l88956m34029m39650l75354k62827
2761.6I6989870j42538m7189j1695m6611j37055k43777l20142l65466l79300l36820
2782I4959277k40964j29592l2234N5414J16199J18131Q7380P7379R4259R3454M6640
2804.5I5245343l6794j24686j63800j45817j05691p7677j05643k00611l24249m40139
2824.9I3520236n59419p22599r40335j196683j485443j841867k370715l203142m291063
2843.2G6908970n229539n408984m494918k733588o82103J161837K510947L303003L572613
2861.6F8908238L311646K541364J494771O27851L65293O77753J037788R95273N85162
$$ plain form
2879.9 80545139 80637866 80303067 79612678 78653014 77524537 76311553 75068343 73817641 72546625
2898.3 72546625 71227181 69820404 68236184 66337049 64000690 61206686 58098918 54934865
2914.6 54934865 51968759 49436656 47596329 46672228 46732724 47673878 49309310 51449996 53981251
2933 53981251 56831890 59882462 62948406 65825814 68331844 70288217 71511596 71910638 71658552
2951.3 71658552 71242642 71217310 71888751 73270249 75250465 77706432 80473357 83310997 85970402
2969.7 85970402 88280356 90193623 91762412 93058753 94151795 95112610 95975238 96734077 97383386
2988 97383386 97926861 98388505 98798120 99150109 99435914 99660707 99822593 99932653 99992722 99965662
3008.4 99965662 99828875 99618703 99394768 99219871 99198484 99412972 99774414 100098634 100304723 100413966
$$ packed form
2879.9H0545139R2727l34799o90389r59664j128477j212984j243210j250702j271016
2898.3G2546625j319444j406777j584220j899135k336359k794004l107768l164053
2914.6E4934865k966106k532103j840327r24101O0496R41154J635432K140686K531255
2933E3981251K850639L050572L065944K877408K506030J956373J223379L99042k52086
2951.3G1658552m15910k5332O71441J381498J980216K455967K766925K837640K659405
2969.7H5970402K309954J913267J568789J296341J093042R60815Q62628P58839O49309
2988I7383386N43475M61644M09615L51989K85805K24793J61886J10060O0069k7060
3008.4I9965662j36787k10172k23935j74897k1387K14488L61442L24220K06089J09243
$$ plain form
3028.8 100413966 100470138 100510550 100562513 100630569 100685430 100722611 100773227 100837278 100886583 100904548 100910974 100931168
3053.3 100931168 100950968 100957787 100948882 100915682 100864661 100810111 100772786 100761545 100747240 100696242 100607371 100518024
3077.8 100518024 100467980 100433576 100380254 100320601 100256646 100186348 100123775 100063205 99984980 99894744 99814886
3100.2 99814886 99747533 99672341 99572366 99462819 99365628 99262190 99132502 98998070 98881894 98794943 98728853
3122.6 98728853 98650759 98542374 98414522 98295492 98184150 98051339 97891933 97735375 97611052 97500610
3143 97500610 97373128 97228736 97068346 96897358 96743089 96610481 96473294 96320409 96159965 95995969
3163.4 95995969 95828038 95653623 95469064 95281166 95104784 94935679 94752866 94563228 94377166 94185704
3183.8 94185704 93990761 93791527 93586463 93391573 93221390 93053883 92851186 92622179 92406774 92213720
$$ packed form
3028.8A00413966N6172M0412N1963O8056N4861L7181N0616O4051M9305J7965O426K0194
3053.3A00931168J9800O819q905l3200n1021n4550l7325j1241j4305n0998q8871q9347
3077.8A00518024n0044l4404n3322n9653o3955p0298o2573o0570p8225r0236p9858
3100.2I9814886o7353p5192r9975j09547r7191j03438j29688j34432j16176q6951o6090
3122.6I8728853p8094j08385j27852j19030j11342j32811j59406j56558j24323j10442
3143I7500610j27482j44392j60390j70988j54269j32608j37187j52885j60444j63996
3163.4I5995969j67931j74415j84559j87898j76382j69105j82813j89638j86062j91462
3183.8I4185704j94943j99234k05064j94890j70183j67507k02697k29007k15405j93054
$$ plain form
3204.2 92213720 92018664 91815567 91618979 91419721 91208607 90999258 90793997 90585047 90376878 90171826
3224.6 90171826 89960402 89751220 89547563 89341295 89146680 88958651 88758665 88558334 88371634 88187104
3245 88187104 88000339 87818921 87634945 87439793 87241971 87058330 86885953 86707008 86517203 86329317
3265.4 86329317 86150402 85973096 85800302 85638869 85477060 85302716 85121775 84940124 84761453 84591371
3285.8 84591371 84427577 84270781 84121692 83968025 83807653 83648396 83485508 83318555 83160430 83011097
3306.2 83011097 82861501 82713872 82561368 82394582 82230359 82084388 81949675 81819260 81691504 81558973
3326.6 81558973 81427068 81305879 81184077 81061029 80957359 80863363 80758095 80658388 80573672 80496371
3347 80496371 80442071 80400288 80335963 80270934 80238628 80220807 80201769 80193323 80203611 80225801 80245703 80250931
$$ packed form
3204.2I2213720j95056k03097j96588j99258k11114k09349k05261k08950k08169k05052
3224.6I0171826k11424k09182k03657k06268j94615j88029j99986k00331j86700j84530
3245H8187104j86765j81418j83976j95152j97822j83641j72377j78945j89805j87886
3265.4H6329317j78915j77306j72794j61433j61809j74344j80941j81651j78671j70082
3285.8H4591371j63794j56796j49089j53667j60372j59257j62888j66953j58125j49333
3306.2H3011097j49596j47629j52504j66786j64223j45971j34713j30415j27756j32531
3326.6H1558973j31905j21189j21802j23048j03670r3996j05268r9707q4716p7301
3347H0496371n4300m1783o4325o5029l2306j7821j9038q446J0288K2190J9902N228
$$ plain form
3371.5 80250931 80250257 80269098 80313551 80369401 80422807 80476284 80536890 80604535 80686498 80777133 80861419 80949742
3395.9 80949742 81051844 81164402 81283814 81395721 81494272 81600970 81738728 81894290 82042420 82190317
3416.3 82190317 82348406 82497394 82633078 82786864 82970488 83170849 83372182 83566451 83764869 83969480
3436.7 83969480 84173858 84391397 84621882 84844214 85053849 85265142 85495120 85739398 85982656 86214709
3457.1 86214709 86438441 86672175 86916822 87161267 87414819 87688661 87963611 88213128 88451749 88708377
3477.5 88708377 88976890 89247972 89514601 89766365 90019369 90287727 90553606 90809286 91067439 91320354
3497.9 91320354 91566378 91821319 92087704 92366421 92661071 92944348 93194830 93447167 93714410 93973655
3518.3 93973655 94225276 94479710 94741207 95006108 95261931 95512283 95763767 96003795 96230924 96455652
$$ packed form
3371.5H0250931o74J8841M4453N5850N3406N3477O0606O7645Q1963R0635Q4286Q8323
3395.9H0949742J02102J12558J19412J11907R8551J06698J37758J55562J48130J47897
3416.3H2190317J58089J48988J35684J53786J83624K00361K01333J94269J98418K04611
3436.7H3969480K04378K17539K30485K22332K09635K11293K29978K44278K43258K32053
3457.1H6214709K23732K33734K44647K44445K53552K73842K74950K49517K38621K56628
3477.5H8708377K68513K71082K66629K51764K53004K68358K65879K55680K58153K52915
3497.9I1320354K46024K54941K66385K78717K94650K83277K50482K52337K67243K59245
3518.3I3973655K51621K54434K61497K64901K55823K50352K51484K40028K27129K24728
$$ plain form
3538.7 96455652 96681607 96914089 97153640 97398990 97656578 97917694 98162842 98382938 98583353 98777419
3559.1 98777419 98980814 99208468 99446142 99646384 99808437 99989814 100195634 100392199 100577521 100760341
3579.5 100760341 100932980 101100171 101273584 101441669 101597428 101760900 101928341 102069700 102182746 102295315
3599.9 102295315 102433014 102603781 102784073 102934742 103055584 103169394 103279305 103407741 103533971 103616786
3620.3 103616786 103714824 103862143 104017758 104121602 104167891 104222453 104282188 104348564 104435706 104529679 104635692
3642.7 104635692 104760623 104882824 104941201 104947340 105011272 105100393 105123854 105122828 105171955 105251265 105332160
3665.2 105332160 105423045 105487859 105502057 105532837 105540824 105497336 105488753 105523276 105586874 105654979 105693793 105720091
3689.6 105720091 105762410 105802619 105835021 105873990 105920386 105947018 105947852 105964148 106005967 106039250 106017196 105969191
$$ packed form
3538.7I6455652K25955K32482K39551K45350K57588K61116K45148K20096K00415J94066
3559.1I8777419K03395K27654K37674K00242J62053J81377K05820J96565J85322J82820
3579.5A00760341J72639J67191J73413J68085J55759J63472J67441J41359J13046J12569
3599.9A02295315J37699J70767J80292J50669J20842J13810J09911J28436J26230Q2815
3620.3A03616786R8038J47319J55615J03844M6289N4562N9735O6376Q7142R3973J06013
3642.7A04635692J24931J22201N8377O139O3932Q9121K3461j026M9127P9310Q0895
3665.2A05332160R0885O4814J4198L0780P987m3488q583L4523O3598O8105L8814K6298
3689.6A05720091M2319M0209L2402L8969M6396K6632Q34J6296M1819L3283k2054m8005
$$ plain form
3714.1 105969191 105961227 105990279 106024218 106038857 106033170 106029320 106049776 106079435 106086624 106055665 105981648 105940592
3738.6 105940592 106026566 106178474 106228995 106203508 106223536 106198585 106103826 106071091 106099713 106110036 106083000
3761 106083000 106067896 106082892 106106460 106111610 106091893 106075466 106077898 106084526 106072938 106060886 106064975 106058407 106041360
3787.5 106041360 106035805 106054902 106093836 106125152 106154490 106184995 106163347 106136036 106144369 106114018 106077957 106105840
3812 106105840 106154537 106158161 106155550 106160009 106127608 106117249 106134629 106140935 106141961 106147158 106171024 106202304 106197381
3838.5 106197381 106165636 106129742 106089830 106088638 106154215 106260133 106288469 106165469 106097686 106125879 106166267
3861 106166267 106182921 106169879 106165993 106167376 106136620 106100452 106075382 106078625 106092918 106077170 106063366 106053233
3885.4 106053233 106055045 106083286 106073093 106036580 106052494 106113112 106151080 106128657 106080830 106033552 105995238 105984581
$$ packed form
3714.1A05969191p964K9052L3939J4639n687l850K0456K9659P189l0959p4017m1056
3738.6A05940592Q5974J51908N0521k5487K0028k4951r4759l2735K8622J0323k7036
3761A06083000j5104J4996K3568N150j9717j6427K432O628j1588j2052M089o568j7047
3787.5A06041360n555J9097L8934L1316K9338L0505k1648k7311Q333l0351l6061K7883
3812A06105840M8697L624k611M459l2401j0359J7380O306J026N197K3866L1280m923
3838.5A06197381l1745l5894l9912j192O5577J05918K8336j23000o7783K8193M0388
3861A06166267J6654j3042l886J383l0756l6168k5070L243J4293j5748j3804j0133
3885.4A06053233J812K8241j0193l6513J5914O0618L7968k2423m7827m7278l8314j0657
$$ plain form
3909.9 105984581 106008804 106039023 106045330 106046784 106056786 106051159 106020033 105993879 105998957 106013918 106009448 105991852
3934.4 105991852 105982935 105988562 106004143 106010628 106004882 106002319 105996644 105987895 105982959 105976021 105970335 105974305 105973840 105954325
3962.9 105954325 105941236 105953217 105957937 105937648 105918932 105914211 105915391 105921137 105921817 105908751 105897188 105892134 105885351
3989.5 105885351 105877674 105869448 105865622 105879009
3997.6 105879009
$$ packed form
3909.9A05984581K4223L0219O307J454J0002n627l1126k6154N078J4961m470j7596
3934.4A05991852q917N627J5581O485n746k563n675q749m936o938n686L970m65j9515
3962.9A05954325j3089J1981M720k0289j8716m721J180N746O80j3066j1563n054o783
3989.5A05885351p677q226l826J3387
3997.6A05879009
##END=$$ End of the data block
