##TITLE=Rachel 2 $$ Begin of the data block
##JCAMP-DX=5.00 $$ ACD/SpecManager v 10.08
##SPECTROMETER/DATA SYSTEM=Alpha
##DATE=29 Aug 2014 15:46:20
##DATA TYPE=INFRARED SPECTRUM
##DATA CLASS=XYDATA
##ORIGIN=
##OWNER=
##NPOINTS=1667
##FIRSTX=599.64648438
##LASTX=3997.64306641
##MAXX=3997.64306641
##MINX=599.64648438
##MAXY=0.98535645
##MINY=0.79189372
##XFACTOR=1.0000000000
##YFACTOR=1.000000000000000e-9
##FIRSTY=0.90546107
##DELTAX=2.03961372
##XUNITS=1/CM
##YUNITS=ARBITRARY UNITS
##XYDATA=(X++(Y..Y))
599.6I05461073q910000n331755M60684N976439R078741R043097P336915N465567L784299
618I32365060K073586K13802j151204j429916j173138j129687j003325l67821M58360
636.4I28855717P41840L88681K76328Q02695J350165J785934K180397J944423J448691
654.7I39774871J509726K063990K381742J792371J53422k061307j884997M94301J93238
673.1I44417357o82175m89771L6716K81930L78549O62506J107395J152038P53522P20144
693.5I48338211J159370J677632K027929K006828J816988J706601J565098J326859
709.8I61625516J088262P61092L82423K49624L85344M73261K84910K2114m9055O5386
730.2I65288877J82450J00255q7320r9600j3769O557l3557j34588k56180k18928O2227
$$ y = [905461073, 896551073, 891219318, 891680002, 897656441, 906735182, 915778279, 923115194, 928580761, 932365060, 934438646, 934652448, 933501244, 932071328, 930898190, 929768503, 928765178, 928397357, 928855717, 929597557, 929986238, 930262566, 931065261, 932415426, 934201360, 936381757, 938326180, 939774871, 941284597, 943348587, 945730329, 947522700, 947676122, 945614815, 943729818, 944224119, 944417357, 943735182, 943245411, 943282127, 943564057, 943942606, 944605112, 945712507, 946864545, 947618067, 948338211, 949497581, 951175213, 953203142, 955209970, 957026958, 958733559, 960298657, 961625516, 962713778, 963474870, 963857293, 964106917, 964492261, 964965522, 965250432, 965272546, 965223491, 965288877, 965471327, 965571582, 965484262, 965384662, 965370893, 965377450, 965343893, 965209305, 964953125, 964734197, 964796424]
752.6I64796424J12653k13862l22282j17779M5478R3878N4538m3809j03712p2062j37389
775.1I64092076l49403l45707r2208n841j98960l25263l79384n31971o64830q27849
795.4I60370660r87470j132191j423597j865327k422273k955556l308416l461480l274858
813.8I39539492k699613j963914j242459p48694o40094p02918r52064j482606j806140
832.2I27300990j715064j436055j107931r18985p82549m22120L3617K13861J6988l91841
852.6I20790911o22750l32355L30925Q18729Q47578P28906O58512O77406Q38399Q47817
873I25584078N09918O139m90368q93056j222134j455307j368284j000464n45800M7207
893.4I19171929P80642J342953J532912J497388J369238J311659J471699J698494J742184
$$ y = [964796424, 964909077, 964695215, 964372933, 964255154, 964300632, 964394510, 964449048, 964405239, 964301527, 964229465, 964092076, 963742673, 963396966, 963304758, 963298917, 963099957, 962774694, 962395310, 961863339, 961198509, 960370660, 959383190, 958250999, 956827402, 954962075, 952539802, 949584246, 946275830, 942814350, 939539492, 936839879, 934875965, 933633506, 932884812, 932244718, 931541800, 930589736, 929107130, 927300990, 925585926, 924149871, 923041940, 922122955, 921340406, 920918286, 920951903, 921165764, 921182752, 920790911, 920168161, 919835806, 920166731, 920985460, 921833038, 922561944, 923220456, 923897862, 924736261, 925584078, 926093996, 926100135, 925609767, 924716711, 923494577, 922039270, 920670986, 919670522, 919124722, 919171929, 919952571, 921295524, 922828436, 924325824, 925695062, 927006721, 928478420, 930176914, 931919098]
911.7I31919098J540124J183391Q11577M25815r1850o42360j026153j185298j245737
930.1I31688607j447559j896858k459109l058612l715515m303932m736364n006016
946.4I05064642m975855m518151l767908k898633j979590r14573L48031J356781J742661
964.7H89457405J865625K309918L066540L605545L487289K735257J837671J276314
981.1I09641564J038670P44582K93910j23679m56632p93874j190305j729726k589822
999.4I04834688l769994n032301o108284o743670o665766n750596m195035k398968
1015.7H64170074o38902Q87037J828491J978636J393676K39253j149416k455413l386856
1034.1H62866580l788471m060626m539311m846334m416347l243744j765490k89976
$$ y = [931919098, 933459222, 934642613, 935454190, 935880005, 935788155, 935145795, 934119642, 932934344, 931688607, 930241048, 928344190, 925885081, 922826469, 919110954, 914807022, 910070658, 905064642, 900088787, 895570636, 891802728, 888904095, 886924505, 886009932, 886357963, 887714744, 889457405, 891323030, 893632948, 896699488, 900305033, 903792322, 906527579, 908365250, 909641564, 910680234, 911424816, 911718726, 911595047, 911138415, 910344541, 909154236, 907424510, 904834688, 901064694, 896032393, 889924109, 883180439, 876514673, 870764077, 866569042, 864170074, 863531172, 864418209, 866246700, 868225336, 869619012, 869858265, 868708849, 866253436, 862866580, 859078109, 855017483, 850478172, 845631838, 841215491, 837971747, 836206257, 835916281]
1050.4H35916281R69827K047360L139973L886640L925442L617943L354489L255487
1066.7H60113442L347576L597676M018367M519820M923582N008280M578948L547192
1083H93654883J979530J57177j619279l106952m091442m284322l520429k001643j2100
1101.4H77155423K219856M411638O142676P028579O957054O049932M766166L711223
1117.7I18442547L048539K482892J819193J142740N63979J06335k94685p09415j059532
1136.1I25542593j242995j386822j591980j722574j619339j169324m60923J74523N40792
1154.4I17063951P31588P44104M68016R596m86791r42647j338244j722336k081811
1172.8I12445426k366960k596617k866566l184676l524959l911853m284382m667699
$$ y = [835916281, 836886108, 838933468, 842073441, 845960081, 849885523, 853503466, 856857955, 860113442, 863461018, 867058694, 871077061, 875596881, 880520463, 885528743, 890107691, 893654883, 895634413, 895791590, 894172311, 891065359, 886973917, 882689595, 879169166, 877167523, 877155423, 879375279, 883786917, 889929593, 896958172, 903915226, 909965158, 914731324, 918442547, 921491086, 923973978, 925793171, 926935911, 927499890, 927606225, 927311540, 926602125, 925542593, 924299598, 922912776, 921320796, 919598222, 917978883, 916809559, 916348636, 916523159, 917063951, 917795539, 918539643, 919007659, 919017255, 918530464, 917587817, 916249573, 914527237, 912445426, 910078466, 907481849, 904615283, 901430607, 897905648, 893993795, 889709413, 885041714]
1189.1H85041714n111635n540907n903662o198346o545902o979763p393181p764161
1205.4H33604157p983744p826448p196068o149650m855394l566921k388477j334489
1221.7G92302966m09245M62412J257599J860201K288819K769172L241241L445625L472090
1240.1H10690880L408193L235996L018439K749503K492964K395928K437770K481938
1256.4H32911611K523899K652883K790988K833962K862692L016949L328263L697098
1272.7H56618345M077136M411340M514515M367292M221797M194677M283726M561365
1289H91250193M878938M936636M744530M399955L824234L065884K280831J485706P39872
1307.4I21606779K96652L30389Q90911J700639K400995L012657L370821L203631K488017
$$ y = [885041714, 879930079, 874389172, 868485510, 862287164, 855741262, 848761499, 841368318, 833604157, 825620413, 817793965, 810597897, 804448247, 799592853, 796025932, 793637455, 792302966, 791893721, 792356133, 793613732, 795473933, 797762752, 800531924, 803773165, 807218790, 810690880, 814099073, 817335069, 820353508, 823103011, 825595975, 827991903, 830429673, 832911611, 835435510, 838088393, 840879381, 843713343, 846576035, 849592984, 852921247, 856618345, 860695481, 865106821, 869621336, 873988628, 878210425, 882405102, 886688828, 891250193, 896129131, 901065767, 905810297, 910210252, 914034486, 917100370, 919381201, 920866907, 921606779, 921903431, 922233820, 923124731, 924825370, 927226365, 930239022, 933609843, 936813474, 939301491]
1325.8I39301491J522958P67469K11061m46320j198530j804412j982093k138733l043414
1344.1I31189477m333555n251050n688787n964160o425380p241071q662104j0575831
1360.4H77047539j1485338r899557p503331n572974l384293r61363K169550N160749
1376.7H45570982O524622O682873O197869N616248O185889P377685O654024M651665
1393.1H95461857L368497K748668K385498K271831J776516J672327K102972J959145
1409.4I13747311J461744O72460r71020k755522k626539j604795k203763k923310l215074
1427.7H99581492l257632k412975k189040k319753k68102J472175J200139P59185O25253
1446.1H93190742J239299K088368J494825k68221p66337K808810N223929L824175L116310
$$ y = [939301491, 940824449, 941591918, 941802979, 941356659, 940158129, 938353717, 936371624, 934232891, 931189477, 926855922, 921604872, 915916085, 909951925, 903526545, 896285474, 887623370, 877047539, 865562201, 855662644, 848159313, 842586339, 839202046, 838240683, 840410233, 845570982, 852095604, 858778477, 864976346, 870592594, 876778483, 884156168, 890810192, 895461857, 898830354, 901579022, 903964520, 906236351, 908012867, 909685194, 911788166, 913747311, 915209055, 915881515, 914910495, 912154973, 909528434, 907923639, 905719876, 902796566, 899581492, 896323860, 893910885, 891721845, 889402092, 889133990, 890606165, 891806304, 892565489, 893190742, 894430041, 896518409, 898013234, 897745013, 896978676, 899787486, 905011415, 908835590, 911951900]
1464.5I11951900M103481L497184J480043J721024M400373N648374N040586L805757
1480.8I41648722K728581J460076J0192r7811J647710J973510Q6367n56767J082659
1499.1I49983239J506329o68049l691077k205074K858817K955020P70450r14395j172603
1517.5I49422657r19282l67224J177490J564800J445055R64165n00262n04851J59144
1535.8I52441692k014815l452361O01828L552973L215611J628220K99991k32697j087189
1554.2I54953253k878487l323674K605319N081058K225935J29163p12752K31922Q20815
1572.6I59132552p33793m45842J769960J472234K84732o0916o8188j57297k71558l84629
1593I60537255l73006k30551l05652n34356o33597p56503r06884q01206o77884j435279
$$ y = [911951900, 916055381, 919552565, 921032608, 922753632, 927154005, 932802379, 937842965, 941648722, 944377303, 945837379, 945847571, 945749760, 947397470, 949370980, 949457347, 948900580, 949983239, 951489568, 950821519, 947130442, 944925368, 947784185, 950739205, 951509655, 950595260, 949422657, 948503375, 948136151, 949313641, 950878441, 952323496, 953287661, 952787399, 952282548, 952441692, 950426877, 946974516, 947576344, 951129317, 954344928, 955973148, 956273139, 956040442, 954953253, 952074766, 948751092, 951356411, 956437469, 958663404, 958792567, 958079815, 958311737, 959132552, 958398759, 957952917, 959722877, 961195111, 961479843, 961418927, 961350739, 961193442, 960921884, 960537255, 960164249, 959933698, 959628046, 959093690, 958460093, 957703590, 956796706, 955995500, 955317616, 953882337]
1613.4I53882337k666533j824141j69814j102864j869440r74834n73933n70834j399815
1631.7I42730129l509283l432453K98202J292110m26710k478182l511012j343012m26113
1650.1I29193676k623618L5703M389346K779543K40982m93646M11391j11043j765251
1668.4I32057083j068175P3016n59152k60651j59621k108753m297614l010392M43399
1686.8I21109140q4162j930237l536403n677283o029129m758715k682150n88059j101077
1705.1H94721925j500249j519203k867758m875660o721020o987572m697620l998578
1721.5H61554265n694091o919921p447600q100093q619129q805335o172240m142403
1737.8H05653453m312933l186047j572966p73073K4796J973331M399359M860103M827440
$$ y = [953882337, 951215804, 949391663, 949221849, 948118985, 946249545, 945274711, 944700778, 944129944, 942730129, 939220846, 935788393, 936086595, 937378705, 936951995, 934473813, 930962801, 929619789, 929193676, 926570058, 926605761, 930995107, 933774650, 934015632, 933521986, 933933377, 933822334, 932057083, 930988908, 931061924, 930502772, 930242121, 930082500, 927973747, 923676133, 920665741, 921109140, 921024978, 919094741, 915558338, 909881055, 903851926, 899093211, 896411061, 895823002, 894721925, 893221676, 891702473, 888834715, 883959055, 877238035, 870250463, 865552843, 861554265, 855860174, 848940253, 841492653, 833392560, 824773431, 815968096, 809795856, 805653453, 801340520, 798154473, 796581507, 795808434, 795833230, 797806561, 802205920, 807066023, 811893463]
1756.1H11893463N966604P336140R690642J1126697J0624290J0201096R652019J0383367
1772.4H86874318J0718346Q499801O378353N511105N051314M510701L928900K637207
1788.8I34110045J419843K276480L453672K676546J604975J690626K352297K243340
1805.1I51827824J478493R12369J148343J562833J348854R68396Q07107M93109J311
1823.4I60548639L8088J35600K48313J192630J458168P42375M68553K92539n44965
1841.8I64579940p30992P16687J552999J224398Q75116N84244L94345L80814M36365
1860.2I70013916L89934J8358o59465n84782P17223J304090O84559J80424J59919K32339
1880.5I72456515K04801Q7321j80483l57091O6638M26352K58863J79231J45853J132
$$ y = [811893463, 817860067, 825196207, 834886849, 846013546, 856637836, 866838932, 876490951, 886874318, 897592664, 906092465, 912470818, 917981923, 923033237, 927543938, 931472838, 934110045, 935529888, 937806368, 941260040, 943936586, 945541561, 947232187, 949584484, 951827824, 953306317, 954218686, 955367029, 956929862, 958278716, 959247112, 960054219, 960547328, 960548639, 960586727, 960722327, 960970640, 962163270, 963621438, 964363813, 964832366, 965124905, 964579940, 963848948, 964565635, 966118634, 967343032, 968218148, 968802392, 969196737, 969577551, 970013916, 970403850, 970422208, 969762743, 969177961, 969895184, 971199274, 971883833, 972064257, 972224176, 972456515, 972661316, 972748637, 972568154, 972211063, 972277701, 972704053, 972962916, 973142147, 973288000, 973289132]
1900.9I73289132r1672r8765r0003J550K48492L00646j25885l23356J99080M47035
1921.3I73756254M25756O28233N55098L09109J82748J40012J73807J19269j77265l51965
1941.7I75761056Q9943N36919M03106J38819N2333M7803O6221J12891Q6725p15o5089
1964.2I77230012J3292L17157M34398K34068J17302J57177J95801J84655J51694P8440
1984.6I79113996p8738k34604k51948j0550K16364R2388o7830r1851j35958j88709
2005I78362560k03430j68026j07884j51456l40998l93808k17497j37210k57790l51489
2025.4I76032972l86595m53771m20749l13341k66493k38061j83701p5102N9783J29223
2045.8I73884165Q3924k5034m5717L1829Q1479Q6725P7307P5937R9837J38343J52111
$$ y = [973289132, 973197460, 973098695, 973008692, 973010242, 973258734, 973559380, 973433495, 973110139, 973309219, 973756254, 974182010, 974810243, 975365341, 975674450, 975857198, 975997210, 976171017, 976290286, 976113021, 975761056, 975850999, 976387918, 976791024, 976929843, 976982176, 977029979, 977096200, 977209091, 977295816, 977295101, 977230012, 977243304, 977560461, 977994859, 978228927, 978346229, 978503406, 978699207, 978883862, 979035556, 979113996, 979035258, 978800654, 978548706, 978538156, 978754520, 978846908, 978779078, 978687227, 978551269, 978362560, 978159130, 977991104, 977883220, 977731764, 977390766, 976996958, 976779461, 976642251, 976384461, 976032972, 975646377, 975192606, 974771857, 974458516, 974192023, 973953962, 973770261, 973695159, 973754942, 973884165, 973968089, 973943055, 973897338, 973929167, 974010646, 974097371, 974174678, 974250615, 974350452, 974488795, 974640906]
2068.2I74640906R3698K1339j6630j8000l3916j19268j33694q1539j28090j70708j35660
2090.6I73918438j63436j89126j22249p3731p0035m9889K7478J19149J42336J09613
2111I73648548R4414J11878J48296J96040K16365K05218K03789J87874J43647J89125
2131.4I75345194K54989J74463J09553J70291K14576K15769J96576J30832N5552Q225
2151.8I76876020P0274J63019J14620P3492J46508K22862K49863K00927J37210J30475
2172.2I78385270R8347J07348K08855K19524J34587N0366Q166N0306J18017J34886
2192.6I79515672Q2314N603k7538j0490l457L814M0234K443o5565m2796K3127O2883
2217.1I79586244M0352j8179m1604l7671m3571O080O6280M1008K1041J3888k0623j967
$$ y = [974640906, 974734604, 974755943, 974739313, 974721313, 974687397, 974568129, 974434435, 974352896, 974224806, 974054098, 973918438, 973755002, 973565876, 973443627, 973369896, 973299861, 973249972, 973277450, 973396599, 973538935, 973648548, 973742962, 973854840, 974003136, 974199176, 974415541, 974620759, 974824548, 975012422, 975156069, 975345194, 975600183, 975774646, 975884199, 976054490, 976269066, 976484835, 976681411, 976812243, 976867795, 976876020, 976946294, 977109313, 977223933, 977297425, 977443933, 977666795, 977916658, 978117585, 978254795, 978385270, 978483617, 978590965, 978799820, 979019344, 979153931, 979204297, 979212463, 979262769, 979380786, 979515672, 979597986, 979603589, 979576051, 979565561, 979562104, 979565918, 979606152, 979608595, 979543030, 979500234, 979523361, 979586244, 979626596, 979608417, 979566813, 979529142, 979485571, 979491651, 979557931, 979598939, 979619980, 979633868, 979613245, 979611278]
2241.6I79611278O1154Q2612K0385p0930q1479m4465o5267j37926j50799q2791n2989
2264I79088783j7524M7803N1618Q5712J41084J29997J35899J93656J86502N4896n0127
2286.4I80048299n7638q6427j50978j78933j72377k14159l43025m49956m74453n50329
2306.8I77370024o66023o54578o20425o59048p94053j145899j265288p87079n09739
2325.2I70267892p78616q58008n13316j82151j31071k72214l66390k29359K30849J223624
2345.6I68391240J624524K97308j586437k468228k248168j574695m73679M25935R95994
2363.9I63383794J520991J723230J757801J889705J838267J684368J724601J716852
2380.2I77239609J389146Q81970M44054J60694K0922l8326j14024j23680m3273o7472
$$ y = [979611278, 979672432, 979755044, 979775429, 979704499, 979623020, 979578555, 979513288, 979375362, 979224563, 979141772, 979088783, 979071259, 979119062, 979170680, 979256392, 979397476, 979527473, 979663372, 979857028, 980043530, 980098426, 980048299, 979990661, 979904234, 979753256, 979574323, 979401946, 979187787, 978844762, 978394806, 977920353, 977370024, 976704001, 976049423, 975428998, 974769950, 973975897, 972829998, 971564710, 970777631, 970267892, 969489276, 968631268, 968117952, 967935801, 967804730, 967532516, 967166126, 966936767, 967167616, 968391240, 970015764, 970313072, 968726635, 966258407, 964010239, 962435544, 961961865, 962387800, 963383794, 964904785, 966628015, 968385816, 970275521, 972113788, 973798156, 975522757, 977239609, 978628755, 979510725, 979954779, 980115473, 980136395, 980098069, 979984045, 979860365, 979817092, 979749620]
2400.6I79749620j45137j47283j75238k07067j79231j36554n3048L4809L4511K5749
2421I78801131N1558k324n2989L159L0518k5928p6354n7041q047L6657K7418l5048
2445.5I78692710o2942m2737k1159n0783l7909N7876O5506o1632j50919q6486L0279
2467.9I78331804L0935k3186K7418P0989M0472K8252M5717R5725J27673J35005J89662
2490.4I79100466K49445K44081J65940P4803Q6189J74403K12312J95861J84476J75834
2510.8I80863810J34766R0778N9783M8280J21653J74463J00672L1054M5299R5308J19567
2533.2I81885433Q0347J7762Q822n186m1723k2173o7949j50502q2970N8413J24872
2555.6I81805146M8816j05441j50680r5725j20819j64032r9361k7418n0545j45077
$$ y = [979749620, 979604483, 979457200, 979281962, 979074895, 978895664, 978759110, 978706062, 978740871, 978775382, 978801131, 978852689, 978850365, 978797376, 978800535, 978831053, 978805125, 978728771, 978671730, 978663683, 978700340, 978727758, 978692710, 978629768, 978587031, 978565872, 978515089, 978477180, 978535056, 978600562, 978538930, 978388011, 978301525, 978331804, 978362739, 978339553, 978366971, 978437960, 978478432, 978506684, 978552401, 978648126, 978775799, 978910804, 979100466, 979349911, 979593992, 979759932, 979834735, 979920924, 980095327, 980307639, 980503500, 980687976, 980863810, 980998576, 981089354, 981149137, 981197417, 981319070, 981493533, 981594205, 981625259, 981670558, 981765866, 981885433, 981965780, 981983542, 981992364, 981987178, 981945455, 981923282, 981855333, 981704831, 981621861, 981680274, 981805146, 981853962, 981748521, 981597841, 981502116, 981381297, 981217265, 981117904, 981090486, 981039941, 980894864]
2576I80894864j95504j29401o6281j04546j60516j37388q8811l8028L8505O8009P5697
2598.5I80156600O9261K2769L4571M9293p153l2365J2159K6584k5451o5983n5670k4021
2623I80160594o616K1636O1512K8611k9386J9730J01506Q8096K5451L1889O9737M2796
2647.4I80615556n9j5378n901J7643J8775J7226O6638R1910k145r3341l5048N9843
2671.9I80735719J6868r9480j44124j52469j57415r7037p8857j53541j46091j25408
2692.3I79598165k36750k93195k17855j65224j05560n9068j08600j32859p2896K4974
2712.7I78231132M9531k2351n1499l9041n9247p2002L3080J91868K57969K70843J76728
2735.1I78967011L3081R9897K14159J23978j2100k8133L8683Q7917L9458k1755J3828
$$ y = [980894864, 980699360, 980569959, 980503678, 980399132, 980238616, 980101228, 980012417, 979974389, 980012894, 980080903, 980156600, 980225861, 980248630, 980283201, 980332494, 980325341, 980292976, 980305135, 980331719, 980306268, 980240285, 980184615, 980160594, 980153978, 980175614, 980237126, 980265737, 980236351, 980256081, 980357587, 980445683, 980471134, 980503023, 980572760, 980615556, 980615497, 980600119, 980594218, 980611861, 980630636, 980647862, 980714500, 980806410, 980804265, 980710924, 980675876, 980735719, 980752587, 980653107, 980508983, 980356514, 980199099, 980102062, 980023205, 979869664, 979723573, 979598165, 979361415, 979068220, 978850365, 978685141, 978579581, 978520513, 978411913, 978279054, 978206158, 978231132, 978280663, 978258312, 978206813, 978167772, 978108525, 978036523, 978069603, 978261471, 978519440, 978790283, 978967011, 979000092, 979099989, 979314148, 979438126, 979426026, 979397893, 979436576, 979524493, 979563951, 979542196, 979556024]
2757.6I79556024K7418m9054r2328m5061L2782k443j40250j17838K3782K6703n8532
2780I79161203q5890j08183k22206k52008j15693k6822j4424n2572o4492K3961j3292
2802.4I78229582r4115k921L1650J3053N6804J2397q0049j10268p4327o318j4067j37985
2826.9I77823436k80082l57091l54469l33667l58343l43502k33769j53422k02537k44320
2847.3I74962234j87993j14381o9141j21355j53065n3823n3346k05457k50817k32875
2867.7I73519981m29511o53386n37992l31640m65989p33853r12010j070500j132309
2886.1I67252791j069307r77397r54271q92281p12097n53369l71814j45614n3525q6189
2906.5I61436927o0916j3411K4796J80483K64287R7871j96875n07116p80165j154661
$$ y = [979556024, 979583442, 979534388, 979442060, 979396999, 979429781, 979427338, 979287088, 979169250, 979193032, 979219735, 979161203, 979075313, 978967130, 978744924, 978492916, 978377223, 978350401, 978335977, 978283405, 978218913, 978242874, 978229582, 978135467, 978132546, 978164196, 978177249, 978234053, 978246450, 978166401, 978056133, 977981806, 977975488, 977961421, 977823436, 977543354, 977186263, 976831794, 976498127, 976139784, 975796282, 975562513, 975409091, 975206554, 974962234, 974774241, 974659860, 974590719, 974469364, 974316299, 974262476, 974209130, 974003673, 973752856, 973519981, 973090470, 972437084, 971899092, 971567452, 971101463, 970367610, 969455600, 968385100, 967252791, 966183484, 965206087, 964251816, 963359535, 962647438, 962094069, 961722255, 961576641, 961523116, 961436927, 961376011, 961362600, 961387396, 961567879, 961832166, 961930037, 961733162, 961226046, 960445881, 959291220]
2926.8I59291220j591325j939595k367854k712607k695740k482831k196848j878083
2943.2I41426337j693845j697838j864136k104342k195656k050578j741946j278162
2959.5I26799834o31273K7657N04493Q43168J150190J468540J724958J785100J672565
2977.8I35345232J515031J345337J180410J050055R07123P36356P28726Q88765R05514
2996.2I44602549P81596P62045Q63075Q83699P31707O23345O67155O62148N98967N58197
3016.6I51734483N23389N84185P03633Q30233R65058J054824J114964J119674J086354
3034.9I59716797J027346R22322Q83877R32932Q73923O13928M52161O04868O67870
3053.3I66696024M57764L66509M40716L83973J93358J83403L85106M69267M25101L01480
$$ y = [959291220, 957699895, 955760300, 953392446, 950679839, 947984099, 945501268, 943304420, 941426337, 939732492, 938034654, 936170518, 934066176, 931870520, 929819942, 928077996, 926799834, 926168561, 926196218, 926700711, 927543879, 928694069, 930162609, 931887567, 933672667, 935345232, 936860263, 938205600, 939386010, 940436065, 941343188, 942079544, 942808270, 943697035, 944602549, 945384145, 946146190, 947009265, 947892964, 948624671, 949248016, 949915171, 950577319, 951176286, 951734483, 952257872, 952842057, 953545690, 954375923, 955340981, 956395805, 957510769, 958630443, 959716797, 960744143, 961666465, 962550342, 963483274, 964357197, 964971125, 965423286, 966028154, 966696024, 967153788, 967520297, 967961013, 968344986, 968538344, 968721747, 969106853, 969576120, 970001221, 970302701]
3073.7I70302701Q5711P3970K51770L06964K61724K11477K10643K53677K19345J94788
3094.1I72372770K00033J10984J06633K48313K33889O9201O1988J83940K03908Q1241
3114.5I73872900M9293K47955L88444L37720K70188K29656K18094K44796K70069K38657
3134.9I76367772J18672M7088J26362K03907J85490J50442J14978R1076J18315J62005
3155.3I77686107J90675J28031L6419J32680K54333J85132Q8155J25229J82450P8499
3175.7I79087710l7551R180P2598J02162J42157J04130K9981M5419Q1002J22071J17182
3198.1I79876041q225l0160Q4817J18435O6876Q2672J32382J23739J02580Q6784J00911
3220.5I80736852J12831Q1718M4465N186p1943m9233J06930J01567J2636R5725J55628
$$ y = [970302701, 970388412, 970462382, 970714152, 971021116, 971282840, 971494317, 971704960, 971958637, 972177982, 972372770, 972572803, 972683787, 972790420, 973038733, 973272622, 973341823, 973403811, 973587751, 973791659, 973872900, 973922193, 974170148, 974558592, 974896312, 975166500, 975396156, 975614250, 975859046, 976129115, 976367772, 976486444, 976533532, 976659894, 976863801, 977049291, 977199733, 977314711, 977405787, 977524102, 977686107, 977876782, 978004813, 978041232, 978173912, 978428245, 978613377, 978701532, 978826761, 979009211, 979087710, 979050159, 979059339, 979131937, 979234099, 979376256, 979480386, 979510367, 979555786, 979636788, 979758859, 979876041, 979867816, 979837656, 979922473, 980040908, 980107784, 980190456, 980322838, 980446577, 980549157, 980635941, 980736852, 980849683, 980931401, 980975866, 980981052, 980909109, 980859876, 980966806, 981068373, 981081009, 981176734, 981332362]
3243I81332362N9366O7353J38283L3557r2685n2273O5863R5189R7096J47104J64389
3265.4I82055604N6863j23620j44005m8339Q404J12474K00630P5161p4446Q523J14441
3287.8I82241690N0128P331j5199o6459R9301J55270j54257k72035n4300J78635K70069
3310.3I82440174J85012J26422J21891k0206j14500j00374j10329O080J23561Q5830
3330.7I82743561O795j35958j63376J0490O3121m7445o9678M828K7478N8472O1631
3353.1I82559919J1623k3901r2864j00971j14083k74479l69728o8784L66331K64823
3373.5I82157886q7798r3937j2815j22606j77801J4484J17779j14680k33411k3306
3393.9I81423795p9334m60207l69370K32041N06818J11699l42667k77579K3246J36793
$$ y = [981332362, 981391728, 981459081, 981597364, 981630921, 981538236, 981485963, 981551826, 981647015, 981744111, 981891215, 982055604, 982112467, 981988847, 981844842, 981796503, 981804907, 981917381, 982118011, 982193172, 982118726, 982127249, 982241690, 982291818, 982299149, 982283950, 982217491, 982316792, 982472062, 982317805, 982045770, 981991470, 982170105, 982440174, 982625186, 982751608, 982873499, 982853293, 982738793, 982638419, 982528090, 982534170, 982657731, 982743561, 982750356, 982614398, 982451022, 982461512, 982524633, 982477188, 982407510, 982412338, 982439816, 982498288, 982559919, 982571542, 982547641, 982454777, 982353806, 982239723, 981965244, 981595516, 981526732, 981893063, 982157886, 982070088, 981976151, 981963336, 981840730, 981662929, 981677413, 981795192, 981680512, 981447101, 981423795, 981344461, 980884254, 980514884, 980746925, 981253743, 981365442, 981022775, 980745196, 980768442, 980905235]
3414.3I80905235K0385k56658l32654n3107K7895l78251p22468o25789n13971n33104
3434.7I77537513l45707j80006l83318p11441r28998r55522p86781p50244r75132j219630
3455.1I70300734j392961j387774j102686r89497j208901j029790k15411M49479N67972
3473.4I63991165M98057L46899L84569Q20338R86398P32422P16507Q89063P90536N50449
3493.8I70706403M00305L81410K20478p6592J76489N72801L71575Q3685M8041M1187
3514.2I72925782m5538k03430m41373o28292m60685j79648k0862J52111L6180k88725
3534.6I70845520k68578r5665l11614p67707p60377q3148L67164J89483J79112M10855
3555I69705045K64406j48117l97861p11501j146018n09262J101911J538992Q44895
$$ y = [980905235, 980925620, 980668962, 980336308, 980283201, 980311096, 979932845, 979210377, 978584588, 978070617, 977537513, 977191806, 977011800, 976628482, 975917041, 974988043, 974032521, 973245740, 972495496, 971520364, 970300734, 968907773, 967519999, 966417313, 965427816, 964218915, 963189125, 962973714, 963423193, 963991165, 964489222, 964836121, 965220690, 966041028, 967027426, 967759848, 968476355, 969365418, 970155954, 970706403, 971106708, 971488118, 971708596, 971632004, 971808493, 972381294, 972752869, 972836554, 972884595, 972925782, 972880244, 972676814, 972235441, 971607149, 971146464, 970966816, 970945954, 971098065, 971134245, 970845520, 970576942, 970481277, 970169663, 969401956, 968641579, 968558431, 968925595, 969115078, 969294190, 969705045, 969969451, 969821334, 969423473, 968711972, 967565954, 967056692, 968158603, 969697595, 970542490]
3573.4I70542490K82407N8294n5969k28167p45415j294077o04093P19488L86059o05226
3593.8I68455791n32686q5652q8453j03593k74003r86636j308083p39932l33667k73228
3614.2I63729858n74052q90613O1930Q62479j77980j930117j962364O93858J818478
3632.5I61631477R61006M66287L86893K46108j89245j223385k387166j497507J801491
3650.9I60195959K875805J528382J225650J963198J780808J088441K65002q80659j122117
3669.2I68920469K30730M62770M09246K427697L215492K205789R71377m25041j343369
3687.6I77075160l73364J663685K226293J445293M64619k51413k36213M36127J72258
3706I82622445j186490j724482p391J907706J612306L01242o20961o87540j75953L25680
$$ y = [970542490, 970824897, 970883191, 970827222, 970599055, 969853640, 968559563, 967955470, 968674958, 969061017, 968455791, 967923105, 967837453, 967749000, 967645407, 967371404, 966384768, 965076685, 964336753, 964003086, 963729858, 963155806, 962265193, 962327123, 963189602, 963011622, 961081505, 959119141, 959812999, 961631477, 962592483, 963058770, 963445663, 963691771, 963502526, 962279141, 959891975, 958394468, 960195959, 963071764, 964600146, 965825796, 967788994, 969569802, 970658243, 970923245, 970042586, 968920469, 969151199, 969613969, 970023215, 972450912, 975666404, 977872193, 978843570, 978418529, 977075160, 976701796, 978365481, 980591774, 982037067, 982501686, 982250273, 982014060, 982450187, 982622445, 981435955, 979711473, 979704082, 981611788, 983224094, 983525336, 982904375, 982216835, 982040882, 982366562]
3726.4I82366562K14279r24290k122044j477182Q62121J961053O32167j404703j494408
3744.7I78613555o6697m48346l05653J766622K109110P25747J15037P50720O46770
3763.1I83906865l11077o77526k12669Q64446J315832L40224q18193p56026J45317
3781.4I83797193L87668L56674N12660L02255j42813p47442j185417j108885j160920
3799.8I81010973m94122P80880P03156Q65281J382589L95894j317918j801669j049996
3818.1I80475068o71923O81698J841367J014590P0214n46515r64403j004636j034558
3836.5I79860902l85463Q00252J213848J298845R55105n79775k686083k914786Q02219
3854.8I78365064L000021J704633q5890r05514n16594l66389o54996M3988R09627R87351
$$ y = [982366562, 982580841, 981656551, 979534507, 978057325, 978919446, 980880499, 981512666, 980107963, 978613555, 978546858, 978098512, 977792859, 979559481, 981668591, 982394338, 982509375, 983260095, 983906865, 983595788, 982918262, 982705593, 983570039, 984885871, 985226095, 984407902, 983651876, 983797193, 984184861, 984541535, 985054195, 985356450, 985213637, 984466195, 983280778, 982171893, 981010973, 980516851, 981297731, 982000887, 982866168, 984248757, 984644651, 983326733, 981525064, 980475068, 979803145, 980484843, 982326210, 983340800, 983411014, 982864499, 981900096, 980895460, 979860902, 979475439, 980275691, 981489539, 982788384, 983743489, 983163714, 980477631, 977562845, 978365064, 981365085, 983069718, 982983828, 982078314, 981561720, 981195331, 980540335, 980584323, 981493950, 982481301]
3875.2I82481301M43876n58138o92070k44796N5551M59314m1545k61008P31289O30319
3895.6I83004093q05378j589834r30965M23729J666963J829684R79900Q8275n96285
3914I84070182r13203m87029K01761K73645J610J36733Q8691m03404k72274M35293
3934.4I83132005N18679n2273m60327l04639R8467n6624m36426j00612K88546P4029
3954.8I82700825K622K33949K31623j1086k45393k64108j09851k1458n8114r7037q9645
3977.2I82272327m1187r656n483J71482L65436K06888j68145k70962k6703J49548
3997.6I82643545
$$ y = [982481301, 982925177, 982367039, 981674969, 981430173, 981485724, 981945038, 981903493, 981642485, 982373774, 983004093, 982198715, 980608881, 979677916, 980101645, 981768608, 983598292, 984578192, 984666467, 984070182, 983156979, 982669950, 982871711, 983145356, 983146966, 983283699, 983372390, 982968986, 982696712, 983132005, 983650684, 983598411, 983138084, 982833445, 982931912, 982875288, 982438862, 982338250, 982626796, 982700825, 982703447, 982937396, 983169019, 983157933, 982912540, 982648432, 982538581, 982517123, 982459009, 982361972, 982272327, 982231140, 982221484, 982216001, 982387483, 982752919, 982959807, 982791662, 982520700, 982493997, 982643545]
##END=$$ End of the data block
