##TITLE=Rachel - Amostra 9 $$ Begin of the data block
##JCAMP-DX=5.00 $$ ACD/SpecManager v 10.08
##SPECTROMETER/DATA SYSTEM=Alpha
##DATE=21 May 2015 14:09:38
##DATA TYPE=INFRARED SPECTRUM
##DATA CLASS=XYDATA
##ORIGIN=
##OWNER=
##NPOINTS=1667
##FIRSTX=599.57470703
##LASTX=3997.16503906
##MAXX=3997.16503906
##MINX=599.57470703
##MAXY=0.98229879
##MINY=0.13063192
##XFACTOR=1.0000000000
##YFACTOR=1.000000000000000e-9
##FIRSTY=0.44356799
##DELTAX=2.03937006
##XUNITS=1/CM
##YUNITS=ARBITRARY UNITS
##XYDATA=(X++(Y..Y))
599.6D43567991k635121O230146J5118688K2173852K4942130K2357761J6760469J1817276
$$ 443567991 440932870 447163016 462281704 484455556 509397686 531755447 548515916 560333192
615.9E60333192R262205Q262813P952630Q540452R194135Q959711P691204O164253
$$ 560333192 569595397 577858210 585810840 594351292 603545427 612505138 620196342 626360595
632.2F26360595M835010L493786K319336J631260J910865M065335P115006Q152545
$$ 626360595 631195605 634689391 637008727 638639987 640550852 644616187 651731193 659883738
648.5F59883738O627917M361153K920210L449440N590260O888211O152689M424393
$$ 659883738 666511655 670872808 673793018 677242458 682832718 689720929 695873618 700298011
664.8G00298011L666640L673434K098381O69599Q2195M74095J563788K041399J331151
$$ 700298011 703964651 707638085 709736466 710406065 710488260 710962355 712526143 714567542 715898693
683.2G15898693K34663j03891J012802L298939N509138O681442O574035N404830M247427
$$ 715898693 716133356 716029465 717042267 720341206 725850344 732531786 739105821 744510651 748758078
701.5G48758078L870785L885627M021406L924906L277183K531886K235949K769947
$$ 748758078 752628863 756514490 760535896 764460802 767737985 770269871 772505820 775275767
717.9G75275767L851354M749179N256891N419076N203962M882157M449844L922522
$$ 775275767 779127121 783876300 789133191 794552267 799756229 804638386 809088230 813010752
734.2H13010752L474593K828777K098263J738607J696647J651287J556217J478494
$$ 813010752 816485345 819314122 821412385 823150992 824847639 826498926 828055143 829533637
750.5H29533637J558601J567364J434088J413107J265704J179159J420856J563966
$$ 829533637 831092238 832659602 834093690 835506797 836772501 837951660 839372516 840936482
766.8H40936482J409590J227498J166463J210988J160323J011730J045823J225710
$$ 840936482 842346072 843573570 844740033 845951021 847111344 848123074 849168897 850394607
783.1H50394607J243710J018226Q75414R33051R19223O29723L57568L55661M52936
$$ 850394607 851638317 852656543 853531957 854465008 855384231 856013954 856371522 856727183 857180119
801.5H57180119M16815J90198P987O3122J95145J19448j62661m13060n05030q52287
$$ 857180119 857596934 857787132 857795119 857858241 858053386 858172834 858010173 857597113 857092083 856239796
821.9H56239796j610935k466261l284574l936648m221499l785849k667308j229048
$$ 856239796 854628861 852162600 848878026 844941378 840719879 836934030 834266722 833037674
838.2H33037674K60711J444996K158165K438366K311706J748324P17699n55694j870811
$$ 833037674 833298385 834743381 836901546 839339912 841651618 843399942 844117641 843561947 841691136
856.5H41691136l200411m669488o635368r254098j2579143j6135096j8262387j7144382
$$ 841691136 838490725 833821237 827185869 817931771 805352628 789217532 770955145 753810763
872.8G53810763j2711346p210076l075659j300394k131165n233287r532750j4237583
$$ 753810763 741099417 733889341 730813682 729513288 727382123 722148836 712616086 698378503
889.2F98378503j9150734k3790657k6511848k5106669j9013226j0004222o76274P017731
$$ 698378503 679227769 655437112 628925264 603818595 584805369 574801147 574124873 581142604
905.5E81142604J2795210J7271161J9958735J9941985J7615796J4408350J1915922
$$ 581142604 593937814 611208975 631167710 651109695 668725491 683133841 695049763
919.8F95049763J0921776J0832667J0774792J0324716R090007P098615M863739K613425
$$ 695049763 705971539 716804206 727578998 737903714 746993721 754092336 758956075 761569500
936.1G61569500L77119j766682l821135n715012p205308q130789q218467p122457n097687
$$ 761569500 761946619 760179937 756358802 750643790 743438482 735307693 727089226 719966769 714869082
954.4G14869082l054082k179861l603757p736981j3913691k0759702k6420533k9322267
$$ 714869082 711815000 709635139 706031382 698294401 684380710 663621008 637200475 607878208
970.7F07878208k9251158k7154327k4280309k1390021j8591374j6035348j4022887
$$ 607878208 578627050 551472723 527192414 505802393 487211019 471175671 457152784
985D57152784j2510121j1369169j0834366j1620432j4216751j7959088k1635562k4210245
$$ 457152784 444642663 433273494 422439128 410818696 396601945 378642857 357007295 332797050
1001.3C32797050k5143831k4808944k3773283k2210627k0359665j8456221j6461313
$$ 332797050 307653219 282844275 259070992 236860365 216500700 198044479 181583166
1015.6A81583166j4341444j2160644r866550p450000m887059k245545M87268L680229
$$ 181583166 167241722 155081078 145214528 137764528 132877469 130631924 131119192 134799421
1031.9A34799421P059946R523333J0409280J0296449J0080695J0423899J1666417J3497785
$$ 134799421 141859367 151382700 161791980 172088429 182169124 192593023 204259440 217757225
1048.2B17757225J5486613J7476007J9149453J9930362J9589037J7961115J5127331
$$ 217757225 233243838 250719845 269869298 289799660 309388697 327349812 342477143
1062.5C42477143J2052566R920597R228885R632707J0471522J1339635J2144417J2790530
$$ 342477143 354529709 364450306 373679191 383311898 393783420 405123055 417267472 430058002
1078.8D30058002J3354153J4300883J6014099J8352598K0911991K3122430K4099410
$$ 430058002 443412155 457713038 473727137 492079735 512991726 536114156 560213566
1093.1E60213566K3106456K0154953J5890121J1048615O393731K651453q6546k244711
$$ 560213566 583320022 603474975 619365096 630413711 636807442 639458895 639372349 637127638
1109.4F37127638l943741n005479n357564n111396m165113j816034K272963P132828
$$ 637127638 633183897 628178418 622820854 617709458 613544345 611728311 614001274 621134102
1125.7F21134102J1353076J4048755J4757156J3506353J0961831P961988M904688J752615
$$ 621134102 632487178 646535933 661293089 674799442 685761273 693723261 698627949 700380564
1142.1G00380564j789391o059110j0654808j4415621j6117871j5267909j2289226p974684
$$ 700380564 698591173 692532063 681877255 667461634 651343763 636075854 623786628 615811944
1158.4F15811944l273785J059830M675508P570445R969831J1893928J3168394J3703525
$$ 615811944 612538159 613597989 618273497 625843942 635813773 647707701 660876095 674579620
1174.7F74579620J3327182J1881590R261846N270124j99080p078051j5270055k4828017
$$ 674579620 687906802 699788392 709050238 714320362 714121282 707043231 691773176 666945159
1191F66945159l5700678m7263205n8026016o5622747o7563713o2533468n1671624l8103715
$$ 666945159 631244481 583981276 525955260 460332513 392768800 330235332 278563708 240459993
1207.3B40459993k4887472j4018476o299198j223385K277955M610107N609542N605474
$$ 240459993 215572521 201554045 195254847 194031462 196309417 200919524 206529066 212134540
1223.6B12134540N536527O152898P893383J0908440J4791503J8537969K1437168K3418575
$$ 212134540 217671067 223823965 231717348 242625788 257417291 275955260 297392428 320811003
1239.9C20811003K4506361K5099545K5693655K6251376K6570678K6698917K6680648
$$ 320811003 345317364 370416909 396110564 422361940 448932618 475631535 502312183
1254.2E02312183K6543916K6257276K5696755K4784445K3805380K3242414K3204863
$$ 502312183 528856099 555113375 580810130 605594575 629399955 652642369 675847232
1268.5F75847232K3371697K3010909K1756232J9952834J7865419J5583694J3330221
$$ 675847232 699218929 722229838 743986070 763938904 781804323 797388017 810718238
1282.8H10718238J1251569R432852Q138359P519722P130504O470859N484283M348099
$$ 810718238 821969807 831402659 839541018 847060740 854191244 860662103 866146386 870494485
1299.1H70494485L160477J845479M36663r73463k219617l229320l832877l766417l073931
$$ 870494485 873654962 875500441 875937104 874963641 872744024 869514704 865681827 861915410 858841479
1317.4H58841479j794279j33037J573145L276587M503607M633129L932118K912581
$$ 858841479 857047200 856914163 858487308 861763895 866267502 870900631 874832749 877745330
1333.8H77745330J809121P29620k09868j208663k659738m512310p006109j1103988
$$ 877745330 879554451 880284071 880074203 878865540 876205802 871693492 864687383 853583395
1350.1H53583395j7650723k6984155l7733913m5743227m7818005m2751550k9471159
$$ 853583395 835932672 808948517 771214604 725471377 677653372 634901822 605430663
1364.3F05430663j4451087l389597N288541J2712420J8604338K0177364J9701660K0731866
$$ 605430663 590979576 587589979 592878520 605590940 624195278 644372642 664074302 684806168
1380.7F84806168K2409797K4136662K7341545K8779149K4689496K0312190J7135322
$$ 684806168 707215965 731352627 758694172 787473321 812162817 832475007 849610329
1394.9H49610329J2432754P738173M145622J316667l88682j214981j950682k865374
$$ 849610329 862043083 869781256 873926878 875243545 874854863 873639882 871689200 868823826
1411.3H68823826l700554m367411n034805n464613m737139m191875l971398k971947
$$ 868823826 865123272 860755861 855721056 850256443 845519304 841327429 837356031 834384084
1427.6H34384084j570344K11060J906335L697753N520940N486250N146384N115092
$$ 834384084 832813740 833024800 834931135 838628888 844149828 849636078 854782462 859897554
1443.9H59897554M906237M874349M548549L637195K917170L385723M451215M042983
$$ 859897554 864803791 869678140 874226689 877863884 880781054 884166777 888617992 892660975
1460.2H92660975L998101N265117O163955N691766N301655N397021M652262L559649
$$ 892660975 896659076 901924193 908088148 913779914 919081569 924478590 929130852 932690501
1476.5I32690501K877891K257943J761854J276732Q63790N73099O93023R49860Q85725
$$ 932690501 935568392 937826335 939588189 940864921 941728711 942301810 942994833 943944693 944830418
1494.9I44830418N69880J16884J26720O68764O37352q51631r37938J70886L85583K78115
$$ 944830418 945400298 945517182 945643902 946312666 946950018 946098387 945160449 945331335 945716918 945995033
1515.3I45995033L94821N53012L26931k48789m24743p0334K16425K48551J85371M68671
$$ 945995033 946389854 946942866 947269797 947021008 946596265 946525931 946742356 946990907 947176278 947644949
1535.7I47644949J014650N83768j325369j519740n45084j36256p8023K14219N57363
$$ 947644949 948659599 949243367 947917998 946398258 945853174 945716918 945638895 945853114 946410477
1554I46410477Q92580M43518j279414q83579j97530j00970j30236n36502n08487j49667
$$ 946410477 947303057 947746575 946467161 945583582 945386052 945285082 945154846 944618344 944109857 943960190
1574.4I43960190p69735j463711j139581j018465j145243j294315j453698j649976
$$ 943960190 943190455 941726744 940587163 939568698 938423455 937129140 935675442 934025466
1590.7I34025466j855492k148748k505421k765060l107011l479123l864110m190504
$$ 934025466 932169974 930021226 927515805 924750745 921643734 918164611 914300501 910109997
1607I10109997m534424m723370m362404m496157n889118n461991m151284m171193l848791
$$ 910109997 905575573 900852203 896489799 891993642 886104524 880642533 876491249 872320056 868471265
1625.4H68471265l138364k582192j540601n65469o43909r98259l11494N38528J242220
$$ 868471265 865332901 862750709 861210108 860644639 860000730 859002471 858690977 859229505 860471725
1643.7H60471725J667560J705944J682401K245903K419472J783073K090752K611875
$$ 860471725 862139285 863845229 865527630 867773533 870193005 871976078 874066830 876678705
1660.1H76678705K874851K473176J919091J847803J611948R59874M44769m09305j039326
$$ 876678705 879553556 882026732 883945823 885793626 887405574 888365448 888810217 888400912 887361586
1678.4H87361586r73761j162589l055512m448295m309237n014002n457581p409095
$$ 887361586 886387825 885225236 882169724 877721429 873412192 868398190 862940609 855531514
1694.7H55531514j0070384j2449145j8233657j9181252k1702885k9613614l4040034
$$ 855531514 845461130 833011985 814778328 795597076 773894191 744280577 710240543
1709G10240543l7404776m1340470m6050429n3454459m9601019l5131961k7817756k2768110
$$ 710240543 672835767 631495297 585444868 531990409 482389390 447257429 419439673 396671563
1725.3C96671563j5255451q966565l644794J760989O383002P858694J0552555J2554139
$$ 396671563 381416112 372449547 368804753 370565742 376948744 384807438 395359993 407914132
1741.6D07914132J2452692J3405561J5516639K0407796K6226192K9419572L6071896
$$ 407914132 420366824 433772385 449289024 469696820 495923012 525342584 561414480
1755.9E61414480M4722557M8596144N3288281M9187779L8998366L2897711K6686370
$$ 561414480 606137037 654733181 708021462 757209241 796207607 829105318 855791688
1770.2H55791688K1443367J5523791J0215164Q054077P082284N732178M759610M093766
$$ 855791688 877235055 892758846 902974010 911028087 918110371 923842549 928602159 932695925
1786.5I32695925L430963K904951K659917K104163J758695J705885J405478J564502
$$ 932695925 936126888 939031839 941691756 943795919 945554614 947260499 948665977 950230479
1802.8I50230479J705885J560867J354396J349986J295924J172304J044274J048982
$$ 950230479 951936364 953497231 954851627 956201613 957497537 958669841 959714115 960763097
1819.1I60763097J054942R23992J004219J082182R51171O03139O08444O38127N37277
$$ 960763097 961818039 962742031 963746250 964828432 965779603 966382742 966991186 967629313 968166590
1837.5I68166590M81546M46140K83897Q3924K40266L44872K94090K04801J88411M7028
$$ 968166590 968648136 969094276 969378173 969462097 969702363 970047235 970341325 970546126 970734537 970781565
1857.9I70781565k8670R9778K65718K03907o5684j4663K29418K72692R3221L3677N0783
$$ 970781565 970752895 970852673 971118391 971322298 971256614 971241951 971471369 971744061 971837282 971870959 971921742
1880.3I71921742N2273N2154K3425p2479p511J78695J00732M4823q166j66714k80977
$$ 971921742 971974015 972026169 972049594 971977115 971969604 972148299 972249031 972293854 972285688 972118974 971837997
1902.8I71837997k81870k89679k30312q2135m3809j54078l17991k76685j60337l1530
$$ 971837997 971556127 971266448 971036136 970954001 970910192 970756114 970438123 970161438 970001101 969969571
1923.2I69969571Q6605Q345p8738m5597o9082j12534j02162j30415j51754k6941J16408
$$ 969969571 970056176 970064521 969985783 969940186 969871104 969758570 969656408 969525993 969374239 969347298 969463706
1945.6I69463706O2883m172j7286K2173N2869l159k920J27017J85490O6042Q5056K24352
$$ 969463706 969526589 969522417 969505131 969527304 969580173 969577014 969574094 969701111 969886601 969952643 970037699 970262051
1970.1I70262051K67326K66552K16246R0957N9128J32501Q9407n3943j17898o9260
$$ 970262051 970529377 970795929 971012175 971103132 971162260 971294761 971384168 971330225 971212327 971143067
1990.5I71143067M9353J55329Q8692n7697o8367L3558K8133j09673k13205k44260k31564
$$ 971143067 971192420 971347749 971436441 971378744 971310377 971343935 971372068 971262395 971049190 970804930 970573366
2012.9I70573366k52962k15292l8982J4126m2140k980K8372L6954L3677l7670l4630
$$ 970573366 970320404 970105112 970066130 970080256 970038116 970035136 970063508 970100462 970134139 970096469 970061839
2035.3I70061839K4140k2173n8353n961J9014p033n4181q6427n4717J0073J8955j1087
$$ 970061839 970085979 970063806 970005453 969999492 970018506 970011473 969957292 969870865 969816148 969826221 969845176 969834089
2059.8I69834089m2259q9169p4506L2962N2392m7028j04725q1003q6963k07961k42591
$$ 969834089 969791830 969702661 969628155 969661117 969713509 969666481 969561756 969480753 969393790 969185829 968943238
2082.2I68943238j31368j11699j94252k26915k25186k37048k00748j74165k44379k50995
$$ 968943238 968811870 968700171 968505919 968279004 968053818 967816770 967616022 967441857 967197478 966946483
2102.6I66946483j73331k18391k49744j60694r8943p6890p8917j07467o4433J5736
$$ 966946483 966773152 966554761 966305017 966144323 966045380 965968490 965889573 965782106 965717673 965733409
2123I65733409K0087M5180O9261N7458J33336K06232J73509J74463J97053J39952J04069
$$ 965733409 965753496 965798676 965867937 965925395 966058731 966264963 966438472 966612935 966809988 966949940 967054009
2145.4I67054009J44601J82450J94073K65539L52978L33846K24471J99318K72334K75850
$$ 967054009 967198610 967381060 967575133 967840672 968193650 968527496 968751967 968951285 969223619 969499469
2165.8I69499469K08020J56879K04981K92361L03387K27452J73986J56998J09196P3612
$$ 969499469 969707489 969864368 970069349 970361710 970665097 970892549 971066535 971223533 971332729 971406341
2186.2I71406341N7876P5161J23739J65105J65522J26422R3460Q1420N0664j4842l1113
$$ 971406341 971464217 971539378 971663117 971828222 971993744 972120166 972213626 972295046 972345710 972330868 972299755
2208.7I72299755O5624J62423J53780J33634J13964R3937J18494J12295Q8095L4869
$$ 972299755 972365379 972527802 972681582 972815216 972929180 973023117 973141611 973253906 973342001 973376870
2229.1I73376870n5551o2704k7836K8074Q6844L9041M888J1324n3703q2076k5392J967
$$ 973376870 973321319 973258615 973230779 973258853 973345697 973384738 973389626 973400950 973347247 973265171 973239779 973241746
2253.5I73241746k6881l7790N4419J52350R6619k444l5524k4974J4007L1054N7578
$$ 973241746 973214865 973177075 973231494 973383844 973480463 973478019 973442495 973417521 973431528 973462582 973520160
2276I73520160O8009j3531l8445N2870Q5711O318j3113R8944J92940J44899j1980j20700
$$ 973520160 973588169 973574638 973536193 973589063 973674774 973681092 973667979 973766923 973959863 974104762 974092782 973972082
2300.4I73972082j05500o3419j00792j23560k1935J57297K67923J90794J10746J31607
$$ 973972082 973866582 973803163 973702371 973578811 973556876 973714173 973982096 974172890 974283636 974415243
2320.8I74415243J77681K95997M12583N65648P99120P06434L52025K31087J11580l48508
$$ 974415243 974592924 974888921 975301504 975867152 976666272 977372706 977724731 977955818 978067398 977718890
2341.2I77718890q11398r88722p09236K3425P06970P63298M36782M11511J80721k00987
$$ 977718890 976907492 975918770 975209534 975232959 975939929 976703227 977140009 977551520 977732241 977531254
2361.6I77531254l26931m92156o62863o83188n85497n54323n45979l86536r3937K41399
$$ 977531254 977204323 976712167 976049304 975366116 974780619 974226296 973680317 973293781 973199844 973441243
2382I73441243M23849L83138K45035J05381K0266j8299l8504r4414j85669j65224o1810
$$ 973441243 973865092 974248230 974493265 974598646 974618912 974600613 974562109 974467695 974282026 974116802 974054992
2404.4I74054992K1935N2213k4020j14441j24753q1897k0086N3465J07586P9275J78
$$ 974054992 974076927 974129140 974105120 973990679 973865926 973784029 973763943 973817408 973924994 974004269 974004447
2426.9I74004447k4437J0490J9312j3530k6465k0861j3412l5047k0385M8518Q881n8353
$$ 974004447 973980010 973990500 974009812 973996282 973969817 973948956 973935544 973900497 973880112 973928630 973937511 973879158
2451.3I73879158o2704m7504o5685o4075P7784J59145O0141p2241j09077r3162q8036
$$ 973879158 973816454 973768950 973703265 973639190 973716974 973876119 973936260 973864019 973754942 973661780 973573744
2473.8I73573744j9610N4777O2883R9540J28925N0663k503L7253P4089O5565L8743
$$ 973573744 973554134 973608911 973671794 973771334 973900259 973950922 973948419 973985672 974059761 974125326 974164069
2496.2I74164069K7716L2604K4616M4644J49250J86622P9453m6849p7903J490M6849
$$ 974164069 974191785 974224389 974249005 974293649 974442899 974629521 974708974 974662125 974584222 974585712 974632561
2518.6I74632561K5392L3676M9830M4942M4286M8578K9862M589O8963J20401j9133
$$ 974632561 974657953 974691629 974741459 974786401 974830687 974879265 974909127 974913716 974982679 975103080 975083947
2541.1I75083947j34706m9770P152o2883j04367n9009J5974N8830J4901o1989m9233
$$ 975083947 974949241 974899471 974906623 974843740 974739373 974680364 974696338 974755168 974770069 974708080 974658847
2563.5I74658847l8684r4890q8275q344M9174L7372K2173J072o0915p4625m5836o3360
$$ 974658847 974620163 974525273 974436998 974428654 974477828 974515200 974537373 974538445 974477530 974402905 974357069 974293709
2588I74293709j58429j72258k3126M0292n1498r7632m8817k1457o2108r0719m7922
$$ 974293709 974135280 973963022 973939896 973980188 973928690 973831058 973782241 973760784 973698676 973607957 973560035
2610.4I73560035O497j9431j07050j10805m9889n9187o6102p2241j28746j52528j36376
$$ 973560035 973566532 973547101 973440051 973329246 973279357 973220170 973154068 973081827 972953081 972800553 972664177
2632.8I72664177j10685p3851l2246J9610K8372q345j3947k921j5437K4616J69456
$$ 972664177 972553492 972479641 972447395 972467005 972495377 972487032 972473085 972470164 972454727 972479343 972648799
2655.3I72648799K14458K5809j42157j10448m172Q7142J08302j9849j20580p391O8367
$$ 972648799 972863257 972889066 972746909 972636461 972632289 972719431 972827733 972807884 972687304 972679913 972748280
2677.7I72748280p6116j57773q6188m0114k0981L4273O3121o6638k24948j29759L7491
$$ 972748280 972672164 972514391 972428203 972388089 972367108 972401381 972464502 972397864 972172916 972043157 972080648
2700.1I72080648k9802q9944m8935j03593j26064r6917j14560j65940j69277r6023
$$ 972080648 972050846 971960902 971911967 971808374 971682310 971585393 971470833 971304893 971135616 971039593
2720.5I71039593j05738j31846p7307n1439L7372J92344J76609Q523p4923j847P7486
$$ 971039593 970933855 970802009 970724702 970673263 970710635 970902979 971079588 971088111 971013188 971011341 971088827
2743I71088827O4134N1439Q6188Q2791N3644J7941n6445k2769R6559O1155l6419l0636
$$ 971088827 971152961 971204400 971290588 971373379 971427023 971444964 971388519 971365750 971462309 971523464 971487045 971456409
2767.4I71456409n2333j07825j06156r1672m0531j5974p1407j12056j75059k14994
$$ 971456409 971404076 971296251 971190095 971098423 971057892 971041918 970970511 970858455 970683396 970468402
2787.8I70468402k12133k82884k49147q9407n3525r3818j32203j70648j74344j80244
$$ 970468402 970256269 969973385 969724238 969634831 969581306 969487488 969355285 969184637 969010293 968830049
2808.2I68830049j53244q3804j05679j70707j45555j53184k09808k11299k16484k09391
$$ 968830049 968676805 968593001 968487322 968316615 968171060 968017876 967808068 967596769 967380285 967170894
2828.6I67170894k02417l14534n17368o02007n44787n73277o55711p95543j080096
$$ 967170894 966968477 966653943 966136575 965534568 964989781 964416504 963760793 962965250 961885154
2847I61885154j226544j159489j114786j091421r83655q59678q32379q59439q55148
$$ 961885154 960658610 959499121 958384335 957292914 956309259 955449581 954617202 953757763 952902615
2865.3I52902615r15825j074791j080334q82090p49409p65681p58052o31153n14448
$$ 952902615 951986790 950911999 949831665 948949575 948200166 947434485 946676433 946045280 945530832
2883.7I45530832m53353m01318k85208o6638M3928J17779L39150M83931M39107L01421
$$ 945530832 945077479 944676161 944390953 944324315 944368243 944486022 944825172 945309103 945748210 946049631
2904.1I46049631J78396J28210M2498r8050k51174m11868n16355n37693m97222m66168
$$ 946049631 946228027 946356237 946398735 946300685 946049511 945637643 945121288 944583595 944086373 943620205
2924.5I43620205m68254n84185q04365j010537j204968j062929n74827k66850o3241
$$ 943620205 943151951 942567766 941763401 940752864 939547896 938484967 937910140 937643290 937580049
2942.8I37580049K39849L55244L33726L67284K13981l5405o8963O4731K55525N60701
$$ 937580049 937819898 938175142 938508868 938876152 939090133 939054728 938985765 939050496 939306021 939866722
2963.2I39866722J077056J699030K155662K289116K149403J798153J374185J122355
$$ 939866722 940943778 942642808 944798470 947087586 949236989 951035142 952409327 953531682
2979.5I53531682J050711Q49664M94600L65257L76761K96891L22461M19080M41194
$$ 953531682 954582393 955432057 955926657 956291914 956668675 956965566 957288027 957707107 958148301
2997.9I58148301M91202N60283N34237L99112K94864K70606J79171J06871J50681J65522
$$ 958148301 958639503 959199786 959734023 960133135 960427999 960698605 960877776 960984647 961135328 961300850
3018.3I61300850J38223J14203P9453J69277L58701M43458M00424K06351M7922J06276
$$ 961300850 961439073 961553276 961632729 961802006 962160707 962604165 963004589 963210940 963258862 963365138
3038.7I63365138K09510L07321M21346L93212J47819l9220l0517k9624k4915M6075
$$ 963365138 963574648 963881969 964303315 964696527 964844346 964805126 964774609 964744985 964720070 964766145
3059.1I64766145L3676j6033o0141j54972r1970N6922M411j56760j91272o4075J2636
$$ 964766145 964799821 964783788 964723647 964568675 964476705 964533627 964538038 964381278 964190006 964125931 964138567
3081.5I64138567p9155j62422j32382j04666j50859j91748j24038j5497k1159j51694
$$ 964138567 964059412 963896990 963764608 963659942 963509083 963317335 963193297 963177800 963156641 963004947
3101.9I63004947k76387k85983j68860m7386q4340j73390j92821k29180k95699k68161
$$ 963004947 962728560 962442577 962273717 962226331 962141991 961968601 961775780 961546600 961250901 960982740
3122.3I60982740j27018q5473j34825r9182j74702l88622l89934k55048k74539l02195
$$ 960982740 960855722 960770249 960635424 960536242 960361540 959972918 959582984 959327936 959053397 958751202
3142.7I58751202j65701j34886l55780m56691l08871k14517j91152k34067m28439n15461
$$ 958751202 958585501 958450615 958094835 957638144 957329273 957114756 956923604 956689537 956261098 955745637
3163.1I55745637l94880l34502m16696m16755l29554k83778k77639k99394l34978m90606
$$ 955745637 955350757 955016255 954599559 954182804 953853250 953569472 953291833 952992439 952657461 952166855
3183.5I52166855o20484n36740m21464m11392m85539n75483n87940m91560l95953l99709
$$ 952166855 951546371 951009631 950588167 950176775 949691236 949115753 948527813 948036253 947640300 947240591
3203.8I47240591m68552n24283n44190n10693m36067l84629l92437m52280m83870m69149
$$ 947240591 946772039 946247756 945703566 945192873 944756806 944372177 943979740 943527460 943043590 942574441
3224.2I42574441m67002m67420m08411l03208k45274l49104n08428m42147l14772l54946
$$ 942574441 942107439 941640019 941231608 940928400 940683126 940334022 939825594 939383447 939068675 938713729
3244.6I38713729l42667k99751m38691m96208l59178k89738k93434k85744l44038m40658
$$ 938713729 938371062 938071311 937632620 937136412 936777234 936487496 936194062 935908318 935564280 935123622
3265I35123622l55362j91272j88768k62081l77000m11808l10064k17556j64629k80082
$$ 935123622 934768260 934576988 934388220 934126139 933749139 933337331 933027267 932809711 932645082 932365000
3285.4I32365000m84943m65036l05533k40803j99497j77085l09586m45009m04000k58684
$$ 932365000 931880057 931415021 931109488 930868685 930669188 930492103 930182517 929737508 929333508 929074824
3305.8I29074824k33412l60906m63963m94837m15862l06427l27766m84109n94497n15521
$$ 929074824 928841412 928480506 928016543 927521706 927105844 926799417 926471651 925987542 925393045 924877524
3326.2I24877524m23550m07338m39823n68986o47008o48618p01010o55532n20945n03361
$$ 924877524 924453974 924046636 923606813 923037827 922390819 921742201 921041191 920385659 919864714 919361353
3346.6I19361353m99427m64976m80175n11766o33001p89762p73489o54638o40452o88374
$$ 919361353 918861926 918396950 917916775 917405009 916772008 915982246 915208757 914554119 913913667 913225293
3367I13225293n90682m32312m79401o49094o30856m73857m46200n32746o31929o49273
$$ 913225293 912634611 912202299 911722898 911073804 910442948 909969091 909522891 908990145 908358216 907708943
3387.4I07708943n50330m75943n06699n90801o02842m66227l07143l11434l90291m15147
$$ 907708943 907158613 906682670 906175971 905585170 904982328 904516101 904208958 903897524 903507233 903092086
3407.8I03092086n35011o77109n44250k74181k45452m41611n05507l54469k52664k71082
$$ 903092086 902557075 901879966 901335716 901061535 900816083 900374472 899868965 899514496 899261832 898990750
3428.2H98990750k96414l57449n15520n12302k32279n1022j57297l27170k95579q5473
$$ 898990750 898694336 898336887 897821367 897309065 897076786 897025764 896868467 896541297 896245718 896160245
3448.6H96160245j6868j28329j75953j78039j30117n7161j52707l15904k95163p1406
$$ 896160245 896143377 896015048 895839095 895661056 895530939 895473778 895321071 895005167 894710004 894638598
3469H94638598N3108Q5711J29581M1783L337P3910M0651N2213L08991N78105N76496
$$ 894638598 894691706 894777417 894906998 894948781 894952118 895026028 895066679 895118892 895427883 896005988 896582484
3491.4H96582484M06444L00050K71857K09093J94252M71770O46889M67539M86255N82397
$$ 896582484 896988928 897288978 897560835 897769928 897964180 898435950 899082839 899550378 900036633 900619030
3511.8I00619030M16219K48850K29001K21729K18391L54886N25594O29366O69539M96625
$$ 900619030 901035249 901284099 901513100 901734829 901953220 902308106 902833700 903463066 904132605 904629230
3532.2I04629230K55943L65138N68271L40581J9848J21057O02305Q86619N88179L52680
$$ 904629230 904885173 905250311 905818582 906159163 906179011 906300068 906902373 907788992 908377171 908729851
3552.6I08729851N92411P01964N36799M39465K60651j05738N8829R18806J257181Q92699
$$ 908729851 909322262 910024226 910561025 911000490 911261141 911155403 911214232 912133038 913390219 914282918
3573I14282918N00381M06444N07712N63324L72946M8459K40803R98556J019478M67777
$$ 914282918 914783299 915189743 915697455 916260779 916633725 916682184 916922987 917921543 918941021 919408798
3593.4I19408798M67062Q29697Q03590P07566O92368L88861K77340O29485P32600P62344
$$ 919408798 919875860 920705557 921509147 922216713 922909081 923297942 923575282 924204767 924937367 925699711
3613.7I25699711J108646J220584J027584J084984J288890J242638J044989J187563
$$ 925699711 926808357 928028941 929056525 930141509 931430399 932673037 933718026 934905589
3630.1I34905589J432359J424849J435459J604974J787007J920998K056002K180696
$$ 934905589 936337948 937762797 939198256 940803230 942590237 944511235 946567237 948747933
3646.4I48747933K068698J647532J514972J668691J799941J696706J601577J615465
$$ 948747933 950816631 952464163 953979135 955647826 957447767 959144473 960746050 962361515
3662.7I62361515J714587J887798J728118J339972J306951J168549O84082N91695P36177
$$ 962361515 964076102 965963900 967692018 969031990 970338941 971507490 972191572 972783267 973519444
3681I73519444Q38161Q93176Q04901M68433J70528K70486M93884N87941N06222J41859
$$ 973519444 974357605 975250781 976055682 976524115 976694643 976965129 977459013 978046954 978553176 978695035
3701.4I78695035m5717M20213P72834K91824o80506o25491O4671J56879l7670m0233
$$ 978695035 978649318 979069531 979842365 980134189 979453683 978828192 978892863 979049742 979012072 978971839
3721.8I78971839n7995r7633L24905O58095P8440p10011l48627M58538P62642O73174
$$ 978971839 978913844 978816211 979141116 979799211 979877651 979167640 978819013 979277551 980040193 980713367
3742.2I80713367J95444J3709K05338j66416o11961k00629J30772q5353j65880J55806
$$ 980713367 980908811 980922520 981127858 980961442 980349481 980148852 980279624 980194271 980028391 980184197
3762.6I80184197L34561L30329J26422l29018l56317O7235M04655K74301j53899k42651
$$ 980184197 980518758 980849087 980975509 980646491 980290174 980357409 980762064 981036365 980882466 980639815
3783I80639815j93774k06650j08897K03430N65231M89772J85370J06037k60413l65198
$$ 980639815 980446041 980239391 980130494 980333924 980899155 981388927 981574297 981680334 981419921 981054723
3803.4I81054723k2948j81257r6679M34577O03021L17394J89960q1598q91269o98149
$$ 981054723 981031775 980850518 980753839 981188416 981791437 982108831 982298791 982217193 981325924 980627775
3823.8I80627775k3663J33932J65045K42710M68433M10378k96414n10096j65344j58310
$$ 980627775 980604112 980738044 980903089 981145799 981614232 982024610 981728196 981218100 981052756 980894446
3844.2I80894446j15990K73406N90146j26779j380205o55532K98798N36382K97785
$$ 980894446 980778456 981051862 981642008 981515229 980135024 979479492 979778290 980314672 980612457
3862.5I80612457j49012j22666N7041p331q0168p0512P2598k5868j18137N3704j17481
$$ 980612457 980463445 980340779 980397820 980390489 980310321 980239809 980312407 980286539 980168402 980222106 980104625
3885I80104625r0778P4447k00272k57552n6147p4447j33514n0962j2398Q9944K00331
$$ 980104625 980013847 980088294 979888022 979630470 979574323 979499876 979366362 979315400 979303002 979392946 979593277
3907.4I79593277J62363J94788O8784k65777l59178j34468J16229J15037K8491K4974
$$ 979593277 979755640 979950428 980019212 979753435 979394257 979259789 979376018 979491055 979519546 979544520
3927.8I79544520j84297l30389M9174K85387Q7083j11282k32935j19508P4506R1911
$$ 979544520 979360223 979029834 979079008 979364395 979451478 979340196 979107261 978987753 979062259 979154170
3948.2I79154170J61171J08540q8335j1384N1081j4782J46151J45078j20640j57297
$$ 979154170 979315341 979423881 979335546 979324162 979375243 979360461 979506612 979651690 979531050 979373753
3968.6I79373753P1287J32144j66595k29895J17957J49608o3539L0816J38938K7836
$$ 979373753 979445040 979577184 979410589 979180694 979298651 979448259 979384720 979415536 979554474 979582310
3989I79582310p1347q1480j5258Q5413
$$ 979582310 979510963 979429483 979414225 979499638
3997.1I79499638
$$ 979499638
##END=$$ End of the data block
