##TITLE=Rachel - Amostra 8 $$ Begin of the data block
##JCAMP-DX=5.00 $$ ACD/SpecManager v 10.08
##SPECTROMETER/DATA SYSTEM=Alpha
##DATE=21 May 2015 14:09:38
##DATA TYPE=INFRARED SPECTRUM
##DATA CLASS=XYDATA
##ORIGIN=
##OWNER=
##NPOINTS=1667
##FIRSTX=599.57470703
##LASTX=3997.16503906
##MAXX=3997.16503906
##MINX=599.57470703
##MAXY=0.98280597
##MINY=0.14684181
##XFACTOR=1.0000000000
##YFACTOR=1.000000000000000e-9
##FIRSTY=0.45604923
##DELTAX=2.03937006
##XUNITS=1/CM
##YUNITS=ARBITRARY UNITS
##XYDATA=(X++(Y..Y))
$$ plain form
599.6 456049234 453756303 459886819 474570870 496219963 520866692 542948604 559228539 570735872
615.9 570735872 579896510 588219047 596551657 605293393 614166200 622660935 629963934 635855556
632.2 635855556 640814006 644718409 647174358 648774087 650752485 654798746 661699116 669513881
648.5 669513881 675871015 680328071 683602989 686985850 692159891 698760331 704635620 708934069
664.8 708934069 712867498 716719747 718491912 718848646 718938589 719790459 721645236 723344326 724187553
683.2 724187553 724415004 724399388 725349247 728688121 734321415 740946889 747084498 752018988 756294429
701.5 756294429 760524809 764545500 768285394 771813035 774866045 777384102 779645443 782244742
717.9 782244742 785889804 790589988 795743525 800930023 805881023 810571611 814993441 818909526
$$ packed form
599.6D56049234k292931O130516J4684051K1649093K4646729K2081912J6279935J1507333
615.9E70735872R160638Q322537Q332610Q741736Q872807Q494735P302999N891622
632.2F35855556M958450L904403K455949J599729J978398M046261O900370P814765
648.5F69513881O357134M457056L274918L382861N174041O600440N875289M298449
664.8G08934069L933429L852249J772165L56734Q9943Q51870J854777J699090Q43227
683.2G24187553K27451j5616R49859L338874N633294O625474O137609M934490M275441
701.5G56294429M230380M020691L739894L527641L053010K518057K261341K599299
717.9G82244742L645062M700184N153537N186498M951000M690588M421830L916085
$$ plain form
734.2 818909526 822098792 824481666 826410711 828265965 830028951 831556201 832899213 834348142
750.5 834348142 836049438 837568343 838676751 839682221 840749681 842073083 843633473 845040858
766.8 845040858 846149385 847148716 848171353 849270642 850408375 851464212 852413058 853267014 854141831
785.2 854141831 855003536 855598569 856079161 856700003 857212186 857536376 857888103 858194351 858322203 858370125
805.6 858370125 858420193 858557582 858846664 859146953 859261692 859042704 858453393 857371688 855886698 854078770
825.9 854078770 851457238 847860873 843783379 839912653 837096989 835909069 836213827 837680638 839987218
844.3 839987218 842540205 844695210 846049547 846464157 845840931 844031215 841009617 836570203 830205619
862.7 830205619 821330488 809219360 793769538 776416481 760100424 747933447 741065502 738126814
$$ packed form
734.2H18909526L189266K382874J929045J855254J762986J527250J343012J448929
750.5H34348142J701296J518905J108408J005470J067460J323402J560390J407385
766.8H45040858J108527R99331J022637J099289J137733J055837R48846Q53956Q74817
785.2H54141831Q61705N95033M80592O20842N12183L24190L51727L06248J27852M7922
805.6H58370125N0068J37389K89082L00289J14739k18988n89311j081705j484990j807928
825.9H54078770k621532l596365m077494l870726k815664j187920L04758J466811K306580
844.3H39987218K552987K155005J354337M14610o23226j809716l021598m439414o364584
862.7H30205619q875131j2111128j5449822j7353057j6316057j2166977o867945k938688
$$ plain form
879 738126814 736612082 734087944 728575468 719087183 705419183 687182724 664345086 638869107
895.3 638869107 614877939 596952260 587989450 588113368 595444560 608000636 624552548 643547297
911.6 643547297 662435055 678878009 692086995 702990055 713171244 723366678 733391166
925.9 733391166 742863417 751195133 757755101 762203276 764480472 764605999 762598217 758621931 752904713
944.2 752904713 745775342 737741768 729623318 722621977 717518806 714161038 711460590 707321167
960.5 707321167 699273288 685381293 665120542 639704645 611533642 583386838 557284892 533998191
976.9 533998191 513525426 495625645 480049610 466398180 454206407 443058938 432287484
991.1 432287484 420687437 406568438 388625920 367039114 343151629 318464249 294141024
$$ packed form
879G38126814j514732k524138n512476r488285j3668000j8236459k2837638k5475979
895.3F38869107k3991168j7925679q962810J23918P331192J2556076J6551912J8994749
911.6F43547297J8887758J6442954J3208986J0903060J0181189J0195434J0024488
925.9G33391166R472251Q331716O559968M448175K277196J25527k007782l976286n717218
944.2G52904713p129371q033574q118450p001341n103171l357768k700448m139423
960.5G07321167q047879j3891995k0260751k5415897k8171003k8146804k6101946k3286701
976.9E33998191k0472765j7899781j5576035j3651430j2191773j1147469j0771454
991.1D32287484j1600047j4118999j7942518k1586806k3887485k4687380k4323225
$$ plain form
1005.4 294141024 270847440 248963892 228887439 210890070 194909334 180950224 169245511
1019.7 169245511 159996375 153195888 148748353 146841809 147895709 152249619 159765393 169490844
1036 169490844 180022106 190455824 200729400 211421698 223272756 236792594 252272367 269677728
1052.3 269677728 288520068 307929128 326864392 344121784 358779669 370743394 380764216
1066.6 380764216 390076935 399739772 410320431 421897173 434236139 447030038 460288852 474550456
1082.9 474550456 490480304 508454442 528524935 550353467 572868168 594364107 613091588
1097.2 613091588 627785861 638044000 644229233 647113264 647403061 645494699 641950727 637581468
1113.5 637581468 632943332 628443003 624852717 623467386 625722170 632322848 642735481 655533791
$$ packed form
1005.4B94141024k3293584k1883548k0076453j7997369j5980736j3959110j1704713
1019.7A69245511r249136o800487m447535j906544J053900M353910P515774R725451
1036A69490844J0531262J0433718J0273576J0692298J1851058J3519838J5479773J7405361
1052.3B69677728J8842340J9409060J8935264J7257392J4657885J1963725J0020822
1066.6C80764216R312719R662837J0580659J1576742J2338966J2793899J3258814J4261604
1082.9D74550456J5929848J7974138K0070493K1828532K2514701K1495939J8727481
1097.2F13091588J4694273J0258139O185233K884031K89797j908362l543972m369259
1113.5F37581468m638136m500329l590286j385331K254784O600678J0412633J2798310
$$ plain form
1129.8 655533791 668881416 681087196 691103816 698515475 703191578 704868257 702970803 696945667
1146.1 696945667 686797917 673367500 658444762 644371390 633193552 626107633 623386383 624646902
1162.4 624646902 629209220 636464119 645953119 657164216 669423580 682015359 694167852 704925835
1178.8 704925835 713159919 717599869 716919005 709815085 694993377 671100438 636864126 591589153
1195.1 591589153 535950065 472952902 408097535 348013252 298289061 261804789 238259897
1209.4 238259897 225076735 219124451 218030795 220356628 224947721 230537668 236163899 241828412
1225.7 241828412 248335987 256785393 268177152 283067852 301334590 322244406 344926804 368732452
1242 368732452 393230736 418160260 443466932 469068915 494831115 520590603 546132624 571365178
$$ packed form
1129.8F55533791J3347625J2205780J0016620P411659M676103J676679j897454o025136
1146.1F96945667j0147750j3430417j4922738j4073372j1177838p085919k721250J260519
1162.4F24646902M562318P254899R489000J1211097J2259364J2591779J2152493J0757983
1178.8G04925835Q234084M439950o80864p103920j4821708k3892939l4236312m5274973
1195.1E91589153n5639088o2997163o4855367o0084283m9724191l6484272k3544892
1209.4B38259897j3183162n952284j093656K325833M591093N589947N626231N664513
1225.7B41828412O507575Q449406J1391759J4890700J8266738K0909816K2682398K3805648
1242C68732452K4498284K4929524K5306672K5601983K5762200K5759488K5542021K5232554
$$ plain form
1258.3 571365178 596166492 620185971 643284976 665780485 688078761 710314512 732047200
1272.6 732047200 752577066 771493316 788484156 803287566 815999448 826805770 835939109
1286.8 835939109 843932748 851309717 858154237 864291310 869542062 873709977 876667738 878399432
1303.2 878399432 878904343 878131032 876206398 873404205 870133281 866998672 864504516 863113821 863200366
1321.5 863200366 864774644 867718339 871607602 875568628 878897488 881307065 882760763 883277059
1337.8 883277059 882976353 881806195 879309058 875055373 868411958 857910037 841340899 816203594
1354.2 816203594 781210482 738801658 694166362 653628647 625159442 610963941 607542634
1368.4 607542634 612605274 624648631 642052948 660983324 679689169 699568450 721099615
$$ packed form
1258.3E71365178K4801314K4019479K3099005K2495509K2298276K2235751K1732688
1272.6G32047200K0529866J8916250J6990840J4803410J2711882J0806322R133339
1286.8H35939109P993639P376969O844520O137073N250752M167915K957761J731694
1303.2H78399432N04911p73311j924634k802193l270924l134609k494156j390695Q6545
1321.5H63200366J574278K943695L889263L961026L328860K409577J453698N16296
1337.8H83277059l00706j170158k497137m253685o643415j0501921j6569138k5137305
1354.2H16203594l4993112m2408824m4635296m0537715k8469205j4195501l421307
1368.4F07542634N062640J2043357J7404317J8930376J8705845J9879281K1531165
$$ plain form
1382.7 721099615 744122446 769929171 796834171 819733918 838542342 854443848 865993917
1397 865993917 873256505 877279043 878694415 878452659 877354026 875608265 873102188 869846344 865971327
1415.3 865971327 861486912 856594503 852316737 848522127 844912648 842145145 840615690 840704620 842312574
1433.7 842312574 845617890 850796044 856039584 860918403 865694463 870255947 874777377 878997386
1450 878997386 882415831 885143816 888269722 892572820 896686077 900745571 905889690 911698639 916982651
1468.4 916982651 921978116 927179098 931701183 935138643 937874496 939947605 941493690 942618072
1484.7 942618072 943428636 944009483 944730282 945673108 946524978 947118640 947262704 947280347 947757065 948182762
1505.1 948182762 947148323 946133554 946298242 946749687 947084785 947390795 947760642 948011160 947851479
$$ packed form
1382.7G21099615K3022831K5806725K6905000K2899747J8808424J5901506J1550069
1397H65993917P262588M022538J415372k41756j098633j745761k506077l255844l875017
1415.3H65971327m484415m892409m277766l794610l609479k767503j529455Q8930J607954
1433.7H42312574L305316N178154N243540M878819M776060M561484M521430M220009
1450H78997386L418445K727985L125906M303098M113257M059494N144119N808949N284012
1468.4I16982651M995465N200982M522085L437460K735853K073109J546085J124382
1484.7I42618072Q10564N80847P20799R42826Q51870N93662J44064J7643M76718M25697
1505.1I48182762j034439j014769J64688M51445L35098L06010L69847K50518j59681
$$ plain form
1523.4 947851479 947488844 947398782 947557569 947678626 947696626 948069930 949078560 949674010 948247552 946688175
1543.8 946688175 946263492 946215570 946102381 946185589 946522415 947163165 947540104 946487427 945697069 945502102
1564.2 945502102 945401847 945175469 944560885 944104373 943982244 943247080 941881955 940797329 939835846
1582.6 939835846 938811660 937634349 936264515 934755445 933067143 931058466 928756714 926300704
1598.9 926300704 923564613 920504868 917060733 913202286 908995390 904685497 900794625 896882772
1615.2 896882772 891653299 886661410 882884741 879120946 875595748 872730792 870441258 869077802
1631.5 869077802 868501902 867868125 867037833 866802037 867232382 868213892 869562805 871035814 872590899
1649.9 872590899 874779582 877159297 878758073 880649269 883103192 885765851 887994945 889686644
$$ packed form
1523.4I47851479l62635r0062J58787J21057J8000L73304J008630N95450j426458j559377
1543.8I46688175m24683m7922j13189Q3208L36826O40750L76939j052677p90358j94967
1564.2I45502102j00255k26378o14584m56512j22129p35164j365125j084626r61483
1582.6I39835846j024186j177311j369834j509070j688302k008677k301752k456010
1598.9I26300704k736091l059745l444135l858447m206896m309893l890872l911853
1615.2H96882772n229473m991889l776669l763795l525198k864956k289534j363456
1631.5H69077802n75900o33777q30292k35796M30345R81510J348913J473009J555085
1649.9H72590899K188683K379715J598776J891196K453923K662659K229094J691699
$$ plain form
1666.2 889686644 891283810 892703414 893505275 893751085 893247664 892165244 891031206 889599621 886387289
1684.5 886387289 882021308 877765179 872726262 867206752 859749794 849727869 837534428 819862247
1700.9 819862247 801308513 780459464 752254128 720010459 684752166 645888209 602582633
1715.1 602582633 552394927 505886197 472876579 446796387 425530165 411279738 402925253
1729.4 402925253 399590284 401540011 407856137 415295929 425451636 437903494 450513691 464162022
1745.7 464162022 479889095 500335574 526111960 554391623 588492870 630394995 675660491
1760 675660491 725243390 771041811 807290554 837842047 862721384 882880092 897573769 907286048
1776.3 907286048 914989889 921758533 927204967 931758225 935744524 939107597 941950202 944521725
$$ packed form
1666.2H89686644J597166J419604Q01861K45810n03421j082420j134038j431585l212332
1684.5H86387289m365981m256129n038917n519510p456958j0021925j2193441j7672181
1700.9H19862247j8553734k0849049k8205336l2243669l5258293l8863957m3305576
1715.1F02582633n0187706m6508730l3009618k6080192k1266222j4250427q354485
1729.4D02925253l334969J949727O316126P439792J0155707J2451858J2610197J3648331
1745.7D64162022J5727073K0446479K5776386K8279663L4101247M1902125M5265496
1760F75660491M9582899M5798421L6248743L0551493K4879337K0158708J4693677R712279
1776.3I07286048P703841O768644N446434M553258L986299L363073K842605K571523
$$ plain form
1792.6 944521725 946501434 948167682 949840128 951238334 952782810 954492629 956067920 957342982
1808.9 957342982 958511949 959687591 960860550 961874545 962760568 963606477 964369178 965287268 966306090
1827.3 966306090 967215300 967888474 968526661 969039142 969439447 969853878 970218480 970424473 970496953 970730364
1847.7 970730364 971084356 971425235 971651137 971827805 971879661 971906602 972092927 972341239 972435474 972360551
1868.1 972360551 972412586 972599924 972762585 972819686 972858846 972892165 972935379 972984910 973025143 973007500 973023951
1890.5 973023951 973183334 973266840 973286927 973261714 973100781 972866297 972666681 972435772 972242892 972168148
1910.9 972168148 972074747 971877158 971579373 971386254 971285522 971200287 971217155 971255720 971233130 971206427 971162856
1933.3 971162856 971114814 971094012 970987141 970773220 970700026 970861077 970969021 970961630 970934212 970919549 970969558
$$ packed form
1792.6I44521725J979709J666248J672446J398206J544476J709819J575291J275062
1808.9I57342982J168967J175642J172959J013995Q86023Q45909P62701R18090J018822
1827.3I66306090R09210O73174O38187N12481M00305M14431L64602K05993P2480K33411
1847.7I70730364L53992L40879K25902J76668N1856K6941J86325K48312R4235p4923
1868.1I72360551N2035J87338J62661N7101L9160L3319M3214M9531M0233j7643J6451
1890.5I73023951J59383Q3506K0087k5213j60933k34484j99616k30909j92880p4744
1910.9I72168148r3401j97589k97785j93119j00732q5235J6868L8565k2590k6703m3571
1933.3I71162856m8042k0802j06871k13921p3194J61051J07944p391k7418j4663N0009
$$ plain form
1955.8 970969558 971062422 971140921 971232116 971301973 971280456 971347690 971569955 971776247 971914887 972036541 972143590
1978.2 972143590 972279906 972435832 972488642 972427905 972328544 972249627 972246885 972348690 972457290 972474754 972413778
2000.6 972413778 972385287 972429812 972407877 972246468 972030878 971840680 971630692 971428454 971395433 971462786
2021 971462786 971456766 971400380 971343100 971317112 971326590 971304655 971261263 971253574 971246123 971210957 971201122 971228778 971249640
2047.6 971249640 971245408 971251011 971259713 971208990 971116602 971085608 971077204 970943272 970785737 970802188 970878482 970842659
2072 970842659 970755458 970712364 970688462 970599532 970434725 970287323 970185935 970035672 969845951 969696820 969519436
2094.5 969519436 969244123 968971431 968798816 968671799 968529463 968365729 968177795 967995405 967840970 967712522
2114.9 967712522 967630386 967588007 967592061 967646778 967749715 967882216 967888951 967778265 967818260 968070805 968308389
$$ packed form
1955.8I70969558R2864P8499R1195O9857k1517O7234K22265K06292J38640J21654J07049
1978.2I72143590J36316J55926N2810o0737r9361p8917k742J01805J08600J7464o0976
2000.6I72413778k8491M4525k1935j61409k15590j90198k09988k02238l3021O7353
2021I71462786o020n6386n7280k5988R478k1935m3392p689p451l5166r835K7656K0862
2047.6I71249640m232N603Q702n0723r2388l0994q404j33932j57535J6451P6294l5823
2072I70842659q7201m3094k3902q8930j64807j47402j01388j50263j89721j49131j77384
2094.5I69519436k75313k72692j72615j27017j42336j63734j87934j82390j54435j28448
2114.9I67712522q2136m2379M054N4717J02937J32501O735j10686L9995K52545K37584
$$ plain form
2137.3 968308389 968456388 968613863 968776166 968890011 969027936 969213843 969351947 969568372 969935715 970227063
2157.7 970227063 970354557 970521152 970768929 970945120 971094489 971297443 971531332 971780062 972058117 972307324
2178.1 972307324 972448409 972502947 972562909 972651839 972676158 972674072 972788632 973005831 973186553 973281324 973319054
2200.5 973319054 973349988 973438501 973547041 973580897 973581851 973680973 973842561 973953426 974032819 974140644 974232793
2222.9 974232793 974255979 974267304 974275231 974252224 974253118 974305511 974382460 974409282 974369824 974354148 974367261 974374533
2247.4 974374533 974390864 974407196 974388480 974344015 974344492 974453211 974584758 974592388 974517226 974468112 974468172 974503338
2271.9 974503338 974556327 974614024 974629104 974591136 974591672 974666119 974775553 974891841 974952042 974956930 974999785 975079954
2296.4 975079954 975094676 974994659 974870145 974794269 974720120 974639654 974585533 974677801 974972188 975244641 975389063
$$ packed form
2137.3I68308389J47999J57475J62303J13845J37925J85907J38104K16425L67343K91348
2157.7I70227063J27494J66595K47777J76191J49369K02954K33889K48730K78055K49207
2178.1I72307324J41085N4538N9962Q8930K4319k086J14560K17199J80722R4771L7730
2200.5I73319054L0934Q8513J08540L3856R54R9122J61588J10865P9393J07825R2149
2222.9I74232793K3186J1325P927k3007Q94N2393P6949K6822l9458j5676J3113P272
2247.4I74374533J6331J6332j8716m4465M77J08719J31547P630p5162m9114O0L5166
2271.9I74503338N2989N7697J5080l7968N36P4447J09434J16288O0201M888M2855Q0169
2296.4I75079954J4722j00017j24514p5876p4149q0466n4121R2268K94387K72453J44422
$$ plain form
2318.8 975389063 975509405 975741267 976213634 976801872 977249861 977641940 978106022 978481472 978730917 978797615
2339.2 978797615 978515565 977883816 976979911 976281106 976275802 976879656 977632105 978188813 978588045 978721738
2359.6 978721738 978593349 978453755 978141546 977439702 976605535 975865185 975245118 974736869 974364817 974267244
2380 974267244 974486411 974857688 975172698 975361705 975487173 975565493 975570261 975508392 975337267 975130260 975077331
2402.4 975077331 975096703 975028157 974936366 974901974 974869132 974835634 974848330 974837244 974799156 974827290 974939764
2424.8 974939764 975026250 975020945 974977911 974924326 974878252 974865675 974889874 974956334 975002348 974949360 974849701 974781275
2449.3 974781275 974733233 974683344 974695861 974700332 974649608 974719942 974842072 974825025 974673510 974505484 974436879
2471.7 974436879 974465907 974509418 974561334 974642813 974698842 974737883 974776685 974784136 974759042 974765360 974869847 974948287
$$ packed form
2318.8I75389063J20342K31862M72367N88238M47989L92079M64082L75450K49445O6698
2339.2I78797615k82050o31749r03905o98805n304O03854P52449N56708L99232J33693
2359.6I78721738j28389j39594l12209p01844q34167p40350o20067n08249l72052r7573
2380I74267244K19167L71277L15010J89007J25468P8320M768o1869j71125k07007n2929
2402.4I75077331J9372o8546r1791l4392l2842l3498J2696j1086l8088K8134J12474
2424.8I74939764Q6486n305m3034n3585m6074j2577K4199O6460M6014n2988r9659o8426
2449.3I74781275m8042m9889J2517M471n0724P0334J22130j7047j51515j68026o8605
2471.7I74436879K9028M3511N1916Q1479N6029L9041L8802P451k5094O318J04487P8440
$$ plain form
2496.2 974948287 974891186 974868298 974968255 975076079 975196481 975318193 975344419 975329638 975338578 975323975 975294709
2518.6 975294709 975315392 975402474 975480199 975497246 975508273 975536942 975556731 975552678 975562096 975612223 975603342 975483596
2543.1 975483596 975414217 975469887 975498378 975404203 975275338 975283265 975443184 975554645 975483954 975310206 975156009
2565.5 975156009 975098610 975105584 975098193 975109041 975133300 975143552 975132823 975094914 975070179 975040019 974960506 974834025
2590 974834025 974762261 974800408 974798679 974682689 974520922 974393427 974369049 974391222 974370122 974377155 974422872 974385858
2614.5 974385858 974292099 974192441 974066198 973949432 973863542 973779440 973685384 973606229 973529160 973403454 973251998
2636.9 973251998 973205864 973281741 973302543 973251760 973257840 973322093 973328292 973293304 973374128 973552227 973676741
2659.3 973676741 973671377 973581314 973486006 973445654 973473012 973458946 973371863 973368764 973450601 973401010 973259568 973206580
$$ packed form
2496.2I74948287n7101k2888R9957J07824J20402J21712K6226j4781Q940j4603k9266
2518.6I75294709K0683Q7082P7725J7047J1027K8669J9789m053R418N0127q881j19746
2543.1I75483596o9379N5670K8491r4175j28865P927J59919J11461p0691j73748j54197
2565.5I75156009n7399O974p391J0848K4259J0252j0729l7909k4735l0160p9513j26481
2590I74834025p1764L8147j729j15990j61767j27495k4378K2173k1100P033M5717l7014
2614.5I74385858r3759r9658j26243j16766q5890q4102r4056p9155p7069j25706j51456
2636.9I73251998m6134P5877K0802n0783O080O4253O199l4988Q0824J78099J24514
2659.3I73676741n364r0063r5308m0352K7358j4066q7083l099Q1837m9591j41442n2988
$$ plain form
2683.8 973206580 973179996 973163605 973239422 973298907 973194599 972970843 972832084 972846389 972881496 972903609 972878337
2706.3 972878337 972721994 972532153 972439587 972378194 972252965 972122371 972041786 971963286 971857607 971751511
2726.6 971751511 971675217 971692622 971799672 971889973 971915245 971926153 971964180 972003281 971991897 971921682 971884727
2749.1 971884727 971929193 972034872 972155333 972208202 972217500 972251236 972284377 972223997 972087622 971976817 971901774
2771.5 971901774 971841633 971770644 971689880 971631825 971575201 971504986 971439660 971344709 971135378 970848858 970599592
2793.9 970599592 970407605 970295310 970245361 970152318 970021904 969906867 969713449 969437659 969250917 969168901
2814.3 969168901 969084978 968927443 968671799 968406618 968223095 968070745 967903018 967718899 967443764 967043579
2834.7 967043579 966522336 965876758 965178072 964498222 963684857 962577283 961416543 960429788 959577858
$$ packed form
2683.8I73206580k6584j6391P5817N9485j04308k23756j38759J4305L5107K2113k5272
2706.3I72878337j56343j89841r2566o1393j25229j30594q0585p8500j05679j06096
2726.6I71751511p6294J7405J07050R0301K5272J0908L8027L9101j1384p0215l6955
2749.1I71884727M4466J05679J20461N2869R298L3736L3141o0380j36375j10805p5043
2771.5I71901774o0141p0989q0764n8055n6624p0215o5326r4951k09331k86520k49266
2793.9I70599592j91987j12295m9949r3043j30414j15037j93418k75790j86742q2016
2814.3I69168901q3923j57535k55644k65181j83523j52350j67727j84119k75135m00185
2834.7I67043579n21243o45578o98686o79850q13365j107574j160740r86755q51930
$$ plain form
2853.1 959577858 958795786 957979977 957126617 956333935 955590367 954801500 953923881 953013718 952124357 951298475
2873.5 951298475 950553060 949816287 949136078 948617160 948185205 947813392 947498500 947194576 947017431 947029769
2893.9 947029769 947153270 947348714 947590113 947866857 948100984 948209584 948246002 948177934 947955012 947602034
2914.3 947602034 947092474 946478367 945880115 945346773 944869339 944455445 943977237 943294585 942472696 941609442
2934.7 941609442 940848470 940328479 940092862 940142214 940461814 940900028 941279054 941623449 941853821 941876590
2955 941876590 941858172 941905975 942095041 942636669 943671644 945217431 947113454 949122012 951041520
2973.4 951041520 952586412 953709304 954685986 955678701 956519067 957013011 957357168 957771719 958238304
2991.8 958238304 958800077 959405839 959867179 960209250 960648715 961230993 961713254 961958587 962124884 962290049
$$ packed form
2853.1I59577858p82072q15809q53360p92682p43568p88867q77619r10163q89361q25882
2873.5I51298475p45415p36773o80209n18918m31955l71813l14892l03924j77145J2338
2893.9I47029769J23501J95444K41399K76744K34127J08600L6418o8068k22922l52978
2914.3I47602034n09560o14107n98252n33342m77434m13894m78208o82652q21889q63254
2934.7I41609442p60972n19991k35617M9352L19600M38214L79026L44395K30372K2769
2955I41876590j8418M7803J89066N41628J034975J545787J896023K008558J919508
2973.4I51041520J544892J122892R76682R92715Q40366M93944L44157M14551M66585
2991.8I58238304N61773O05762M61340L42071M39465N82278M82261K45333J66297J65165
$$ plain form
3012.1 962290049 962415814 962561190 962762296 962958217 963084519 963189840 963407159 963761628 964111328 964376092
3032.5 964376092 964614809 964795113 964889407 965040088 965342999 965680718 965917528 965990782 965925574 965914786
3052.9 965914786 965978563 965991259 965991795 965959728 965876341 965848684 965854347 965806603 965716779 965643585 965581000 965523660
3077.4 965523660 965532541 965525210 965422571 965326428 965237677 965070546 964858711 964631975 964455426 964474559 964609206
3099.8 964609206 964560747 964209139 963847220 963733971 963733077 963639319 963455379 963296473 963091195 962767661
3120.2 962767661 962526143 962491870 962506175 962432802 962314963 962058544 961626887 961343229 961252570 961010337
3140.6 961010337 960643113 960431814 960277021 959961057 959582269 959293425 959071100 958884001 958702505 958396316
3161 958396316 957975090 957634270 957384884 957081378 956686735 956267357 955924869 955685973 955504119 955251932
$$ packed form
3012.1I62290049J25765J45376K01106J95921J26302J05321K17319L54469L49700K64764
3032.5I64376092K38717J80304R4294J50681L02911L37719K36810P3254o5208j0788
3052.9I65914786O3777J2696N36l2067q3387k7657N663m7744q9824p3194o2585n7340
3077.4I65523660Q881p331j02639r6143q8751j67131k11835k26736j76549J9133J34647
3099.8I64609206m8459l51608l61919j13249q94r3758j83940j58906k05278l23534
3120.2I62767661k41518l4273J4305p3373j17839k56419m31657k83658r0659k42233
3140.6I61010337l67224k11299j54793l15964l78788k88844k22325j87099j81496l06189
3161I58396316m21226l40820k49386l03506l94643m19378l42488k38896j81854k52187
$$ plain form
3181.4 955251932 954780281 954225838 953798354 953425705 953009188 952584326 952191234 951832056 951420844 950951576
3201.8 950951576 950540006 950156033 949746609 949314773 948857605 948430836 948051810 947687805 947346151 947023451
3222.2 947023451 946700931 946336746 945870638 945425749 945114493 944813311 944489777 944181561 943853438 943564236
3242.6 943564236 943333447 943001032 942539930 942119896 941829443 941581488 941268861 940951943 940708458 940454662
3263 940454662 940076649 939674973 939410329 939285338 939274728 939146996 938759148 938386619 938183963 938045919
3283.4 938045919 937800169 937385976 937011182 936729908 936434031 936236262 936097920 935849190 935540199 935237825
3303.8 935237825 935001850 934809566 934472084 933987975 933515012 933094144 932783365 932561994 932224035 931769073
3324.2 931769073 931355000 930969596 930570543 930143714 929667294 929157972 928579748 927938163 927390218 927000523
$$ packed form
3181.4I55251932m71651n54443m27484l72649m16517m24862l93092l59178m11212m69268
3201.8I50951576m11570l83973m09424m31836m57168m26769l79026l64005l41654l22700
3222.2I47023451l22520l64185m66108m44889l11256l01182l23534l08216l28123k89202
3242.6I43564236k30789l32415m61102m20034k90453k47955l12627l16918k43485k53796
3263I40454662l78013m01676k64644j24991j0610j27732l87848l72529k02656j38044
3283.4I38045919k45750m14193l74794k81274k95877j97769j38342k48730l08991l02374
3303.8I35237825k35975j92284l37482m84109m72963m20868l10779k21371l37959m54962
3324.2I31769073m14073l85404l99053m26829m76420n09322n78224o41585n47945l89695
$$ plain form
3344.6 927000523 926633418 926297247 926052034 925704062 925165653 924602151 924053907 923469663 922929943 922426045
3364.9 922426045 921839952 921195269 920661151 920281470 919873655 919430256 919061065 918682694 918245673 917773306
3385.3 917773306 917187691 916533351 915982485 915589035 915393829 915314734 915004313 914448678 914051294 913865447
3405.7 913865447 913599730 913125277 912547112 912043333 911710799 911441326 911065102 910665870 910342097 910051703
3426.1 910051703 909774661 909461796 909121513 908753574 908414006 908263087 908216357 908020735 907619536 907294273
3446.5 907294273 907299340 907390475 907263637 907014370 906848431 906744003 906603038 906450152 906260788 906101704
3466.9 906101704 906179249 906365037 906424344 906389952 906285882 906126678 906134725 906430840 906815708 907163262
3487.3 907163262 907545209 907923460 908249915 908624530 908977270 909136474 909287512 909806669 910473704 910855472
$$ packed form
3344.6I27000523l67105l36171k45213l47972n38409n63502n48244n84244n39720n03898
3364.9I22426045n86093o44683n34118l79681m07815m43399l69191l78371m37021m72367
3385.3I17773306n85615o54340n50866l93450j95206p9095l10421n55635l97384j85847
3405.7I13865447k65717m74453n78165n03779l32534k69473l76224l99232l23773k90394
3426.1I10051703k77042l12865l40283l67939l39568j50919m6730j95622m01199l25263
3446.5I07294273N067R1135j26838k49267j65939j04428j40965j52886j89364j59084
3466.9I06101704P7545J85788N9307l4392j04070j59204Q047K96115L84868L47554
3487.3I07163262L81947L78251L26455L74615L52740J59204J51038N19157O67035L81768
$$ plain form
3507.7 910855472 911131024 911538184 911973655 912335455 912654638 912890494 913023531 913306236 913875043 914509654
3528.1 914509654 915045559 915418804 915615082 915921509 916473091 916977942 917242765 917343438 917698026 918496966
3548.5 918496966 919219851 919636726 920054197 920613170 921237588 921771348 922012687 921918273 922055185 923010588
3568.9 923010588 924192846 924958408 925345063 925635815 926067889 926719904 927301347 927410662 927422643 928141713
3589.3 928141713 929070354 929573357 930083513 930969477 931819022 932424426 933007181 933506668 933847249 934220970
3609.7 934220970 934737742 935546994 936686277 937841535 938779235 939621687 940651536 941749394 942641258
3628 942641258 943643808 944913268 946238339 947567344 948902249 950301468 951842725 953527510 955234706
3646.4 955234706 956811905 958267808 959794104 961383760 962876141 964142025 965384722 966743171
$$ packed form
3507.7I10855472K75552M07160M35471L61800L19183K35856J33037K82705N68807O34611
3528.1I14509654N35905L73245J96278L06427N51582N04851K64823J00673L54588P98940
3548.5I18496966P22885M16875M17471N58973O24418N33760K41339r4414J36912R55403
3568.9I23010588J182258P65562L86655K90752M32074O52015N81443J09315J1981P19070
3589.3I28141713R28641N03003N10156Q85964Q49545O05404N82755M99487L40581L73721
3609.7I34220970N16772Q09252J139283J155258R37700Q42452J029849J097858Q91864
3628I42641258J002550J269460J325071J329005J334905J399219J541257J684785J707196
3646.4I55234706J577199J455903J526296J589656J492381J265884J242697J358449
$$ plain form
3662.7 966743171 968146563 969620407 971041441 972214401 973280847 974185944 974822044 975413561 975970805
3681 975970805 976561844 977284491 978065014 978662789 978841186 978817344 978962421 979420424 979919732 980020881
3701.4 980020881 979895353 980215609 980962157 981291831 980628490 980010927 980127633 980391204 980425954 980285585
3721.8 980285585 980083942 980005205 980350316 981073558 981402636 980803549 980283380 980639577 981370926 981859863
3742.2 981859863 981822133 981947541 982323229 981991351 981220782 981029987 981214225 981343389 981342316 981444180
3762.6 981444180 981797874 982245386 982321918 981881678 981493771 981554925 981947184 982066154 981726348 981574893
3783 981574893 981570661 981385708 981291175 981572449 982069671 982388318 982563019 982776761 982672989 982447028
3803.4 982447028 982444346 982305050 982103169 982178807 982496262 982698560 982715786 982596338 982098997 981750131
$$ packed form
3662.7I66743171J403392J473844J421034J172960J066446R05097O36100N91517N57244
3681I75970805N91039P22647P80523N97775J78397k3842J45077M58003M99308J01149
3701.4I80020881j25528L20256P46548L29674o63341o17563J16706K63571L4750j40369
3721.8I80285585k01643p8737L45111P23242L29078n99087n20169L56197P31349M88937
3742.2I81859863l7730J25408L75688l31878p70569j90795J84238J29164j073J01864
3762.6I81444180L53694M47512P6532m40240l87907O1154L92259J18970l39806j51455
3783I81574893m232j84953r4533K81274M97222L18647J74701K13742j03772k25961
3803.4I82447028k682j39296k01881P5638L17455K02298J7226j19448m97341l48866
$$ plain form
3823.8 981750131 981731057 981819272 982072115 982392907 982720673 982805967 982386172 982033193 981870294 981657982
3844.2 981657982 981624544 981981575 982668102 982568622 981120467 980602801 981040776 981512845 981702924 981596768
3864.6 981596768 981554747 981567979 981418014 981218517 981046379 981078684 981134415 981101155 981219411 981174290 981000781
3887 981000781 980960906 980924308 981014729 981157660 980971813 980473459 980177164 980244935 980599761 981109262 981416464
3909.4 981416464 981437266 981162548 980687737 980424702 980399787 980361819 980302811 980426371 980665565 980507731
3929.8 980507731 980151594 980234683 980515182 980685949 980662167 980321825 980111003 980282784 980433702 980532587
3950.2 980532587 980667770 980692804 980665386 980673611 980740190 980865836 980898499 980753183 980547428 980532467 980603337
3972.7 980603337 980444789 980368078 980546594 980624318 980613351 980766892 981007755 981086195 980981827 980838418
$$ packed form
3823.8I81750131j9074Q8215K52843L20792L27766Q5294m19795l52979j62899k12312
3844.2I81657982l3438L57031O86527r9480j448155n17666M37975M72069J90079j06156
3864.6I81596768m2021J3232j49965j99497j72138L2305N5731l3260J18256m5121j73509
3887I81000781l9875l6598R0421J42931j85847m98354k96295O7771L54826N09501L07202
3909.4I81416464K0802k74718m74811k63035k4915l7968n9008J23560K39194j57834
3929.8I80507731l56137Q3089K80499J70767k3782l40342k10822J71781J50918R8885
3950.2I80532587J35183K5034k7418Q225O6579J25646L2663j45316k05755j4961P0870
3972.7I80603337j58548p6711J78516P7724j0967J53541K40863P8440j04368j43409
$$ plain form
3993.1 980838418 980775833 980851412
3997.1 980851412
$$ packed form
3993.1I80838418o2585P5579
3997.1I80851412
##END=$$ End of the data block
