##TITLE=Rachel - Amostra 7 $$ Begin of the data block
##JCAMP-DX=5.00 $$ ACD/SpecManager v 10.08
##SPECTROMETER/DATA SYSTEM=Alpha
##DATE=21 May 2015 14:09:38
##DATA TYPE=INFRARED SPECTRUM
##DATA CLASS=XYDATA
##ORIGIN=
##OWNER=
##NPOINTS=1667
##FIRSTX=599.57470703
##LASTX=3997.16503906
##MAXX=3997.16503906
##MINX=599.57470703
##MAXY=0.98573637
##MINY=0.17063758
##XFACTOR=1.0000000000
##YFACTOR=1.000000000000000e-9
##FIRSTY=0.46995226
##DELTAX=2.03937006
##XUNITS=1/CM
##YUNITS=ARBITRARY UNITS
##XYDATA=(X++(Y..Y))
599.6D69952255k051919O298214J4373422K0993679K4282217K2112251J6456604J1460662
615.9E83877385Q985281Q324146Q008897Q228839Q809209Q410215O948829N691588
632.2F47284389M801929L609538K236068J578390J939178L664494O524860Q012236
648.5F79651082O709396M326344L052473L542781N190074O239772N654574M251539
664.8G18618035L772319L721475J854182M73201J86860P56383J504660J406789Q28564
683.2G33122468M81367M09007J159668L086865N160272O228984O107509N246639M354656
701.5G65357435L770172L544927L756106L757417L080964K402961K194167K421319
717.9G90285468L107965M156888N035221N231261M866660M465520M199327L956973
$$ plain form
599.6 469952255 467900336 474198550 488571972 509565651 533847868 555960119 572416723 583877385
615.9 583877385 592862666 601186812 609195709 617424548 626233757 634643972 641592801 647284389
632.2 647284389 652086318 655695856 657931924 659510314 661449492 665113986 671638846 679651082
648.5 679651082 686360478 690686822 693739295 697282076 702472150 708711922 714366496 718618035
664.8 718618035 722390354 726111829 727966011 728439212 728626072 729382455 730887115 732293904 733122468
683.2 733122468 733603835 734012842 735172510 738259375 743419647 749648631 755756140 761002779 765357435
701.5 765357435 769127607 772672534 776428640 780186057 783267021 785669982 787864149 790285468
717.9 790285468 793393433 797550321 802585542 807816803 812683463 817148983 821348310 825305283
734.2H25305283L423452K484799J734555J585841J672208J486123J175463J130879
750.5H39998603J388430J498104J288533J047969J007914J259566J445293J370966
766.8H50305378J225293J181245J278877J302362R71615N96583O62088R03726R90570
785.2H59417737R00507O04808K68936J44780L02851O02960P25687O59168N43892L31938
805.6H64503264J47999K17795M07815L78251M8340k46108l97682p86126j246810j683950
825.9H61342788k443791l275573l602743l315270k479494j147031K48968J348615J985550
844.3H48662019K205133K053380J347065L90232m57883j501799k885222m408002o173313
862.7H39231610q455693j1463404j4672160j6503275j5287041j1091113o168843k724945
$$ plain form
734.2 825305283 828728735 831213534 832948089 834533930 836206138 837692261 838867724 839998603
750.5 839998603 841387033 842885137 844173670 845221639 846229553 847489119 848934412 850305378
766.8 850305378 851530671 852711916 853990793 855293155 856264770 856861353 857523441 858427167 859417737
785.2 859417737 860318244 860923052 861191988 861336768 861639619 862242579 862968266 863627434 864171326 864503264
805.6 864503264 864651263 864869058 865276873 865655124 865703464 865457356 865059674 864273548 863026738 861342788
825.9 861342788 858898997 855623424 852020681 848705411 846225917 845078886 845327854 846676469 848662019
844.3 848662019 850867152 852920532 854267597 854657829 854199946 852698147 849812925 845404923 839231610
862.7 839231610 830775917 819312513 804640353 788137078 772850037 761758924 755590081 752865136
879G52865136j426101k272546n073667q932054j3128579j7704904k2058725k4409533
895.3F57859027k2901296j6962767q304298K69890P135451J2267053J6113043J8292367
911.6F63768470J8063605J5862644J2977719J0659337R718836R704649R624898R135306
927.9G59515464P977069O099164L977537J991034J22487j771688l682613n497575o882906
946.3G61847973p613063p622302o668865m933536l166497k441824l817796p619679
962.6G17964411j3381899j9730329k4763048k7334690k7284503k5266707k2619843
976.9E57583392k0112276j7572880j5191496j3387531j2050926j1071474j0649025
991.1D57547784j1469633j4118492j7984599k1647871k4007022k4863630k4546952
$$ plain form
879 752865136 751439035 749166489 744092822 735160768 722032189 704327285 682268560 657859027
895.3 657859027 634957731 617994964 609690666 609960556 617096007 629363060 645476103 663768470
911.6 663768470 681832075 697694719 710672438 721331775 731050611 740755260 750380158 759515464
927.9 759515464 767492533 773591697 777569234 779560268 779682755 777911067 774228454 768730879 761847973
946.3 761847973 754234910 746612608 739943743 735010207 731843710 729401886 725584090 717964411
962.6 717964411 704582512 684852183 660089135 632754445 605469942 580203235 557583392
976.9 557583392 537471116 519898236 504706740 491319209 479268283 468196809 457547784
991.1 457547784 446078151 431959659 413975060 392327189 368320167 343456537 318909585
1005.4C18909585k3460268k1965474k0198256j8240273j6250014j4184997j1864111
1019.7A92746192r278506o721422m321828j786858J203105M625097P905334J0231405
1036A94602519J1142314J0993123J0644138J0877549J1972308J3779551J5887469J7811090
1052.3B97710061J9316018K0060181J9683719J8032402J5331775J2369364J0220319
1066.6D12723839R493530R773642J0440618J1252433J2046307J2662947J3140023J3936758
1082.9E05470097J5490472J7559469J9682706K1521568K2271514K1150470J8320918
1097.2F41467214J4419973J0112404O037653K713561J77264j951396l544212m358589
1113.5F65073872m653335m483104l495693j300096K266049O537437J0275483J2637854
$$ plain form
1005.4 318909585 295449317 273483843 253285587 235045314 218795300 204610303 192746192
1019.7 192746192 183467686 176746264 172424436 170637578 171840683 176465780 184371114 194602519
1036 194602519 205744833 216737956 227382094 238259643 250231951 264011502 279898971 297710061
1052.3 297710061 317026079 337086260 356769979 374802381 390134156 402503520 412723839
1066.6 412723839 422217369 431991011 442431629 453684062 465730369 478393316 491533339 505470097
1082.9 505470097 520960569 538520038 558202744 579724312 601995826 623146296 641467214
1097.2 641467214 655887187 665999591 672037244 674750805 674928069 672976673 669432461 665073872
1113.5 665073872 660420537 655937433 652441740 651141644 653407693 659945130 670220613 682858467
1129.8F82858467J3168514J1975109R763957P149636M385412J443744j915336n780339
1146.1G23049164r634078j2703538j4092803j3231277j0520280o692528k480924J376509
1162.4F55070245M506231P044673R185910J0751962J1642635J1989117J1625230J0235787
1178.8G32051790P768988M232228o02484o847381j4324248k2999048l2946706m3809176
1195.1F22523963n4209828o1835408o4292520o0156465n0163865l7114322k4209261
1209.4B70542294j3661325o152004j054824K452851M643410N592168N594313N475312
1225.7B73432195O074608P759779J0556460J4117002J7631293K0405322K2304058K3448557
1242C95729274K4109482K4530173K4879098K5196701K5366425K5265634K4990619K4688959
$$ plain form
1129.8 682858467 696026981 708002090 717766047 724915683 729301095 730744839 728829503 723049164
1146.1 723049164 713415086 700711548 686618745 673387468 662867188 656174660 653693736 655070245
1162.4 655070245 659576476 666621149 675807059 686559021 698201656 710190773 721816003 732051790
1178.8 732051790 739820778 744053006 743450522 736603141 722278893 699279845 666333139 622523963
1195.1 622523963 568314135 506478727 442186207 382029742 331865877 294751555 270542294
1209.4 270542294 256880969 250728965 249674141 252126992 256770402 262362570 267956883 273432195
1225.7 273432195 279506803 287266582 297823042 311940044 329571337 349976659 372280717 395729274
1242 395729274 419838756 444368929 469248027 494444728 519811153 545076787 570067406 594756365
1258.3E94756365K4230838K3427784K2495389K1813452K1530211K1474719K1017969
1272.6G50746727J9812882J8109143J6135335J4042735J1996805J0120750Q569121
1286.8H49533498P441163O747604O296634N746425M914939L862202K741814J589656
1303.2H88873935M03046p47561j741469k548516l026247k973139k388656j280010J28150
1321.5H74699533J443386K663612L569246L680587L132879K307117J368225L92973
1337.8H93257558m04179j140535k268195l849864o057679r557486j5069425k3019195
1354.2H31891000l2190203l9133966m1474879l7948609k6744186j3353706l337025
1368.4F37708426M522800J1156142J6339004J7798126J7467498J8402398J9872665
$$ plain form
1258.3 594756365 618987203 642414987 664910376 686723828 708254039 729728758 750746727
1272.6 750746727 770559609 788668752 804804087 818846822 830843627 840964377 849533498
1286.8 849533498 856974661 863722265 870018899 875765324 880680263 884542465 887284279 888873935
1303.2 888873935 889276981 888529420 886787951 884239435 881213188 878240049 875851393 874571383 874699533
1321.5 874699533 876142919 878806531 882375777 886056364 889189243 891496360 892864585 893257558
1337.8 893257558 892853379 891712844 889444649 885594785 879537106 869979620 854910195 831891000
1354.2 831891000 799700797 760566831 719091952 681143343 654399157 641045451 637708426
1368.4 637708426 642231226 653387368 669726372 687524498 704991996 723394394 743267059
1382.7G43267059K1349311K4026990K5022566K1247983J7340541J4509142J0471046
1397H77234638O567120L563643J088917l94463j039267j600742k286196k915740l529608
1415.3H76688302m199088m471839l686130l309130l244221k400876j269459J77622
1431.6H54285181J656591L136576M600703M667461M479647M401982M071057L975451
1448H85274649L851473L237605K569199K768159L663241L555775L566325M530847N199075
1466.3I18216348M809022M519522M625797L998518L022373K366066J821756J429975
1482.6I44809377R80675N32628K73048N00143Q46028P65145L41594r5367K8133N71311
1503I49552715M45604j085043j053154K07185M83454K25365J30653K42532Q6009l10659
$$ plain form
1382.7 743267059 764616370 788643360 813665926 834913909 852254450 866763592 877234638
1397 877234638 883801758 887365401 888454318 888059855 887020588 885419846 883133650 880217910 876688302
1415.3 876688302 872489214 868017375 864331245 861022115 857777894 855377018 854107559 854285181
1431.6 854285181 855941772 859078348 863679051 868346512 872826159 877228141 881299198 885274649
1448 885274649 889126122 892363727 894932926 897701085 901364326 904920101 908486426 913017273 918216348
1466.3 918216348 923025370 927544892 932170689 936169207 939191580 941557646 943379402 944809377
1482.6 944809377 945790052 946322680 946595728 947095871 947941899 948707044 949048638 948953271 948981404 949552715
1503 949552715 949998319 948913276 947860122 948067307 948550761 948776126 948906779 949149311 949235320 948924661
1523.4I48924661m04358r4533J47223M9055q1778L26217Q66949L25441j368045j356125
1543.8I47334707m22955r7155j94788k8789L02374N87463J96100j129926p44402k03848
1564.2I45598781j29342j80483n27203m27008j35958p60793j290739r43065q83400
1582.6I40320790j021326j134336j206279j324713j561105j833677k048970k234459
1598.9I27955925k534031k797842l086448l415048l746391l858387l493726l605247
1615.2I01418805m816770m454434l380359l517031l270090k570987k027809j177311
1631.5H76204014n48005p83384q88229k17556M26948R99569J242638J272142J532197
1649.9H79240334J956403J697719J289964J740635K173483K291202J865447J441002
$$ plain form
1523.4 948924661 948520303 948425770 948572993 948622048 948540270 948866487 949733436 950058877 948690832 947334707
1543.8 947334707 946911752 946814597 946619809 946591020 946893394 947480857 947676957 946547031 945802629 945598781
1564.2 945598781 945469439 945288956 944761753 944334745 944198787 943437994 942147255 941204190 940320790
1582.6 940320790 939299464 938165128 936958849 935634136 934073031 932239354 930190384 927955925
1598.9 927955925 925421894 922624052 919537604 916122556 912376165 908517778 905024052 901418805
1615.2 901418805 896602035 892147601 888767242 885250211 881980121 879409134 877381325 876204014
1631.5 876204014 875656009 874872625 873984396 873766840 874193788 875193357 876435995 877708137 879240334
1649.9 879240334 881196737 882894456 884184420 885925055 888098538 890389740 892255187 893696189
1666.2H93696189J344442J095057O34491J91331n81324j036823r73880j286328k966285
1684.5H90116870l843307l581762m138887m463196o239534q468627j0270775j5129566
1700.9H33981216j5963972j8171608k4942458k8667033l1521618l5000861l9444863
1715.1F40268803m6587229m3504477l0707657k4495304k0263910j3580531p911354
1729.4D53218341l103286J583308N784482P509201R891957J1532635J1533379J2443245
1745.7E10393262J4264703J8385231K3307979K6102186L1834006L9190113M2404592
1760G05882072M6278596M2531014L3510506K8054953K2583425J7896473J2941182Q694350
1776.3I18372571O878555N952716M778266L985286L491223K975583K465546K193808
$$ plain form
1666.2 893696189 895040631 896135688 896770179 896961510 896380186 895343363 894369483 893083155 890116870
1684.5 890116870 886273563 882691801 878552914 874089718 867850184 859381557 849110782 833981216
1700.9 833981216 818017244 799845636 774903178 746236145 714714527 679713666 640268803
1715.1 640268803 593681574 550177097 519469440 494974136 474710226 461129695 453218341
1729.4 453218341 450115055 451698363 457482845 464992046 474884003 486416638 497950017 510393262
1745.7 510393262 524657965 543043196 566351175 592453361 624287367 663477480 705882072
1760 705882072 752160668 794691682 828202188 856257141 878840566 896737039 909678221 918372571
1776.3 918372571 925251126 931203842 935982108 939967394 943458617 946434200 948899746 951093554
1792.6I51093554J716376J451373J461267J230419J357555J484633J352668J136005
1808.9I62283850J078605J009941R63390Q98779Q70943Q11100O72102P73489Q63731
1827.3I70225930P71106N16116N17845N11945M40597M33147L68655J49131k0624J61827
1847.7I74075675K78056K68638K35081K14040M7147l9160K6822J15514Q9049k5570
1868.1I75285292J25587K79128J66357n663J3292L1769K1458L3260Q4757M7207L994
1890.5I76086438J03950Q2851O5624J8239j47402k82228k59697k01106j43946n1021
1910.9I75271702q762j25110l22223k50816q5533l3855M172K742L159L3438j5676n2512
1935.4I74420726k5689q1122j96696j28626O5446P3909J8001k1696M232Q1420O8128
$$ plain form
1792.6 951093554 952809930 954261303 955722570 956952989 958310544 959795177 961147845 962283850
1808.9 962283850 963362455 964372396 965335786 966234565 967105508 967916608 968588710 969362199 970225930
1827.3 970225930 970997036 971513152 972030997 972542942 972983539 973416686 973785341 973934472 973913848 974075675
1847.7 974075675 974353731 974622369 974857450 975071490 975118637 975079477 975106299 975221813 975310862 975285292
1868.1 975285292 975410879 975690007 975856364 975850701 975863993 975895762 975917220 975950480 976035237 976082444 976086438
1890.5 976086438 976190388 976273239 976338863 976357102 976209700 975927472 975667775 975466669 975322723 975271702
1910.9 975271702 975262940 975137830 974815607 974564791 974479258 974445403 974449575 974452317 974455476 974488914 974473238 974420726
1935.4 974420726 974395037 974313915 974117219 973988593 974054039 974127948 974145949 974124253 974128485 974209905 974278033
1957.8I74278033k1935P749J25468O3598O9380K28881K41459K04325K01523Q9824o318
1980.3I75481987J4901P6354P7128k0265q6308l6240O5089N9902m232k6345Q762K4796
2004.7I75635529m8995j07348j36555j96933k50400j91807j4186Q1420K086n7519n2213
2027.2I74663079l1114M0412O0022K6524J7464l6955p9870k9445k98k4676n6744o7472
2051.6I74480927k3246K7836Q940k3067j6570m3988n6565N722K1935l2306n7817k6464
2076.1I74265337J2755m2975j41203j54376j37448j47939j78933k06232j96219j82807
2096.5I72889960j69695j15990j00613j60694j94013j80304j47343j05262o2823j9789
2116.9I71633434l5762l9578O974K4140N1975L8862j7106N1498J92046K00510J23024
$$ plain form
1957.8 974278033 974256098 974263847 974389315 974452913 974522293 974751174 974992633 975196958 975398481 975488305 975481987
1980.3 975481987 975496888 975573242 975650370 975630105 975543797 975507557 975572646 975632548 975628316 975601971 975610733 975635529
2004.7 975635529 975586534 975479186 975342631 975145698 974895298 974703491 974689305 974770725 974772811 974715292 974663079
2027.2 974663079 974631965 974672377 974732399 974758923 974776387 974739432 974659562 974630117 974629819 974605143 974548399 974480927
2051.6 974480927 974457681 974485517 974494457 974471390 974454820 974410832 974354267 974359989 974381924 974349618 974291801 974265337
2076.1 974265337 974278092 974235117 974093914 973939538 973802090 973654151 973475218 973268986 973072767 972889960
2096.5 972889960 972720265 972604275 972503662 972342968 972148955 971968651 971821308 971716046 971653223 971633434
2116.9 971633434 971597672 971558094 971565068 971589208 971641183 971680045 971662939 971714437 971906483 972106993 972230017
2139.3I72230017J31548J70529R9957P0035J37269J60873K25425K97606K65300J79589
2159.7I73968148J17421R1315J30891J98842J76727J57357K27451L15130K67863Q1599
2180.1I75732744l8624j4961K3544K6882R0062J76788J89781Q8096k9922j6928Q7738
2202.5I76315200J25349N3108j5080j014P3612J18733J33395J39117N2035l1471K1755
2225I76984739J02580J12712Q7738O1274j2398p7486l6299J7166K980q702N3406J02520
2249.4I77390230M0233m1962o0737m0948N0425J36256O1036m5598l9756j1683k682
2271.9I77434814k503Q761M2737L0279M6551J04309O7055j252l934K3306N1558R6440
2296.4I77898121Q8990R179q166k6643j18673r4295k6703J5676J80841K77936K15411
$$ plain form
2139.3 972230017 972361565 972532094 972632051 972702086 972839355 973000228 973225653 973523259 973788559 973968148
2159.7 973968148 974085569 974176884 974307775 974506617 974683344 974840701 975068152 975383282 975651145 975732744
2180.1 975732744 975694120 975679159 975702703 975729585 975819647 975996435 976186216 976274312 976244390 976227462 976315200
2202.5 976315200 976440549 976493657 976478577 976477563 976551175 976669908 976803303 976942420 976994455 976962984 976984739
2225 976984739 977087319 977200031 977287769 977349043 977336645 977259159 977222860 977240026 977243006 977234304 977287710 977390230
2249.4 977390230 977430463 977388501 977327764 977286816 977337241 977473497 977534533 977488935 977449179 977437496 977434814
2271.9 977434814 977432311 977441072 977483809 977514088 977560639 977664948 977732003 977730751 977726817 977750123 977801681 977898121
2296.4 977898121 977987111 977996290 977988124 977961481 977842808 977748513 977721810 977737486 977918327 978196263 978411674
2318.8I78411674J16468N0604K11597M87864O03437O36280N14626K70248K38538J58429
2339.2I81699765k93851p41780r42230o77467Q0586P49349Q42929M93169J52290j05977
2359.6I81256783j54734j54137m56810o89447n79059n70298o63280n40614k47657M4167
2380I77244914K49445L26753K78115K08497J25349R596k4855k5988j05440j47462p5400
2402.4I78063524j9908m888J4484P570l0160k3067K4557k9206n7042L6419N0544j7881
2426.9I78014946o7592r0062n3943Q822N9247J05381J10805J9252p0333l5644N37l3438
2451.3I77967978p3076o3181m9889l2305O7174J02520k9028j67369r4355P2003Q0645
2473.8I77781117R954p212K6762N0366K1577J9312N8353j4603j05918k1517J03951
$$ plain form
2318.8 978411674 978528142 978578746 978790343 979278207 979881644 980517924 981032550 981302798 981541336 981699765
2339.2 981699765 981405914 980664134 979721904 979044437 979125023 979874372 980717301 981210470 981362760 981256783
2359.6 981256783 981102049 980947912 980491102 979801655 979222596 978652298 977989018 977448404 977200747 977244914
2380 977244914 977494359 977821112 978099227 978307724 978433073 978442669 978417814 978391826 978286386 978138924 978063524
2402.4 978063524 978043616 978038728 978053212 978060782 978030622 978007555 978032112 978002906 977945864 977982283 978032827 978014946
2426.9 978014946 977947354 977857292 977803349 977812171 977871418 977976799 978087604 978106856 978036523 978000879 978001416 977967978
2451.3 977967978 977894902 977831721 977781832 977749527 977816701 977919221 977890193 977722824 977628469 977700472 977781117
2473.8 977781117 977791071 977783859 977810621 977860987 977882564 977901876 977960229 977945626 977839708 977818191 977922142
2496.2I77922142J04844L7789J7345N1439P3493M9412L3855N8234N2512j4365k3484
2518.6I78363216K6345J4007l338M8399R9123P7009J5915j4723M1187N2273n7578m7505
2543.1I78614330N4717K1935q5354j24097q2314L219M9352r596o2227m6849n8830m9114
2567.6I78225172J2576J7524j5259m2975o6876n4658J0431O7532M0591m4763j45197
2590I78004098j32263P451Q3446m887j61946k02537j43051n2869R596J9491L3677r299
2614.5I77450907n5134N603L5584l3260m8995n9485j44422j48475q0943o9142p4506
2636.9I76777732k3424L5822n9p2003l8445L3677J4066k1696L9339J15037N1439m8160
2661.4I76863325n1022j5140K9207N0306q821p4149o020L4154o0499n9068k6524n0962
$$ plain form
2496.2 977922142 978026986 978064775 978082120 978133559 978207052 978256464 978290319 978348553 978401065 978386700 978363216
2518.6 978363216 978389561 978403568 978400230 978448629 978547752 978624761 978640676 978625953 978667140 978719413 978661835 978614330
2543.1 978614330 978669047 978690982 978605628 978481531 978399217 978402436 978451788 978442192 978379965 978333116 978274286 978225172
2567.6 978225172 978237748 978255272 978240013 978197038 978130162 978075504 978085935 978153467 978194058 978149295 978004098
2590 978004098 977871835 977879286 977962732 977957845 977795899 977593362 977450311 977397442 977407038 977426529 977460206 977450907
2614.5 977450907 977395773 977401376 977436960 977403700 977354705 977295220 977150798 977002323 976921380 976852238 976777732
2636.9 976777732 976754308 976790130 976790071 976718068 976679623 976713300 976727366 976705670 976745009 976860046 976911485 976863325
2661.4 976863325 976812303 976797163 976826370 976876676 976867855 976793706 976787686 976821840 976761341 976702273 976675749 976624787
2685.9I76624787K98N8174K8610o1273j49906j13130j4484k0682n4181p9930j34766
2708.3I76083517j44064p4745j3470l7670o6519o9142j19626j05143N544J1921j014
2730.7I75469589Q4877R5725O855m2141l8445k2173K1160J5795m4286Q285J00136L7908
2755.2I75693285j1384N4240O3896j0669p9214o9976o9380j35303j43587n0187M0292
2777.6I75282013K0922o1155j07646j25587j30474j06216q4936o0618p1705j43408
2798I74411190j82331k08557k20120j66475j41442j39058m0948N9247k4915j74880
2818.4I73171711k13623k01583j92761k02239j72377q5532j58489m01855m94360m06921
2838.8I70641971m49419n90682p37071r79066j093686r58264p54535o11723n87344
$$ plain form
2685.9 976624787 976625085 976683259 976711869 976650596 976500690 976387560 976373076 976352394 976298213 976218283 976083517
2708.3 976083517 975939453 975864708 975851238 975813568 975747049 975677907 975558281 975453138 975458682 975470603 975469589
2730.7 975469589 975554466 975650191 975657046 975614905 975576460 975554287 975575447 975591242 975546956 975555241 975655377 975693285
2755.2 975693285 975681901 975736141 975800037 975789368 975710154 975640178 975570798 975435495 975291908 975241721 975282013
2777.6 975282013 975302935 975241780 975134134 975008547 974878073 974771857 974686921 974626303 974554598 974411190
2798 974411190 974228859 974020302 973800182 973633707 973492265 973353207 973312259 973371506 973346591 973171711
2818.4 973171711 972958088 972756505 972563744 972361505 972189128 972103596 971945107 971543252 971048892 970641971
2838.8 970641971 970192552 969601870 968864799 967885733 966792047 965833783 965079248 964467525 963880181
2857.2I63880181n87701n62668n67377n67973n75065n73814n37634n49197o51658p27415
2877.6I57979679n95450l88861l22998k78592k35498k26199j20640n662P7009J75714
2897.9I56058502J71066J55031J48416L2186k1577l1888j98126m06086n15104o03616
2918.3I54788804o36458m96149l06964k19286k97367m25220n04672o03438n01156k20775
2938.7I50577319q9586K5689K82646L71277K43187J61827J0430j42216p8440k7060
2959.1I51335073L1590L70741Q47638J294732J665115J761556J569390J238227R20594
2977.5I61034656P79211P53462N85676L37660L70622M83632K90692J35123K53499L37124
2997.9I65361357L38018L83675L66866K13147J68025K77639K29597P6592J1205L7730
$$ plain form
2857.2 963880181 963292480 962729812 962162435 961594462 961019397 960445583 959907949 959358752 958707094 957979679
2877.6 957979679 957384229 956995368 956672370 956393778 956158280 955932081 955811441 955805779 955882788 956058502
2897.9 956058502 956229568 956384599 956533015 956565201 956543624 956511736 956313610 955907524 955392420 954788804
2918.3 954788804 954152346 953656197 953349233 953129947 952832580 952407360 951902688 951299250 950798094 950577319
2938.7 950577319 950487733 950513422 950796068 951167345 951410532 951572359 951582789 951440573 951362133 951335073
2959.1 951335073 951366663 951737404 952585042 953879774 955544889 957306445 958875835 960114062 961034656
2977.5 961034656 961813867 962567329 963153005 963490665 963861287 964344919 964635611 964770734 965024233 965361357
2997.9 965361357 965699375 966083050 966449916 966663063 966831088 967108727 967338324 967414916 967426121 967463851
3018.3I67463851J39892J49727K9445L8743K46703L61979K67208J64211J27434R3043
3038.7I69082236O8903Q6010J65045K21074J29342L4153L9220j013o914Q6486p331
3061.1I69897211j91808j46210o8069n0843m8101j54733j82986n7340L4034M5538L5286
3083.5I69111979P272j02639k07305k23577k15173j35899L1650R5487q8394k96175
3103.9I67977226k66850j21594l5226l1173q1003j61111k36035k42650j52946l3259
3124.3I66615379l0577p5758q6784k46644m25458l45886j81138j73808k01165j12117
3144.7I64736044j31607l44157l68595j51455r2984j82271j77204j66059k86996m15921
3165.1I62418795l93808l42787l08454k33650j70708j30236j72436k98321m13001m56035
$$ plain form
3018.3 967463851 967603743 967753470 967782915 967821658 968068361 968430340 968697548 968861759 968989193 969082236
3038.7 969082236 969151139 969237149 969402194 969623268 969752610 969786763 969825983 969824970 969818056 969904542 969897211
3061.1 969897211 969705403 969559193 969491124 969440281 969392180 969237447 969054461 968997121 969031155 969076693 969111979
3083.5 969111979 969119251 969016612 968809307 968585730 968370557 968234658 968266308 968361795 968273401 967977226
3103.9 967977226 967710376 967588782 967553556 967522383 967441380 967280269 967044234 966801584 966648638 966615379
3124.3 966615379 966584802 966509044 966422260 966175616 965750158 965404272 965223134 965049326 964848161 964736044
3144.7 964736044 964604437 964260280 963891685 963740230 963647246 963464975 963287771 963121712 962834716 962418795
3165.1 962418795 962024987 961682200 961373746 961140096 960969388 960839152 960666716 960368395 959955394 959499359
3185.5I59499359l72350k38597j97530k58088l49045m22299m05848l03626l12507l65436
3205.9I56274033l04461l34859m19140l82006l22640l05235l00765k95997l09288l25561
3226.3I52974081k76923k20239k20716k10584k66611l90053l51071j72079p7665j71899
3246.7I50616241l44098l67344k25067j43349j99795k65419k41578k05338k73645k98857
3267.1I48051751j86921m5418R298j74880l31879k18987j15097j50382k79069l67582
3287.5I46190834k52306j47999j91033j18255j5676j16349k09331k53618l45528l10600
3307.8I44230139j96874k53022l23653k53439k27690k25842k96771m27008l36945k34306
3328.2I41454589k93791l17335l35634m15265m94421m54843k75195k00152l17335l82781
$$ plain form
3185.5 959499359 959127009 958888412 958690882 958432794 958083749 957661450 957255602 956951976 956639469 956274033
3205.9 956274033 955969572 955634713 955215573 954833567 954510927 954205692 953904927 953608930 953299642 952974081
3226.3 952974081 952697158 952476919 952256203 952045619 951779008 951388955 951037884 950865805 950788140 950616241
3246.7 950616241 950272143 949904799 949679732 949536383 949336588 949071169 948829591 948624253 948350608 948051751
3267.1 948051751 947864830 947819412 947828710 947653830 947321951 947102964 946987867 946837485 946558416 946190834
3287.5 946190834 945938528 945790529 945599496 945481241 945465565 945349216 945139885 944886267 944540739 944230139
3307.8 944230139 944033265 943780243 943456590 943203151 942975461 942749619 942452848 942025840 941688895 941454589
3328.2 941454589 941160798 940843463 940507829 940092564 939598143 939143300 938868105 938667953 938350618 937967837
3348.6I37967837l47197l42667k91944k36690l95059n40555m40300l69012m18305m36425
3369I34149683l92259l74436m20570l60728k64704k65598k74480l35216m33564m78864
3389.4I30549264m29452k83181j77324k02298k89858k51293j05023j20401k86222l94762
3409.8I28009450m02748l29733k11477j82391k95281l29256j88708j38700j93298j75953
3430.2I25561905j73688j91867j60933j32978j02043j03354j99736k18153n7280j6212
3450.6I24205661j15395j50919j59800j9133J49012J8179k24411k48075L4809K86758
3471I23776686J95623J8239o2645p4684J09076K74718J91629J92284L56079L84271
3491.4I25361276K78234K00868K02000K20418K16722L49701M85837M18246L61443L37064
$$ plain form
3348.6 937967837 937620640 937277973 936986029 936749339 936354280 935813725 935373425 935004413 934586108 934149683
3369 934149683 933757424 933382988 932962418 932601690 932336986 932071388 931796908 931461692 931028128 930549264
3389.4 930549264 930119812 929836631 929659307 929457009 929167151 928915858 928810835 928690434 928404212 928009450
3409.8 928009450 927606702 927276969 927065492 926883101 926587820 926258564 926069856 925931156 925737858 925561905
3430.2 925561905 925388217 925196350 925035417 924902439 924800396 924697042 924497306 924279153 924221873 924205661
3450.6 924205661 924090266 923939347 923779547 923760414 923909426 923927605 923703194 923455119 923489928 923776686
3471 923776686 923972309 923990548 923927903 923853219 923962295 924237013 924428642 924620926 924977005 925361276
3491.4 925361276 925639510 925840378 926042378 926262796 926479518 926829219 927315056 927733302 928094745 928431809
3511.8I28431809K32637J93477K94268K63214Q7976J49071L80457M87566M76420L58879
3532.2I31355774J72913K06292M17113L31879J0133n4538L63826P66218O19948M11809
3552.6I34601367M88698N39660M79758L34680Q8930k61843k01940O28233J016676P16448
3573I38430667M66287L42369L93272O07073M98235l4809j69694O36577Q69036K51293
3593.4I42290306K57135Q26358Q14140N41508N35250M15385K37048L29792M30822O18875
3613.7I47296619J001239R15289N05328O22094R92715J022697N99265N42819J093269
3632.1I54591334J272559J195252J163661J116455J234949J515865J543343J198590
3648.4I64832008R26018J106977J258552J154840R68099R87291J109362J200020J327038
$$ plain form
3511.8 928431809 928664446 928857923 929152191 929415405 929503381 929652452 930032909 930520475 930996895 931355774
3532.2 931355774 931528687 931734979 932152092 932483971 932494104 932439566 932803392 933569610 934189558 934601367
3552.6 934601367 935090065 935629725 936109483 936444163 936533093 936271250 936069310 936697543 937714219 938430667
3573 938430667 938896954 939239323 939632595 940239668 940737903 940703094 940533400 941169977 942039013 942290306
3593.4 942290306 942547441 943373799 944187939 944729447 945264697 945680082 945917130 946246922 946677744 947296619
3613.7 947296619 948297858 949213147 949718475 950340569 951333284 952355981 952955246 953498065 954591334
3632.1 954591334 955863893 957059145 958222806 959339261 960574210 962090075 963633418 964832008
3648.4 964832008 965758026 966865003 968123555 969278395 970246494 971233785 972343147 973543167 974870205
3666.8I74870205J185179Q73446Q74698N97716K45511M03226M91917N79834P27653
3685.1I80849385O21438J94073p9036L0995L01659N59091N09441J01388n2095L00169
3705.5I83336508M94182J07348n94258n30779J0013J76490M8875j40488j66118R2864
3725.9I82834637N37634O27399J8715o46352l18289M03225N98908L68595K8133K74003
3746.3I84726608M60863k51114q20280k91824J37150K9743m6194J69218L90410M51923
3766.7I84956503O1035m81546k74956K51830L14235j21712l78192j39713l5882j03116
3787.1I84048486k9147K49088N09024L62992J39594J49488j86622l74555o7115p8619
3807.5I84722614q0466K75373M70281J52171k2054o3479n98669n19395m8339J69277
$$ plain form
3666.8 974870205 976055384 976928830 977803528 978401244 978646755 979049981 979541898 980121732 980849385
3685.1 980849385 981470823 981664896 981585860 981616855 981918514 982477605 982987046 983088434 983036339 983336508
3705.5 983336508 983830690 983938038 983343780 982813001 982823014 982999504 983048379 982907891 982741773 982834637
3725.9 982834637 983372271 983999670 984018385 983372033 983053744 983456969 984055877 984424472 984452605 984726608
3746.3 984726608 985187471 984936357 984116077 983824253 983961403 983991146 983944952 984114170 984504580 984956503
3766.7 984956503 985017538 984535992 984261036 984512866 984827101 984705389 984327197 984187484 984151602 984048486
3787.1 984048486 984019339 984268427 984777451 985140443 985280037 985429525 985242903 984868348 984801233 984722614
3807.5 984722614 984642148 984917521 985387802 985539973 985517919 985454440 984855771 984336376 984288037 984457314
3827.9I84457314L91066M36068L16500J35422k98083m34696k25902j43290j6152K45273
3848.3I84863520M27544l17455j306474k80678N54919M87924J08361k22862j75476
3866.6I84139323j70707j82868R1315J43528Q6486k2054j25050l0995n1438N9485R4950
3889.1I84031975k05219j85787N0247j04487m05968k65717J23977L58403M03583K70248
3909.4I84071255J22666r2208l49403l61621j93358p8797%K12669K86937q5890l38018
3931.9I83194232l7730K55943K20656j0073k85268k27213J9789P7486R7573R0003J19328
3954.3I83514726J91212J2100j83344q6367L1113M5061Q0705J24753n5254l45170j42873
3976.7I83186662K29418J70589J09136K24531J47521q1718j78337p8082k4974m8042
$$ plain form
3827.9 984457314 984848380 985284448 985600948 985736370 985438287 985003591 984777689 984634399 984618247 984863520
3848.3 984863520 985291064 984973609 983667135 983386457 983941376 984429300 984537661 984314799 984139323
3866.6 984139323 983968616 983785748 983877063 984020591 984107077 984085023 983959973 983928978 983877540 983937025 984031975
3889.1 984031975 983826756 983640969 983691216 983586729 983180761 982915044 983039021 983397424 983801007 984071255
3909.4 984071255 984193921 984101713 983752310 983390689 983197331 983118534 983118534 983331203 983618140 983532250 983194232
3931.9 983194232 983156502 983412445 983633101 983623028 983337760 983110547 983130336 983207822 983305395 983395398 983514726
3954.3 983514726 983705938 983718038 983534694 983448327 983479440 983524501 983605206 983729959 983674705 983329535 983186662
3976.7 983186662 983416080 983586669 983695805 983920336 984067857 983986139 983807802 983729720 983704746 983656704
3997.1I83656704
$$ plain form
3997.1 983656704
##END=$$ End of the data block
