##TITLE=Rachel - Amostra 6 $$ Begin of the data block
##JCAMP-DX=5.00 $$ ACD/SpecManager v 10.08
##SPECTROMETER/DATA SYSTEM=Alpha
##DATE=21 May 2015 14:09:38
##DATA TYPE=INFRARED SPECTRUM
##DATA CLASS=XYDATA
##ORIGIN=
##OWNER=
##NPOINTS=1667
##FIRSTX=599.57470703
##LASTX=3997.16503906
##MAXX=3997.16503906
##MINX=599.57470703
##MAXY=0.98278785
##MINY=0.12894276
##XFACTOR=1.0000000000
##YFACTOR=1.000000000000000e-9
##FIRSTY=0.44223827
##DELTAX=2.03937006
##XUNITS=1/CM
##YUNITS=ARBITRARY UNITS
##XYDATA=(X++(Y..Y))
599.6D42238271k858460N528897J4343500K1682144K5233596K3088992J6912520J1249959
$$ 442238271 439379811 444908708 459252208 480934352 506167948 529256940 546169460 557419419
615.9E57419419Q764744Q297145Q022070Q315862Q945047Q780063P728636O453097
$$ 557419419 566184163 574481308 582503378 590819240 599764287 608544350 616272986 622726083
632.2F22726083M993796L397584K231896J823008K309024M173518O741345P849633
$$ 622726083 627719879 631117463 633349359 635172367 637481391 641654909 648396254 656245887
648.5F56245887O560684M190504K774954L414690N570174O792247O019711M593015
$$ 656245887 662806571 666997075 669772029 673186719 678756893 685549140 691568851 696161866
664.8F96161866M181326L928721J957953N98549J1027L90470J493514J950860J400292
$$ 696161866 700343192 704271913 706229866 706828415 706839442 707229912 708723426 710674286 712074578
683.2G12074578M11510j69158R04382L468453N638719O713331O650209N450130M425466
$$ 712074578 712486088 712316930 713221312 716689765 722328484 729041815 735692024 741142154 745567620
701.5G45567620M178524M012465L851116L680587L311395K858878K473414K701461
$$ 745567620 749746144 753758609 757609725 761290312 764601707 767460585 769933999 772635460
717.9G72635460L612459M591167N314350N506873N184591M943847M630447M042864
$$ 772635460 776247919 780839086 786153436 791660309 796844900 801788747 806419194 810462058
734.2H10462058L472089K755285K013862J685679J748442J756728J600206J535118
$$ 810462058 813934147 816689432 818703294 820388973 822137415 823894143 825494349 827029467
750.5H27029467J618623J519382J316071J341581J423478J452625J381934J240432
$$ 827029467 828648090 830167472 831483543 832825124 834248602 835701227 837083161 838323593
766.8H38323593J138389J196206J378834J425862J135707Q00610R09686J080453R35615
$$ 838323593 839461982 840658188 842037022 843462884 844598591 845399201 846308887 847389340 848324955
785.2H48324955P75456N79417M36485N81443N65469L97921L62694L93867M92931L61621
$$ 848324955 849100411 849679828 850116313 850697756 851263225 851661146 852023840 852417707 852910638 853272259
805.6H53272259K2531j8001K17736K76029N0426k52068n20885q32320j200616j791477
$$ 853272259 853294790 853276789 853494525 853770554 853820980 853568912 853048027 852215707 851015091 849223614
825.9H49223614k693117l492057l868580l618062k616226j185239K31386J510024K444028
$$ 849223614 846530497 843038440 839169860 835551798 832935572 831750333 831981719 833491743 835935771
844.3H35935771K626122K098321J326144N34892m20511j694977l176212m751563o644309
$$ 835935771 838561893 840660214 841986358 842521250 842100739 840405762 837229550 832477987 825833678
862.7H25833678r177983j2571156j6194582j8254816j7038763j2589991p089078l017068
$$ 825833678 816655695 804084539 787889957 769635141 752596378 740006387 732917309 729900241
879G29900241j433253k358377n342603r460688j4075577j9037783k3711980k6436686
$$ 729900241 728466988 726108611 720766008 711305320 697229743 678191960 654479980 628043294
895.3F28043294k5213540j9372821j0358512r41157O627679J2358307J7061413K0005643
$$ 628043294 602829754 583456933 573098421 572157264 578784943 591143250 608204663 628210306
911.6F28210306K0086825J7818689J4708996J2128175J0897338J0761499J0873139
$$ 628210306 648297131 666115820 680824816 692952991 703850329 714611828 725484967
925.9G25484967J0546744R383202P378101M998088K726018M78924j771272l831088
$$ 725484967 736031711 745414913 752793014 757791102 760517120 760996044 759224772 755393684
942.2G55393684n720198p288695q210778q211911p135570n219221l169596k182364
$$ 755393684 749673486 742384791 734174013 725962102 718826532 713607311 710437715 708255351
958.5G08255351l574074p696449j3837398k0697832k6440561k9499411k9547870k7415276
$$ 708255351 704681277 696984828 683147430 662449598 636009037 606509626 576961756 549546480
974.8E49546480k4353862k1408498j8784493j6278833j4175296j2615144j1374772
$$ 549546480 525192618 503784120 484999627 468720794 454545498 441930354 430555582
989.1D30555582j0715425j1485577j4104336j7898768k1583289k4076849k5036961
$$ 430555582 419840157 408354580 394250244 376351476 354768187 330691338 305654377
1003.4C05654377k4771303k3731590k2226080k0416587j8421218j6410440j4376045
$$ 305654377 280883074 257151484 234925404 214508817 196087599 179677159 165301114
1017.6A65301114j2152910r693861p240042m883260k388283M83751L806129P042453
$$ 165301114 153148204 143454343 136214301 131331041 128942758 129426509 133232638 140275091
1034A40275091R390429J0368302J0299176J0115221J0492668J1585250J3346002J5528500
$$ 140275091 149665520 160033822 170332998 180448219 190940887 202526137 215872139 231400639
1050.3B31400639J7599538J9167527J9947023J9617706J7917007J5080273J2043715
$$ 231400639 249000177 268167704 288114727 307732433 325649440 340729713 352773428
1064.6C52773428R906471R119540R399176J0276764J1268348J2081891J2634844J3188690
$$ 352773428 362679899 371799439 381198615 391475379 402743727 414825618 427460462 440649152
1080.9D40649152J4252037J6041338J8372297K0935446K3220897K4265409K3293614
$$ 440649152 454901189 470942527 489314824 510250270 533471167 557736576 581030190
1095.1E81030190K0313084J5954912J1065960O383717K604484j26004k301574l972292
$$ 581030190 601343274 617298186 628364146 634747863 637352347 637226343 634924769 630952477
1111.5F30952477m906892n301118n229712m210591j634359K491891P230401J1374235
$$ 630952477 626045585 620744467 615514755 611304164 609669805 612161696 619392097 630766332
1127.8F30766332J4069975J4834702J3678371J1159480Q101761N032719J909196j742244
$$ 630766332 644836307 659671009 673349380 684508860 692610621 697643340 699552536 697810292
1144.1F97810292o165445j0763883j4470995j6139209j5288651j2329757p986725l236711
$$ 697810292 691644847 680880964 666409969 650270760 634982109 622652352 614665627 611428916
1160.4F11428916J057387M580080P494092R989977J1977315J3293326J3893783J3592601
$$ 611428916 612486303 617066383 624560475 634550452 646527767 659821093 673714876 687307477
1176.7F87307477J2111306R337425N297006o6936o885052j5066862k4597526l5463929
$$ 687307477 699418783 708756208 714053214 713986278 707101226 692034364 667436838 631972909
1193F31972909m7027051n7821751o5545052o7638964o2778443n2112102l8613365k5340393
$$ 631972909 584945858 527124107 461579055 393940091 331161648 279049546 240436181 215095788
1209.4B15095788j4446929o697565j464367K073973M275814N377695N580336N515024
$$ 215095788 200648859 193951294 192486927 194560900 198836714 204214409 209794745 215309769
1225.7B15309769O050378P740453J0647461J4377415J8137365K1172226K3203343K4316371
$$ 215309769 221360147 229100600 239748061 254125476 272262841 293435067 316638410 340954781
1242C40954781K4968117K5536060K5997311K6292235K6522368K6546389K6296109K6049316
$$ 340954781 365922898 391458958 417456269 443748504 470270872 496817261 523113370 549162686
1258.3E49162686K5749564K4993360K4099648K3720622K3718536K3739994K3346901
$$ 549162686 574912250 599905610 624005258 647725880 671444416 695184410 718531311
1272.6G18531311K2182524K0386636J8167555J5793383J3595760J1595667R758532
$$ 718531311 740713835 761100471 779268026 795061409 808657169 820252836 830011368
1286.8H30011368Q388758P679224P231950O609977N696892M530609L189921J833380
$$ 830011368 838400126 846079350 853311300 859921277 865618169 870148778 873338699 875172079
1303.2H75172079N52833p66158k065659l199577l861308l785909l072977j802146j29044
$$ 875172079 875724912 874958754 872893095 869693518 865832210 862046301 858973324 857171178 857042134
1321.5H57042134J663625L359497M438161M511059L862500K900243J923144R14097
$$ 857042134 858705759 862065256 866503417 871014476 874876976 877777219 879700363 880614460
1337.8H80614460j93418j397490k819657m566491p065594j1162937j7708957k7171016
$$ 880614460 880421042 879023552 876203895 871637404 864571810 853408873 835699916 808528900
1354.2H08528900l8105607m6174109m8200309m3149531k9860735j4719427l614246
$$ 808528900 770423293 724249184 676048875 632899344 603038609 588319182 584704936
1368.4E84704936N082428J2634993J8686354K0400703J9988596K0935774K2485435
$$ 584704936 589787364 602422357 621108711 641509414 661498010 682433784 704919219
1382.7G04919219K4271667K7683318K9121935K4953008K0723223J7662526J2782335
$$ 704919219 729190886 756874204 785996139 810949147 831672370 849334896 862117231
1397H62117231P883727M223943J357019m11868j241267j882493k780259l740907m515051
$$ 862117231 870000958 874224901 875581920 875170052 873928785 872046292 869266033 865525126 861010075
1415.3H61010075n152226n486727m761397m253924m033745l023386j591801K11656
$$ 861010075 855857849 850371122 845609725 841355801 837322056 834298670 832706869 832918525
1431.6H32918525J884818L718555N677581N682706N270780N144536M937470M976988
$$ 832918525 834803343 838521898 844199479 849882185 855152965 860297501 865234971 870211959
1448H70211959M698157L816605L046989L385186M392028M054904M035771N315542O200314
$$ 870211959 874910116 878726721 881773710 885158896 889550924 893605828 897641599 902957141 909157455
1466.3I09157455N625546N232274N551339M920125L630757K798855K132893J667738
$$ 909157455 914783001 920015275 925566614 930486739 934117496 936916351 939049244 940716982
1482.6I40716982J231432Q03530N42879P25806R21845P93577N04255J25229J24991
$$ 940716982 941948414 942751944 943294823 944020629 944942474 945736051 946240306 946365535 946490526
1501I46490526M99964L74556q04544p58648J66297M21703L47197L07202L17634J68085
$$ 946490526 946990490 947365046 946560502 945801854 945968151 946389854 946737051 947044253 947361887 947529972
1521.4I47529972j11938k07722K146J80542J16587L1471L90291Q93951M26471j258850
$$ 947529972 947418034 947210312 947212458 947393000 947509587 947541058 947931349 948825300 949251771 947992921
1541.8I47992921j316965l62634N7399K0683J14441L74972O65009L61205r14991o70433
$$ 947992921 946675956 946313322 946370721 946391404 946505845 946880817 947545826 947907031 946992040 946321607
1562.2I46321607j85311p3612j06692m87387m09425j11937p25568j319527j010597
$$ 946321607 946136296 946062684 945955992 945468605 945059180 944947243 944221675 942902148 941891551
1580.5I41891551r19700j063108j257122j423776j571536j794815k179027k590775
$$ 941891551 940971851 939908743 938651621 937227845 935656309 933861494 931682467 929091692
1596.8I29091692k887666l250361l532648l822565m245460m703999m863142m558504
$$ 929091692 926204026 922953665 919421017 915598452 911352992 906648993 901785851 897227347
1613.2H97227347m846513o208659n602240m296243m398346m051268l254712k611578
$$ 897227347 892380834 886172175 880569935 876273692 871875346 867824078 864569366 861957788
1629.5H61957788j574277p47919p98405q47101j42693N93125J175642J508654J646697
$$ 861957788 860383511 859635592 858837187 857990086 857847393 858440518 859616160 861124814 862771511
1647.8H62771511J675308K325356K934336K256394K360046K898037L170550K731085
$$ 862771511 864446819 866772175 869706511 871962905 874322951 877220988 880391538 883122623
1664.1H83122623K089441J943111J711488R58085L11971m96745j101494j159549j554668
$$ 883122623 885212064 887155175 888866663 889824748 890136719 889639974 888538480 887378931 885824263
1682.5H85824263l427207m500568m443288n409002n987347q101582j0827899j3051033
$$ 885824263 882397056 877896488 873453200 868044198 862056851 853955269 843127370 830076337
1698.8H30076337j8810094j9818663k2574246l0689716l5065711l8372517m2234122
$$ 830076337 811266243 791447580 768873334 738183618 703117907 664745390 622511268
1713.1F22511268m6771705n3707064m9343943l4765065k7298987k2052348j4458030
$$ 622511268 575739563 522032499 472688556 437923491 410624504 388572156 374114126
1727.4C74114126q184850l000289K526193P164449Q229554J0831982J2869775J2734353
$$ 374114126 365929276 362928987 365455180 372619629 380849183 391681165 404550940 417285293
1743.7D17285293J3687671J5810668K0848393K6785017K9850333L6451400M5100689
$$ 417285293 430972964 446783632 467632025 494417042 524267375 560718775 605819464
1758F05819464M8895061N3632438M9470127L9061188L2792449K6417315K1199227J5560507
$$ 605819464 654714525 708346963 757817090 796878278 829670727 856088042 877287269 892847776
1774.3H92847776J0365129Q137286P120013N784035M789829M040181L341198K858997
$$ 892847776 903212905 911350191 918470204 924254239 929044068 933084249 936425447 939284444
1790.6I39284444K672374K119064J730085J705527J505077J630008J663387J537204
$$ 939284444 941956818 944075882 945805967 947511494 949016571 950646579 952309966 953847170
1806.9I53847170J402080J419127J332521J188279J075983J069963J052558R28283
$$ 953847170 955249250 956668377 958000898 959189177 960265160 961335123 962387681 963315964
1823.2I63315964R80496R64046Q64207O87957P05064O39140N10633M86076M90308L53694
$$ 963315964 964296460 965260506 966124713 966812670 967517734 968156874 968667507 969153583 969643891 969997585
1843.6I69997585J31965K29954L50893L33428J98364J61827P3791J7702Q2135K24471
$$ 969997585 970129550 970359504 970710397 971043825 971242189 971404016 971477807 971495509 971577644 971802115
1864I71802115K36154K980l2842J20640K07484J51395J07587M6611M0352P9691J15991
$$ 971802115 972038269 972041249 972008407 972129047 972336531 972487926 972595513 972642124 972682476 972762167 972878158
1886.4I72878158L9280n4658J0789j7465j2397J1324n0723j77860k71082l37005k93255
$$ 972878158 972917438 972862780 972873569 972856104 972843707 972855031 972804308 972626448 972355366 972018361 971725106
1908.9I71725106j46091p3313j10150k52187k86818k11477o0677K3365o7294p7725
$$ 971725106 971579015 971505702 971395552 971143365 970856547 970645070 970584393 970607758 970540464 970462739
1929.3I70462739M3810L7730n9665o7770j18315j82152n4598O7949j3232n4479n3107
$$ 970462739 970506549 970544279 970484614 970416844 970298529 970116377 970061779 970129728 970116496 970062017 970008910
1951.7I70008910o259J13011J30355M8935L1174P1883Q4638J68741K28524K16067K33114
$$ 970008910 970002651 970115662 970246017 970294952 970326126 970398009 970482647 970651388 970879912 971095979 971329093
1974.1I71329093K22325J35660Q2434R3817N4717k6464l5644q702J6391R0540R0778
$$ 971329093 971551418 971687078 971769512 971863329 971918046 971891582 971855938 971847236 971863627 971954167 972044945
1996.6I72044945M828m9353k8133p7188j96994j79886j34290j86205k81632k32577
$$ 972044945 972049773 972000420 971972287 971895099 971698105 971518219 971383929 971197724 970916092 970683515
2017I70683515l58R5070j1981j15037j39594o5028L5584L4034K9862P3015L0101k4796
$$ 970683515 970683157 970778227 970766246 970651209 970511615 970446587 970482171 970516205 970546067 970619082 970649183 970624387
2041.4I70624387j0431K1279J3292o3181r6857r8527j13070p0095j1265j4723p3850
$$ 970624387 970613956 970635235 970648527 970585346 970488489 970389962 970276892 970206797 970195532 970180809 970106959
2063.9I70106959p0333P6592J24395p0632k14040j16587l159q7023j79588j38939j53780
$$ 970106959 970036626 970113218 970237613 970166981 969952941 969836354 969833195 969746172 969566584 969427645 969273865
2086.3I69273865k60114k55168j27971j00792j90854k66850l15666k88546k15173k04026
$$ 969273865 969013751 968758583 968630612 968529820 968338966 968072116 967756450 967467904 967252731 967048705
2106.7I67048705k21551k38478k32697j46925q821L8623M1843L7849j2040R417K7418
$$ 967048705 966827154 966588676 966355979 966209054 966200233 966238856 966280699 966318548 966306508 966315925 966343343
2129.1I66343343K9326J30951K17736J79589J09851J08123K08914K60651J77145J50025
$$ 966343343 966372669 966503620 966721356 966900945 967010796 967118919 967327833 967588484 967765629 967915654
2149.5I67915654J93179K81513L45945K72334K09450K83778L21865K19226J50502K22683
$$ 967915654 968108833 968390346 968736291 969008625 969218075 969501853 969823718 970042944 970193446 970416129
2169.9I70416129L21626L24905K70605K00033J24634N2154O2764J26779J41501J34051
$$ 970416129 970737755 971062660 971333265 971533298 971657932 971710086 971772850 971899629 972041130 972175181
2190.3I72175181J25050J76728J76966Q7023O7294J08063J11222N2035K0266N0783
$$ 972175181 972300231 972476959 972653925 972740948 972808242 972916305 973027527 973079562 973099828 973150611
2210.7I73150611Q2016J25647J69634J26243M8459M1425J01149J58369J30356L7193
$$ 973150611 973232627 973358274 973527908 973654151 973702610 973744035 973845184 974003553 974133909 974171102
2231.1I74171102l2186n9247j3948N3167L0756j6212k8610k4319j8418k6524k4497
$$ 974171102 974138916 974079669 974065721 974118888 974149644 974133432 974104822 974080503 974062085 974035561 974011064
2253.5I74011064j3829j4424M6432J30534R7811j669n0544j8120N901K2888R2804P3553
$$ 974011064 973997235 973982811 974029243 974159777 974257588 974255919 974205375 974187255 974193156 974216044 974308848 974382401
2278I74382401n0903n1141J03474J95980J31786M3690O5327J53124J56880M5359k8372
$$ 974382401 974331498 974280357 974383831 974579811 974711597 974755287 974820614 974973738 975130618 975175977 975147605
2300.4I75147605J1861J9610r1910j60277r9957R2387L43681L62098K28762J59443
$$ 975147605 975159466 975179076 975087166 974926889 974826932 974919319 975263000 975625098 975853860 976013303
2320.8I76013303M5299N2214K94566M02749M33385N25713L78013J88470R5486j74761
$$ 976013303 976058602 976110816 976405382 976808131 977241516 977767229 978145242 978333712 978429198 978254437
2341.2I78254437n04374p33435o21319p5877N34237P62641N00262L10361P5460m31478
$$ 978254437 977750063 977016628 976395309 976319432 976853669 977616310 978116572 978426933 978502393 978070915
2361.6I78070915n18978l31461m56632n57303m36544m18604m91380l61503n2333K12551
$$ 978070915 977551937 977220476 976763844 976206541 975769997 975351393 974860013 974498510 974446177 974658728
2382I74658728L18944K63512J79589J44005P0989j0967o5387j56343j81138j09136
$$ 974658728 974977672 975241184 975420773 975564778 975635767 975624800 975559413 975403070 975221932 975112796
2402.4I75112796q2314o4314k6583m0174q9526p9930j9014K9326J06990J05202j7821
$$ 975112796 975030482 974966168 974939585 974899411 974809885 974729955 974710941 974740267 974847257 974952459 974934638
2424.8I74934638o5029O974O4373J6987o4254o6757J3292R4175N2929l7372m7445o3718
$$ 974934638 974869609 974876583 974940956 974957943 974893689 974826932 974840224 974934399 974987328 974949956 974902511 974838793
2449.3I74838793j07527j11877j4604K5928l1232L3319N1319r0956j35780L5286J35303
$$ 974838793 974731266 974619389 974604785 974630713 974599481 974632800 974684119 974593163 974457383 974492669 974627972
2471.7I74627972M5180j2338l8922Q047J33752J03593n006J4245M8697M7863N4717
$$ 974627972 974673152 974660814 974621892 974629939 974763691 974867284 974862278 974876523 974925220 974973083 975027800
2494.2I75027800N9m411Q3268P9811K8372P0214J23501Q2671J2219k145j6869l2186
$$ 975027800 975027859 975023448 975106716 975186527 975214899 975285113 975408614 975491285 975503504 975501359 975484490 975452304
2518.6I75452304N1081J45555J03294J6630j1086J2576N5611M5121P0155J37090L9816
$$ 975452304 975503385 975648940 975752234 975768864 975757778 975770354 975825965 975871086 975941241 976078331 976118147
2541.1I76118147j28507j42217n2452j6451q0228o2942J01864J41740q047j26064j13248
$$ 976118147 975989640 975847423 975794971 975778520 975698292 975635350 975737214 975878954 975870907 975744843 975631595
2563.5I75631595q0645l5584L7074N662l2723k205m4286q9229k6106J4841R239j192
$$ 975631595 975550950 975515366 975552440 975558102 975525379 975523174 975478888 975389659 975363553 975378394 975387633 975386441
2588I75386441r2387j17600k2710j8418j01804j26124j00195r6858q5175r4056o5982
$$ 975386441 975294054 975176454 975153744 975135326 975033522 974907398 974807203 974710345 974625170 974531114 974465132
2610.4I74465132L5047K0504p0393q6784p3552n1260k3008j00434j77264r6261m7326
$$ 974465132 974500179 974520683 974450290 974363506 974289954 974238694 974215686 974115252 973937988 973841727 973794401
2632.8I73794401j12593j37508r0182l4929q285M232M3810R2149L0219m2200R2149
$$ 973794401 973681808 973544300 973454118 973419189 973410904 973415136 973458946 973551095 973581314 973539114 973631263
2655.3I73631263K29597Q6844j39713j40489j0728N7339L5346l1173l8624L7014Q3745
$$ 973631263 973860860 973947704 973807991 973667502 973656774 973714113 973749459 973718286 973679662 973716676 973800421
2677.7I73800421k4677j10626o3836q4103j26779o0439J8478k5094j31249j48118p0572
$$ 973800421 973775744 973665118 973601282 973517179 973390400 973329961 973348439 973323345 973192096 973043978 972973406
2700.1I72973406K7180N4240n5492j70648j77920j75356j08839O199Tp4625j67310
$$ 972973406 973000586 973054826 972999334 972828686 972650766 972475410 972366571 972372770 972378969 972304344 972137034
2722.6I72137034j58966n0842j8061M173P4327O0737K7537N9962Q5235Q3327K3485
$$ 972137034 971978068 971927226 971909165 971913338 971987665 972048402 972075939 972135901 972221136 972304463 972327948
2745I72327948m2022K4259J12772P8202l934k8730M9353J09315r596j55151j49727
$$ 972327948 972285926 972310185 972422957 972501159 972497225 972468495 972517848 972627163 972617567 972462416 972312689
2767.4I72312689r4295l0338K0146n1737j34170r9361n0366n3763q9705j39058k12788
$$ 972312689 972218394 972188056 972208202 972156465 972022295 971922934 971872568 971818805 971729100 971590042 971377254
2789.9I71377254k92898k02596n9307j19268j88709j59263j27316j29342j69754j61350
$$ 971377254 971084356 970881760 970822453 970703185 970514476 970355213 970227897 970098555 969928801 969767451
2810.3I69767451j05023r4652j19090j24336j45316j44958j52111k50578k65837j96755
$$ 969767451 969662428 969567776 969448686 969324350 969179034 969034076 968881965 968631387 968365550 968168795
2830.7I68168795k45094l80814n21660o17623n85080n51343p54952j030564j055003
$$ 968168795 967923701 967542887 967021227 966403604 965818524 965267181 964512229 963481665 962426662
2849I62426662r08017q40187r24110j034320j074254j112223j087546r72808r48369
$$ 962426662 961518645 960678458 959754348 958720028 957645774 956533551 955446005 954473197 953524828
2867.4I53524828j013160j143575j240730j067579q17179p53880o58631m33445k96533
$$ 953524828 952511668 951368093 950127363 949059784 948242605 947488725 946830094 946396649 946100116
2885.7I46100116l32773l52323j55211N3466J63197L65079N37276N21958M04596L02851
$$ 946100116 945767343 945415020 945259809 945313275 945476472 945841551 946378827 946900785 947305381 947608232
2906.1I47608232K13624M9710j05858j66416j81794k53320l51369l09170k84552m44293
$$ 947608232 947821856 947871566 947765708 947599292 947417498 947164178 946812809 946503639 946219087 945774794
2926.5I45774794o66082r19223j165152j270890j164257q89302n89370l05474K2828
$$ 945774794 945108712 944189489 943024337 941753447 940589190 939699888 939110518 938805044 938827872
2944.9I38827872K76387M04716L76105N2571k52306k69175j89185K9087N46515J233816
$$ 938827872 939104259 939508975 939885080 939937651 939685345 939416170 939226985 939256072 939802587 941036403
2965.2I41036403J898587K341747K418578K182603J758873J373232J221120J178741
$$ 941036403 942934990 945276737 947695315 949877918 951636791 953010023 954231143 955409884
2981.6I55409884R16243M95672L33190L74794L62456L30031L79384M89235N34236N64694
$$ 955409884 956326127 956821799 957154989 957529783 957892239 958222270 958601654 959090889 959625125 960189819
3002I60189819N98550M69685L00348K66432K13445J14500N8174O5029J49012J62184
$$ 960189819 960788369 961258054 961558402 961824834 962038279 962152779 962210953 962275982 962424994 962587178
3022.3I62587178J54495K95341M38452M09364K61546J74582K55346L07560J60992J22011
$$ 962587178 962741673 963037014 963475466 963884830 964146376 964320958 964576304 964883864 965044856 965166867
3042.7I65166867L08692L29018Q0168l9697Q1361Q5950k8849j8179j9610n4062k6166
$$ 965166867 965475559 965804577 965884745 965845048 965926409 966012359 965983510 965965331 965945721 965891659 965865493
3065.2I65865493q8632q2612L5584m4942j81079j44363n4061k503j4246r8109j39654
$$ 965865493 965776861 965694249 965729833 965684891 965503812 965359449 965305388 965302885 965288639 965190530 965050876
3087.6I65050876j11103j67370k58386j74940l4809k8610j23739k68579l28838k49923
$$ 965050876 964939773 964772403 964514017 964339077 964304268 964275658 964151919 963883340 963554502 963304579
3108I63304579j50084o2526j7583q1956k30730l42548k87592j63734j35362j02759
$$ 963304579 963154495 963091969 963074386 962992430 962761700 962419152 962131560 961967826 961832464 961729705
3128.4I61729705o5028k37584m66705m16100k55644k50817k70068j63198j11401k72691
$$ 961729705 961664677 961427093 960960388 960544288 960288644 960037827 959767759 959604561 959493160 959220469
3148.8I59220469l85940l76999l75391k67505k37942m20272n34773m75109l40819l21210
$$ 959220469 958834529 958457530 958082139 957814634 957576692 957156420 956621647 956146538 955805719 955484509
3169.2I55484509m31656m75884l58164j96755j85251l47376n59569o22809n27203m37021
$$ 955484509 955052853 954576969 954218805 954022050 953836799 953489423 952929854 952307045 951779842 951342821
3189.6I51342821l86894m41849o59942p44880n66959m09186l50952m25816n86450n96940
$$ 951342821 950955927 950514078 949854136 949109256 948542297 948133111 947782159 947356343 946769893 946172953
3210I46172953m83215m72129n21659m49241l96609m34160m52757m96268m92752m39584
$$ 946172953 945689738 945217609 944695950 944246709 943850100 943415940 942963183 942466915 941974163 941534579
3230.4I41534579m81248m62234l79324m34220m45843l57985l48270l60489m01020m56631
$$ 941534579 941053331 940591097 940211773 939777553 939331710 938973725 938625455 938264966 937863946 937407315
3250.7I37407315l78371l39984l85344l85166m02450l88026l58701l07322k50756k42293
$$ 937407315 937028944 936688960 936303616 935918450 935516000 935127974 934769273 934461951 934211195 933968902
3271.1I33968902j97888k48730l16501k90691k76089k39492l17275m71235m22358l21746
$$ 933968902 933771014 933522284 933205783 932915092 932639003 932399511 932082236 931611001 931188643 930866897
3291.5I30866897l02613j78992q8752k56538m80473n56827m76241l19183l04162l88325
$$ 930866897 930564284 930385292 930296540 930040002 929559529 929002702 928526461 928207278 927903116 927514791
3311.9I27514791l99589m29690m56452m07279m25160n61178n86569m74691m67777n75245
$$ 927514791 927115202 926685512 926229060 925821781 925396621 924835443 924248874 923774183 923306406 922731161
3332.3I22731161o07073n35786n82457o60539n23388m20690n30660n86986n81861o38604
$$ 922731161 922124088 921588302 921005845 920345306 919821918 919401228 918870568 918283582 917701721 917063117
3352.7I17063117o09696n60403o88016p89404o68585o56665p93278o85692m43280m27722
$$ 917063117 916453421 915893018 915205002 914415598 913747013 913090348 912297070 911611378 911168098 910740376
3373.1I10740376n92888o18756n52952n57244n60880n97238o19650n68390n34236n04852
$$ 910740376 910147488 909528732 908975780 908418536 907857656 907260418 906640768 906072378 905538142 905033290
3393.5I05033290n31494o09100n87761m89474l95298m20451n09918n85019o26505m51624
$$ 905033290 904501796 903892696 903304935 902815461 902420163 901999712 901489794 900904775 900278270 899826646
3413.9H99826646k82288m17113o06298n10157k96771l19958m66883n27382m50611l31164
$$ 899826646 899544358 899127245 898520947 898010790 897714019 897394061 896927178 896399796 895949185 895618021
3434.3H95618021l00228k71440j96337j71483k38240k64764j09314o5864k25722k85328
$$ 895618021 895317793 895046353 894850016 894678533 894440293 894175529 894066215 894000351 893774629 893489301
3454.7H93489301l00109k40088j06573j72674l53337l18765l577K28465J78754M530
$$ 893489301 893189192 892949104 892842531 892669857 892316520 891997755 891994178 892222643 892401397 892405927
3475.1H92405927j69098k21670R775K78175K89858L35156M81129L73900J74403L04997
$$ 892405927 892236829 892015159 892024934 892303109 892592967 892928123 893409252 893783152 893957555 894262552
3495.5H94262552M77493L69966K67208L95894M76300L72470M32849N97656N59866L72171
$$ 894262552 894740045 895110011 895377219 895773113 896249413 896621883 897054732 897652388 898212254 898584425
3515.9H98584425L10064K99454J43051J93000N08070O32703N28753L60310K04861L39568
$$ 898584425 898894489 899193943 899336994 899529994 900038064 900670767 901199520 901559830 901764691 902104259
3536.3I02104259N95450M50253J78636K14874N18322Q21948P90000N52297M32849M13120
$$ 902104259 902699709 903149962 903328598 903543472 904061794 904883742 905673742 906226039 906658888 907072008
3556.6I07072008M31239M64022L47078J09017K89440Q57652R89258P30276M64618L86357
$$ 907072008 907503247 907967269 908314347 908423364 908712804 909570456 910559714 911289990 911754608 912140965
3577I12140965N41509O58214M74989J69754K24948P11084Q35776O27398O76990Q32677
$$ 912140965 912682474 913340688 913815677 913985431 914210379 914921463 915757239 916384637 917061627 917894304
3597.4I17894304Q01623Q17954Q27074N77271M02749N18203O19709Q02755J127661
$$ 917894304 918695927 919513881 920340955 920918226 921320975 921839178 922458887 923261642 924389303
3615.8I24389303J246810J125157J032710J149714J199185J169682J448751J617014
$$ 924389303 925636113 926761270 927793980 928943694 930142879 931312561 932761312 934378326
3632.1I34378326J638710J716316J744390J842856K066434K141416K017259J953066
$$ 934378326 936017036 937733352 939477742 941320598 943387032 945528448 947545707 949498773
3648.4I49498773J909196J797259J805305J830221J688242J729011J888990J901389
$$ 949498773 951407969 953205228 955010533 956840754 958528996 960258007 962146997 964048386
3664.7I64048386J794993J574755J478493J463712J213610R20951Q50439Q25644Q72373
$$ 964048386 965843379 967418134 968896627 970360339 971573949 972494900 973345339 974170983 975043356
3683.1I75043356Q82209P43747N27501L40342L33309M60148N86629M96328J37508O616
$$ 975043356 975925565 976669312 977196813 977537155 977870464 978330612 978917241 979413569 979551077 979557693
3703.5I79557693L12805N41628K71141m43697m71651J01804K70546M1246k25365k45631
$$ 979557693 979870498 980412126 980683267 980239570 979767919 979869723 980140269 980181515 979956150 979710519
3723.9I79710519Q0526N89967O11603j85311q50677k76089N41687O91474M90129J45673
$$ 979710519 979791045 980381012 980992615 980807304 979956627 979680538 980222225 980913699 981403828 981549501
3744.3I81549501J05739J93298j50979m27186j03951J36137J8895l7610J57594L56376
$$ 981549501 981655240 981848538 981697559 981270373 981166422 981302559 981321454 981283844 981441438 981797814
3764.7I81797814M08888J2756m55618k62142K01881M18723O0856l33726j17719l4034
$$ 981797814 982206702 982219458 981763840 981501698 981703579 982122302 982183158 981849432 981731713 981697679
3785I81697679j78695o7294J68205L04222K31921J30534J52410r3759j31845J14500
$$ 981697679 981518984 981451690 981619895 981924117 982156038 982286572 982438982 982345223 982213378 982327878
3805.4I82327878j95801l41952J30356M80711L28958N7698j35303n00262l34203l9935
$$ 982327878 982132077 981790125 981920481 982401192 982730150 982787848 982652545 982152283 981818080 981778145
3825.8I81778145j4663J83404L01539K54512J71960j35720k83063j83045j78278r5665
$$ 981778145 981763482 981946886 982248425 982502937 982674897 982539177 982256114 982073069 981894791 981799126
3846.2I81799126K52604N06997j59919j147032l67641M98414N11527N4598k51770j09196
$$ 981799126 982051730 982558727 982398808 981251776 980884135 981382549 981894076 981948674 981696904 981587708
3866.6I81587708o9678q9824R2924J15394J08719l3855j90080o7174j11640J3114J67131
$$ 981587708 981518030 981428206 981521130 981636524 981745243 981711388 981521308 981454134 981342494 981355608 981522739
3889.1I81522739j03533k09213q7320j42456k94506k02715J07169L19421K65241P2836
$$ 981522739 981419206 981209993 981122673 980980217 980685711 980482996 980590165 980909586 981174827 981247663
3909.4I81247663N9009n364k41161k91526r0182J17600L1293o6162N603j84834k51591
$$ 981247663 981306672 981301308 981060147 980768621 980678439 980796039 980827332 980761170 980766773 980581939 980330348
3931.9I80330348J13547K51710J18017j00135l93451k93552J47879K94447K19106J56701
$$ 980330348 980443895 980695605 980813622 980713487 980320036 980026484 980174363 980468810 980687916 980844617
3952.3I80844617L8862p0155j77025j31786J07288J12832q2732l2484K63274K40028
$$ 980844617 980883479 980813324 980636299 980504513 980611801 980724633 980641901 980609417 980872691 981112719
3972.7I81112719k04444l15965o8426j29819j97112J72555M05312J58727n7220j5796
$$ 981112719 980908275 980592310 980523884 980394065 980196953 980369508 980774820 980933547 980876327 980860531
3993.1I80860531m5359j04844
$$ 980860531 980815172 980710328
3997.1I80710328
$$ 980710328
##END=$$ End of the data block
