##TITLE=Rachel - Amostra 5 $$ Begin of the data block
##JCAMP-DX=5.00 $$ ACD/SpecManager v 10.08
##SPECTROMETER/DATA SYSTEM=Alpha
##DATE=21 May 2015 14:09:38
##DATA TYPE=INFRARED SPECTRUM
##DATA CLASS=XYDATA
##ORIGIN=
##OWNER=
##NPOINTS=1667
##FIRSTX=599.57470703
##LASTX=3997.16503906
##MAXX=3997.16503906
##MINX=599.57470703
##MAXY=0.98013508
##MINY=0.15350305
##XFACTOR=1.0000000000
##YFACTOR=1.000000000000000e-9
##FIRSTY=0.46674389
##DELTAX=2.03937006
##XUNITS=1/CM
##YUNITS=ARBITRARY UNITS
##XYDATA=(X++(Y..Y))
599.6D66743886k634704N795896J4661909K1880745K5087774K2737980J7066002J1853755
615.9E83193243Q939027Q093596P755518Q008957Q730232Q611441P458389O079793
632.2F46870196M881441L757000K440155J484275J909554L991425O725132P923782
648.5F79982960O623388M422366L133953L423989N295395O742597O105423M398227
664.8G20128298L574014L322958J744926O33777M24921P77364J453817J641214Q43227
683.2G34544516j24038r5606J327932L506840N368709O328762O119966N129695M446566
701.5G66553342M130543L842592L879428L864288L332257K600849K142906K372027
717.9G92718232L272891M435479N231142N269647M853368M523337M325390L998816
$$ y = [466743886, 464109182, 469905078, 484566987, 506447732, 531535506, 554273486, 571339488, 583193243, 592132270, 600225866, 607981384, 615990341, 624720573, 633332014, 640790403, 646870196, 651751637, 655508637, 657948792, 659433067, 661342621, 665334046, 672059178, 679982960, 686606348, 691028714, 694162667, 697586656, 702882051, 709624648, 715730071, 720128298, 723702312, 727025270, 728770196, 729403973, 729828894, 730606258, 732060075, 733701289, 734544516, 734420478, 734324872, 735652804, 739159644, 744528353, 750857115, 756977081, 762106776, 766553342, 770683885, 774526477, 778405905, 782270193, 785602450, 788203299, 790346205, 792718232, 795991123, 800426602, 805657744, 810927391, 815780759, 820304096, 824629486, 828628302]
734.2H28628302L333032K620756K136767J694143J499236J551807J452326J231134
750.5H44147503J304686J496196J548529J528621J265764J008868J105070J338959
766.8H54744196J352966J216471J130700J140297J040220Q19266Q68022R10044O31928
785.2H63854110M10557K92540K05278L59535M89712L82364K91288L09944K11537n7876
805.6H66748989o4671L87072O88672M63248M7743k86699m29570p47323j314819j862347
825.9H63630295k611578l366768l763497l589332k568245j008511M87030J635611K269387
844.3H51114392K441228K187192J469314N44667m85420j749634l127218m542589o251872
862.7H41600060q594751j1813939j5249729j7218351j6034126j1822462o822467l003478
$$ y = [828628302, 831961334, 834582090, 836718857, 838413000, 839912236, 841464043, 842916369, 844147503, 845452189, 846948385, 848496914, 850025535, 851291299, 852300167, 853405237, 854744196, 856097162, 857313633, 858444333, 859584630, 860624850, 861444116, 862312138, 863222182, 863854110, 864264667, 864557207, 864762485, 865122020, 865611732, 865994096, 866285384, 866595328, 866806865, 866748989, 866684318, 867071390, 867760062, 868223310, 868271053, 867984354, 867554784, 866807461, 865492642, 863630295, 861018717, 857651949, 853888452, 850299120, 847730875, 846722364, 847209394, 848845005, 851114392, 853555620, 855742812, 857212126, 857756793, 857271373, 855521739, 852394521, 847851932, 841600060, 833005309, 821191370, 805941641, 788723290, 772689164, 760866702, 754044235, 751040757]
879G51040757j361847k236843n117953r108424j3567031j8359780k2959769k5511145
895.3F52817965k3966372j7883361q848965L62933P669031J2945414J6856491J9102574
911.6F59055710J8931031J6629219J3484061J1117518J0333538J0339379J0229647
925.9G50120103R755552Q514404O580413M484534K269507L2126j983284l844917n593479
944.2G70334959o991625p871806p943929o784916m718601k728820j927078l299415
960.5G28068769p274687j3322532j9962967k5362611k8092503k8002024k6140749k3555518
976.9E56355178k0840585j8249750j5961349j4193296j2726665j1459023j0989845
991.1D51934665j1921942j4553010j8461317k2225022k4698645k5684595k5427193
$$ y = [751040757, 749678910, 747442067, 742324114, 733215690, 719648659, 701288879, 678329110, 652817965, 628851593, 610968232, 602119267, 602482200, 610151231, 623096645, 639953136, 659055710, 677986741, 694615960, 708100021, 719217539, 729551077, 739890456, 750120103, 759875655, 768390059, 774970472, 779455006, 781724513, 781756639, 779773355, 775928438, 770334959, 763343334, 755471528, 747527599, 740742683, 736024082, 733295262, 731368184, 728068769, 720794082, 707471550, 687508583, 662145972, 634053469, 606051445, 579910696, 556355178, 535514593, 517264843, 501303494, 487110198, 474383533, 462924510, 451934665, 440012723, 425459713, 406998396, 384773374, 360074729, 334390134, 308962941]
1005.4C08962941k4350792k2836804k1069810j9070432j6946032j4752329j2385323
1019.7A77551419r832010p211208m706130k299026N46977M084424P441550R728938
1036A75304934J0757015J0750994J0370642J0585248J1793181J3693408J5861287J7943979
1052.3B77060688J9751161K0734280K0326346J8527925J5703231J2691945J0562301
1066.6C95357877R790748J0073930J0883719J1841506J2598038J2991041J3441920
1080.9D76978779J4405906J5973210J8090010K0429134K2284985K2919655K1934628
1095.1F13016307J9224286J5164793J0652721O434619K938569K45035j905919l502845
1111.5F62267566m350663m613637m545868l802895j567185K299904O790281J0644793
$$ y = [308962941, 284612149, 261775345, 240705535, 221635103, 204689071, 189936742, 177551419, 167719409, 160508201, 155802071, 153503045, 154050022, 158134446, 165575996, 175304934, 186061949, 196812943, 207183585, 217768833, 229562014, 243255422, 259116709, 277060688, 296811849, 317546129, 337872475, 356400400, 372103631, 384795576, 395357877, 405148625, 415222555, 426106274, 437947780, 450545818, 463536859, 476978779, 491384685, 507357895, 525447905, 545877039, 568162024, 591081679, 613016307, 632240593, 647405386, 658058107, 664492726, 667431295, 667676330, 665770411, 662267566, 657916903, 653303266, 648757398, 644954503, 643387318, 645687222, 652477503, 663122296]
1127.8F63122296J3056934J3625324J2484133J0268033P602989M808665J817047j787364
1144.1G24998057o075978j0251165j3369620j4806032j4082491j1232615p059455k611577
1160.4F45509124J339853M534483P196188R466707J1114061J2052238J2504459J2278080
1176.7G15995193J0936200Q392453M602552n48363o973982j4673590k3901761l4537554
1193F59291148m5901954n6703448o4589203o6916555o2392354n1933139l8377375k5062129
1209.4B47414991j4218002o492362j283616K332315M665986N654573N627737N552038
1225.7B49253660O253601Q055448J1004657J4741093J8393755K1283745K3272723K4405033
1242C76663715K4968683K5423110K5918513K6163936K6159763K6034058K5713980K5347769
$$ y = [663122296, 676179230, 689804554, 702288687, 712556720, 720159709, 724968374, 726785421, 724998057, 718922079, 708670914, 695301294, 680495262, 666412771, 655180156, 648120701, 645509124, 646848977, 651383460, 658579648, 668046355, 679160416, 691212654, 703717113, 715995193, 726931393, 735323846, 739926398, 739378035, 732404053, 717730463, 693828702, 659291148, 613389194, 556685746, 492096543, 425179988, 362787634, 310854495, 272477120, 247414991, 233196989, 226704627, 225421011, 227753326, 232419312, 238073885, 243701622, 249253660, 255507261, 263562709, 274567366, 289308459, 307702214, 328985959, 352258682, 376663715, 401632398, 427055508, 452974021, 479137957, 505297720, 531331778, 557045758, 582393527]
1258.3E82393527K4979532K4255097K3325443K2744298K2561073K2482813K1941602
1272.6G44683385K0612538J8823981J6844034J4662624J2488246J0581314Q985341
1286.8H47681463P815957P131398O584703N906106N101144M112542K943277J760244
1303.2H89036834O20604o10054j799583k698302l164590l089070k472639j385570j1384
1321.5H74426246J417041K760767L680408L823042L324747K512455J613558O85632
1337.8H94243896k32637j182377k331674l854335o170869j0000050j5987217k4473250
1354.2H30011487l4277558m1690886m3969155l9990842k8113484j3965071l334939
1368.4F24669552M934072J1774063J6954065J8297314J7976702J9101798K0907998
$$ y = [582393527, 607373059, 631628156, 654953599, 677697897, 700258970, 722741783, 744683385, 765295923, 784119904, 800963938, 815626562, 828114808, 838696122, 847681463, 855497420, 862628818, 869213521, 875119627, 880220771, 884333313, 887276590, 889036834, 889657438, 889047384, 887247801, 884549499, 881384909, 878295839, 875823200, 874437630, 874426246, 875843287, 878604054, 882284462, 886107504, 889432251, 891944706, 893558264, 894243896, 894011259, 892828882, 890497208, 886642873, 880472004, 870471954, 854484737, 830011487, 795733929, 754043043, 710073888, 670083046, 641969562, 628004491, 624669552, 629603624, 641377687, 658331752, 676629066, 694605768, 713707566, 734615564]
1382.7G34615564K2685528K5513172K6551187K2714079J8697619J5664160J1287332
1397H77728641P101834L917158J297414l19779j033485j595974k370238l124297l759086
1415.3H77842188m419863m795611m119814l757417l680050k718509j373112J75834
1431.6H53153646J631200L235996M921734N019069M780650M671455M379928M273712
1448H86067390L988505L303349K676070K898037L817856L726006L760874M776776N395710
1466.3I20410573M887403M554212M716396M146218L113568K419472J874566J492917
1482.6I47615325J140893Q11458N10871N01752O48022O03258L77000J10447K11477
1501I52530503N58019L58403q22246o89328K23696L51966K10762K24113K88606J80065
$$ y = [734615564, 757301092, 782814264, 809365451, 832079530, 850777149, 866441309, 877728641, 884830475, 888747633, 890045047, 889725268, 888691783, 887095809, 884725571, 881601274, 877842188, 873422325, 868626714, 864506900, 860749483, 857069433, 854350924, 852977812, 853153646, 854784846, 858020842, 862942576, 867961645, 872742295, 877413750, 881793678, 886067390, 890055895, 893359244, 896035314, 898933351, 902751207, 906477213, 910238087, 915014863, 920410573, 925297976, 929852188, 934568584, 938714802, 941828370, 944247842, 946122408, 947615325, 948756218, 949567676, 950078547, 950580299, 951228321, 951831579, 952208579, 952319026, 952530503, 953088522, 953446925, 952624679, 951935351, 952159047, 952511013, 952721775, 952945888, 953234494, 953414559]
1521.4I53414559j26183l20673j34527J26719J33097L9816L65794Q10146K71201j172542
1541.8I53407407j045466k88188m7267l6120J64270L61443N25117J93775j001895o65069
1562.2I51568007j62124q7083j77145n23448l41057m6552o75022j168728q24749p63238
1582.6I46798861q95143j059174j208067j325965j513421j781404k040506k230108
1598.9I34745073k506196k815366l169119l505469l809273l936827l676832l874719
1615.2I07451272n038977m556298l462613l622889l360629k670348k142310j290500
1631.5H81306708o28591p21693p32541r4950N73695J170873J380146J322329J488626
1649.9H85064602J997173K054453J662433J955807K315581K507090K218128J777291
$$ y = [953414559, 953288376, 952967703, 952833176, 952959895, 953092992, 953132808, 953498602, 954308748, 954579949, 953407407, 952361941, 952073753, 952026486, 951990366, 952154636, 952516079, 953041196, 953234971, 952233076, 951568007, 951405883, 951318800, 951141655, 950618207, 950277150, 950230598, 949555576, 948386848, 947562099, 946798861, 945903718, 944844544, 943636477, 942310512, 940797091, 939015687, 936975181, 934745073, 932238877, 929423511, 926254392, 922748923, 918939650, 915002823, 911325991, 907451272, 902412295, 897855997, 894393384, 890770495, 887409866, 884739518, 882597208, 881306708, 880678117, 879956424, 879223883, 879128933, 879702628, 880873501, 882253647, 883575976, 885064602, 887061775, 889116228, 890778661, 892734468, 895050049, 897557139, 899775267, 901552558]
1666.2I01552558J576245J218021O79314K37942m64917r15229r70900j470447l230810
1684.5H98211777l970802l762960m540265m929065o799221r254396j1225582j6194283
1700.9H37535203j6883135j9267202k6497960l0524134l3740402l7683248m2682112
1715.1F30257010n0540208m7327400l3639848k6957929k2336036j5178174r172141
1729.4D25105274m068941P87943N280167P273496R795337J1667639J1850387J2850553
1745.7D80541855J4772117J9148559K4444162K7433634L3493638M1426778M5132697
1760F86393440M9497366M5608997L6129654L0317127K4318993J9388259J4132321R430408
1776.3I15216565P409930O371141N081057M226983L658116L105461K564550K244592
$$ y = [901552558, 903128803, 904346824, 905026138, 905264080, 904799163, 903883934, 902913034, 901442587, 898211777, 894240975, 890478015, 885937750, 881008685, 874209464, 864955068, 853729486, 837535203, 820652068, 801384866, 774886906, 744362772, 710622370, 672939122, 630257010, 579716802, 532389402, 498749554, 471791625, 449455589, 434277415, 425105274, 421036333, 421824276, 427104443, 434377939, 444173276, 455840915, 467691302, 480541855, 495313972, 514462531, 538906693, 566340327, 599833965, 641260743, 686393440, 735890806, 781499803, 817629457, 847946584, 872265577, 891653836, 905786157, 915216565, 922626495, 928997636, 934078693, 938305676, 941963792, 945069253, 947633803, 949878395]
1792.6I49878395J813769J570284J528025J275182J374542J480699J420856J268327
1808.9I61610079J183212J009523R34363R22263R05573Q39114P48932Q79169Q79288
1827.3I69911516P61091O15180O18994M83811L49045L65436L71695K23636M1783J48773
1847.7I73890960K35915K59459K01345J87218N9426n2571O0379K15948J64032J2517
1868.1I75234628Q7440J99139J60217J1504J7822M7028K7239Q94l993l9757j1503J18255
1892.6I75848913O3539K682l7670j22130j99556k07782k40147k14219j04905p5578
1913I74713147j00196j89304k09689j57595n8830J3531l4750q7023l2782L397k6762
1935.4I73833144k6584r2506j80841o1750J00255L6835m8756r5248m3989R4712O7413
$$ y = [949878395, 951692164, 953262448, 954790473, 956065655, 957440197, 958920896, 960341752, 961610079, 962793291, 963802814, 964737177, 965659440, 966565013, 967404127, 968153059, 969032228, 969911516, 970672607, 971287787, 971906781, 972390592, 972739637, 973105073, 973476768, 973700404, 973742187, 973890960, 974126875, 974386334, 974587679, 974774897, 974834323, 974781752, 974842131, 975058079, 975222111, 975234628, 975322068, 975521207, 975681424, 975692928, 975710750, 975757778, 975785017, 975785911, 975781918, 975742161, 975730658, 975848913, 975912452, 975915134, 975877464, 975755334, 975555778, 975347996, 975107849, 974893630, 974788725, 974713147, 974612951, 974423647, 974213958, 974056363, 973997533, 974011064, 973976314, 973889291, 973856509, 973859906, 973833144, 973806560, 973714054, 973533213, 973471463, 973571718, 973608553, 973559797, 973464549, 973420560, 973515272, 973582685]
1957.8I73582685l2425K8253J13547O7234J09136K44140K82467K44975J82032R7275
1978.2I74919319L1233j5736j1265K1398k1458m6312J7762O3896L0220q345j2040K3424
2002.7I74992096J133j23680j92940j78754j35064j26124j73211j37985l6776q34j3590
2025.1I73874271l5942m351N5432M8280K4677q226r4592q1361Q94k5093k8551K2948
2049.6I73748386K3901J6630k921j10864j67847p7724l0279l9936L1531O9320l9577
2072I73420620j17779m8637K4855n7221j57177j33634j72197k63393k00689r7573j30951
2094.5I72066224j95444k09093k10047j69039j45077k29180l01302k39730j10209j9550
2114.9I70237553J5497k3663n7995r179M2319R1434Q1479J5557N0783J11819J00791
$$ y = [973582685, 973550260, 973578513, 973692060, 973759294, 973868430, 974112570, 974395037, 974640012, 974822044, 974919319, 974950552, 974934816, 974923551, 974944949, 974923491, 974877179, 974894941, 974958837, 974989057, 974980712, 974968672, 974992096, 974993229, 974869549, 974676609, 974497855, 974362791, 974236667, 974063456, 973925471, 973888695, 973887861, 973874271, 973838329, 973833978, 973889410, 973937690, 973962367, 973954141, 973859549, 973778188, 973779082, 973753989, 973725438, 973748386, 973772287, 973788917, 973785996, 973675132, 973507285, 973429561, 973399282, 973359346, 973390877, 973460197, 973420620, 973302841, 973254204, 973279059, 973221838, 973064661, 972931027, 972758830, 972495437, 972294748, 972197175, 972066224, 971870780, 971661687, 971451640, 971282601, 971137524, 970908344, 970607042, 970367312, 970257103, 970237553, 970253050, 970229387, 970171392, 970162213, 970204532, 970295966, 970377445, 970393002, 970443785, 970555604, 970656395]
2137.3I70656395R7096J14024J76310K43306K52426K11775J28746J31369K31922K57372
2157.7I72500741J61410J39832J97411J52588P3790J05739K54989L52323L07977J80662
2178.1I74427462O7949N0425Q6189Q7559P5161O0559M1961R0063J31965J04606P5579
2200.5I75299478Q1062O5744K3663K8252N9426R4176R7155M7386N0843R9718N2452
2222.9I75999355n662L4690K3424m5955q940Q0108J12236N7101l4630m2737j2934l3617
2247.4I76122439l4392L1590N7102j669o8426j9312J16527Q5652l2604k2531j3887
2269.8I76220489p9632n7042P1049O0916m6551K8789J38163J13607Q1062O3956K3722
2292.3I76618528L5525J23322J15335j1504m6492k6583j26660j83284l6180J61826
$$ y = [970656395, 970753491, 970867515, 971043825, 971287131, 971539557, 971751332, 971880078, 972011447, 972243369, 972500741, 972662151, 972801983, 972999394, 973151982, 973225772, 973331511, 973586500, 973938823, 974246800, 974427462, 974495411, 974545836, 974632025, 974719584, 974794745, 974855304, 974897265, 974987328, 975119293, 975223899, 975299478, 975380540, 975446284, 975469947, 975498199, 975557625, 975651801, 975748956, 975796342, 975847185, 975946903, 975999355, 975993693, 976028383, 976051807, 976005852, 975996912, 976077020, 976189256, 976246357, 976211727, 976168990, 976156056, 976122439, 976088047, 976119637, 976176739, 976175070, 976106644, 976087332, 976203859, 976289511, 976256907, 976234376, 976220489, 976140857, 976083815, 976154864, 976215780, 976169229, 976198018, 976336181, 976449788, 976530850, 976594806, 976618528, 976654053, 976777375, 976892710, 976881206, 976834714, 976808131, 976681471, 976498187, 976462007, 976623833]
2312.7I76623833K19941J71602J66655R8884M7564K58684M37320L45885L19183M28200
2333.1I79117751L29793J88768J54554r7215n91695r39012o78837o676N57781O93202
2353.5I78728414M53651K40862j6749j72794j50800l34918n58198n19812m00364m35889
2373.8I76833403m40717k83360q7083J48356L16382K70486J25229K7836J2278J79n6028
2396.3I76866961r8587r8943o2228o0677o7115m6313k9266k4259o9618r8467j10328
2418.7I76101160o1512Q9824J12832M5240N7816L5465k0087k5093j4961k0087k1219
2441.1I76279378l8266l8862J9729K3663m4227j09374r7394p3553n6564R8705J64986
2463.6I76128221J9133o7771l6657m589K1338N245n4180j5795R0658J05918K0921l2663
$$ y = [976623833, 976843774, 977015376, 977182031, 977280915, 977328479, 977587163, 978024483, 978370368, 978689551, 979117751, 979447544, 979636312, 979790866, 979693651, 979101956, 978162944, 977484107, 977477431, 978035212, 978728414, 979182065, 979422927, 979406178, 979233384, 979082584, 978747666, 978189468, 977669656, 977269292, 976833403, 976392686, 976109326, 976022243, 976170599, 976486981, 976757467, 976882696, 976910532, 976922810, 976922989, 976866961, 976768374, 976669431, 976607203, 976546526, 976479411, 976433098, 976403832, 976379573, 976309955, 976211488, 976101160, 976039648, 976129472, 976242304, 976287544, 976345360, 976380825, 976360738, 976335645, 976320684, 976300597, 976279378, 976241112, 976202250, 976221979, 976245642, 976201415, 976092041, 975994647, 975921094, 975864530, 975963235, 976128221, 976147354, 976079583, 976042926, 976038337, 976059675, 976064920, 976010740, 975994945, 976085603, 976191521, 976212442, 976179779]
2488I76179779O556N7638M1365K802R596K4200j2637j8417J03533J78039R4533l2067
2512.5I76634920j26660j04070K2113J11699J30594R4950m529r1017n2750K7657M9710
2535I76692617J02997J28984m351j32322j08063l9697k2113p3433j02938n36Q6725
2557.4I76527870p212j31131j13785o6817j8179N1379L9220l338k9743l5822l0041
2579.8I76182401p4625q5771r179M8339J2517n2750m9591k0385p1466j42037j42098
2602.2I75595355j33693r8109n96L0934k1994l8683n4717p6175l0458k2531m4405o6280
2626.7I75038648j42873j74701j42932q6605k9147l7611j4603P6473R4116M0114m2200
2649.2I74578679j16587q0049N2035J40846R6619J8537J490j1563o199J9610k0385
$$ y = [976179779, 976186335, 976243973, 976285338, 976288140, 976297736, 976321936, 976309299, 976290882, 976394415, 976572454, 976666987, 976634920, 976508260, 976404190, 976426303, 976538002, 976668596, 976763546, 976759017, 976668000, 976615250, 976642907, 976692617, 976795614, 976924598, 976920247, 976787925, 976679862, 976640165, 976618052, 976544619, 976441681, 976441145, 976527870, 976520658, 976389527, 976275742, 976208925, 976190746, 976242125, 976281345, 976278007, 976248264, 976212442, 976182401, 976107776, 976022005, 976012826, 976061165, 976073682, 976020932, 975971341, 975950956, 975879490, 975737453, 975595355, 975461662, 975363553, 975362957, 975393891, 975371897, 975333214, 975278497, 975202322, 975171864, 975149333, 975104928, 975038648, 974895775, 974721074, 974578142, 974491537, 974462390, 974424779, 974410176, 974486649, 974580765, 974620879, 974578679, 974462092, 974382043, 974434078, 974574924, 974671543, 974690080, 974691570, 974680007, 974673808, 974693418, 974673033]
2671.6I74673033m0353L4333M3690q3447j65224j19567l8623L7789N5551l159j04129
2694I74289894j78575j12117o854M9412R9480K1637j71841k25007r3520k5570j25587
2716.4I73521352j69575r2864k5034J1623m9711j52707p9751J17898J69933M0591l5167
2738.9I73256588J2577L2484m8041r6560J2696J81675K07126M6790n8711J0669O4075
2761.3I73621368l099j18732j84119j40608n0902q2850j43886j550J02222l5643j27733
2783.7I72834468p4089q3923k04206k51710j26004j6093p6116j70350j95562j44661
2804.1I71491754j8537k9623j86384j42277J5021n8770k38419k84374k04146j13308
2824.5I70230937r6858j15513j58608k43962l56376m48227m55499m36902m76360o27458
$$ y = [974673033, 974632680, 974667013, 974710703, 974627256, 974462032, 974342465, 974303842, 974341631, 974397182, 974394023, 974289894, 974111319, 973999202, 973992348, 974041760, 974141240, 974162877, 973991036, 973766029, 973672509, 973646939, 973521352, 973351777, 973258913, 973233879, 973245502, 973195791, 973043084, 972963333, 973081231, 973251164, 973291755, 973256588, 973269165, 973301649, 973253608, 973157048, 973169744, 973351419, 973558545, 973605335, 973546624, 973557293, 973621368, 973618269, 973499537, 973315418, 973174810, 973123908, 973041058, 972897172, 972895622, 972997844, 972962201, 972834468, 972760379, 972676456, 972472250, 972220540, 972094536, 972078443, 972002327, 971831977, 971636415, 971491754, 971473217, 971443594, 971257210, 971114933, 971129954, 971071184, 970832765, 970548391, 970344245, 970230937, 970134079, 970018566, 969859958, 969615996, 969259620, 968811393, 968355894, 967918992, 967442632, 966815174]
2844.9I66815174q66890r92000q63433o12855n35190p02858q21770q04424p95543p68662
2865.3I59051549p44342p62105p45893o88791p08401p87735o55651l46005k20657k72929
2885.7I53119040l10481k35438n6565O6995J98782L30031L66330L83019K82169J64151
2906.1I54308033J52826M2737j36256k40148k49087k20955k50399k75850k79904l02434
2926.5I52548563m46856p12931q50439q71837q11279n88119l40760j04188J42932J74462
2946.9I48139548J04428J56104O6936p7128k3842L4153N6386K59638P19428J339197
2967.3I50774848J889647K066552J790822J324892J012921R00924P70390N33820L54707
2985.6I61419523L65972L97325L14355K33531J99139K27570L41475M41611M41373L19182
$$ y = [966815174, 965948284, 964956284, 964092851, 963479996, 962944806, 962241948, 961420178, 960615754, 959820211, 959051549, 958307207, 957545102, 956799209, 956110418, 955402017, 954614282, 953958631, 953612626, 953391969, 953119040, 952808559, 952573121, 952516556, 952583551, 952782333, 953112364, 953478694, 953861713, 954143882, 954308033, 954460859, 954503596, 954367340, 954127192, 953878105, 953657150, 953406751, 953130901, 952850997, 952548563, 952101707, 951388776, 950538337, 949666500, 948855221, 948267102, 947926342, 947822154, 947965086, 948139548, 948243976, 948400080, 948467016, 948389888, 948366046, 948400199, 948456585, 948716223, 949435651, 950774848, 952664495, 954731047, 956521869, 957846761, 958859682, 959760606, 960530996, 961064816, 961419523, 961785495, 962182820, 962497175, 962730706, 962929845, 963157415, 963498890, 963940501, 964381874, 964701056]
3006I64701056K30313K23696Q9943j9967J7822M9829J25587J52886P3254J40965L39866
3028.5I66125250M12404K87712Q8096L3319J15990J96457L11852K89499P4387j4067
3048.9I67920899N1320Q4639K0384R418J18673P2241j04070j33097o1870j6212l9935
3071.3I67922390j26720j94550j77681l3915J47343K15709J09374j72317l64542l01420
3091.7I67023671j58072j8120K5988m0352j41561k65897k12431m3571n9068j15991
3112.1I65994596n1319n1677k00570k92122k13027q4162r358K9802L7849j55926l82125
3134.5I64621961l11673k27749l11434k84314q2493m530k05219l93510l55422k13206
3154.9I62232411j03235j18971k70248l71873k92659k02238k73049m06981m01437k04921
$$ y = [964701056, 964931369, 965155065, 965245008, 965225041, 965242863, 965292692, 965418279, 965571165, 965644419, 965785384, 966125250, 966537654, 966825366, 966913462, 966946781, 967062771, 967259228, 967571080, 967860579, 967934966, 967920899, 967972219, 968056858, 968077242, 968086660, 968205333, 968277574, 968173504, 968040407, 967978537, 967962325, 967922390, 967795670, 967601120, 967423439, 967389524, 967536867, 967752576, 967861950, 967689633, 967325091, 967023671, 966865599, 966847479, 966873467, 966833115, 966691554, 966425657, 966213226, 966169655, 966110587, 965994596, 965943277, 965891600, 965691030, 965398908, 965185881, 965101719, 965092361, 965122163, 965160012, 965004086, 964621961, 964310288, 964082539, 963771105, 963486791, 963404298, 963399768, 963194549, 962801039, 962445617, 962232411, 962129176, 962010205, 961739957, 961368084, 961075425, 960873187, 960600138, 960193157, 959791720, 959586799]
3175.3I59586799r2327j44363j85609l27766n06878m86493l28719k38359l12686l87013
3195.7I56576586l53694l38197l22282k94209l53932l99351l41416l21865l82244l56317
3216.1I53113079l04162l07978k75850l05235l89636l42846k33888j91212j85371k43067
3236.5I50333834l25501l41952l01242k42829k34843k50876k19225j62364k20060l87132
3256.9I47647810m51505k88964q5115j71006l55661l00526j18494n1022k19285l63112
3277.3I45243120k64168n9127J0073j89245l82423l47257k87950k43425o0857K6226
3297.7I43444967j65164m07338m90606l13521r1552j11103k63930l48210k88308j50442
3318I40814793j37567l36469m82976m03404k55466k41935m25041m97639l88443m58181
$$ y = [959586799, 959494472, 959350109, 959164500, 958836734, 958329856, 957843363, 957514644, 957276285, 956963599, 956576586, 956222892, 955884695, 955562413, 955268204, 954914272, 954514921, 954173505, 953851640, 953469396, 953113079, 952808917, 952500939, 952225089, 951919854, 951530218, 951187372, 950953484, 950762272, 950576901, 950333834, 950008333, 949666381, 949365139, 949122310, 948887467, 948636591, 948417366, 948255002, 948034942, 947647810, 947196305, 946907341, 946822226, 946651220, 946295559, 945995033, 945876539, 945825517, 945606232, 945243120, 944978952, 944919825, 944929898, 944740653, 944358230, 944010973, 943723023, 943479598, 943418741, 943444967, 943279803, 942872465, 942381859, 942068338, 941976786, 941865683, 941601753, 941253543, 940965235, 940814793, 940677226, 940340757, 939857781, 939454377, 939198911, 938956976, 938531935, 938034296, 937645853, 937187672]
3338.4I37187672n94080n03838l35991l15309l21269k78771k94208l00408l24428m49717
3358.8I33469653n48959n18083m76480n11169m60863k81453k80798m62413m68135l65734
3379.2I29095566k66492k13266l76284n40316n31494m31657l13521l82065m84169l55303
3399.6I25200999k10941j64092j37090j65522l74973n89311m69447k00450j63138l46601
3420I22379434l94761l17991l35396l26275k55406k44022l03328k11298j9372q7499
3440.4I19884086k61903k88010k30014o8307L338q8632j52409j98663j06096K2173
3460.8I18515563p1764k42531k34485q643J57714J15931K206l8863K5034J54734J85311
3483.2I18560207J14083J84417L21746L21567K76744K78354J92881O0975J07944L99590
$$ y = [937187672, 936593592, 936089754, 935753763, 935438454, 935117185, 934838414, 934544206, 934243798, 933919370, 933469653, 932920694, 932402611, 931926131, 931414962, 930954099, 930672646, 930391848, 929929435, 929461300, 929095566, 928829074, 928615808, 928239524, 927699208, 927167714, 926736057, 926422536, 926040471, 925556302, 925200999, 924990058, 924825966, 924688876, 924523354, 924148381, 923559070, 923089623, 922889173, 922726035, 922379434, 921984673, 921666682, 921331286, 921005011, 920749605, 920505583, 920202255, 919990957, 919971585, 919884086, 919622183, 919334173, 919104159, 919035852, 919039190, 918950558, 918798149, 918599486, 918493390, 918515563, 918443799, 918201268, 917966783, 917958140, 918115854, 918231785, 918233991, 918195128, 918220162, 918374896, 918560207, 918674290, 918858707, 919180453, 919502020, 919778764, 920057118, 920249999, 920310974, 920418918, 920818508]
3503.6I20818508N83231L95954K46286L82483M15564K40862J82390J72198J42098J93178
3524I23772752L14653M72665M70936L48151K48075K20298K82705K30849R6560J91807
3544.4I26649451N41568P54058N77748L16084L34859M48823M00304L02315J58250q8155
3564.8I30395305M1187O42240Q26955N65886L19243K18987M13299P17699N29290r0123
3585.2I34579968j56402O78122Q93056L65556L17394O04511N72502N26965N39660L23952
3605.6I39245284J73688M60922O95288O68049P37071P66993P17580P87914R42528R27627
3626I46122944O00756O20603J101732J272858J237392J263142J258313J330495J575709
3644.3I56383944J649320J336336R59873J050413J225114J177907J047730J037240
$$ y = [920818508, 921401739, 921797693, 922043979, 922426462, 922842026, 923082888, 923265278, 923437476, 923579574, 923772752, 924087405, 924560070, 925031006, 925379157, 925627232, 925847530, 926130235, 926361084, 926457644, 926649451, 927191019, 927945077, 928522825, 928838909, 929173768, 929622591, 930022895, 930325210, 930483460, 930395305, 930436492, 931078732, 931905687, 932471573, 932790816, 933009803, 933423102, 934140801, 934670091, 934579968, 934423566, 935101688, 935994744, 936360300, 936677694, 937282205, 937854707, 938381672, 938921332, 939245284, 939418972, 939879894, 940575182, 941243231, 941980302, 942747295, 943464875, 944252789, 945195317, 946122944, 946723700, 947344303, 948446035, 949718893, 950956285, 952219427, 953477740, 954808235, 956383944, 958033264, 959369600, 960329473, 961379886, 962605000, 963782907, 964830637, 965867877]
3660.6I65867877J128256J330853J450360J203119R60827R26853O19173L79562M62353
3679I74329233M26650N23448P59959P19011K78890j01864O855K98500M28855L80337
3699.4I78049874J32501q285K92600M78088L7134p00533m13239L78549L82900j07646
3719.8I78521943k72870p9572R3043M06265N55098l219o66976l07679M61281O46948
3740.2I79354262L66807p3611J1503J82391k71082n28455q3864K30312R8944p0155
3760.6I79217052J31429K84254J52946j01328k45690j28687J7881J28270P2658q8096
3781I79440689p0095j55389l03328j66416K20179M69744L07441K00927J91331l10898
3801.4I79824185m02212L040o8247r8527J61052L45767K21967Q762j71423n15044k95579
$$ y = [965867877, 966996133, 968326986, 969777346, 970980465, 971941292, 972868145, 973487318, 973866880, 974329233, 974755883, 975279331, 976039290, 976758301, 977037191, 976935327, 976942182, 977240682, 977669537, 978049874, 978182375, 978174090, 978466690, 978944778, 978981912, 978281379, 977868140, 978246689, 978629589, 978521943, 978249073, 978169501, 978262544, 978668809, 979223907, 979220688, 978553712, 978246033, 978707314, 979354262, 979721069, 979647458, 979658961, 979841352, 979570270, 979041815, 978957951, 979188263, 979287207, 979217052, 979348481, 979632735, 979785681, 979684353, 979438663, 979309976, 979327857, 979456127, 979528785, 979440689, 979370594, 979215205, 978911877, 978745461, 978965640, 979435384, 979742825, 979943752, 980135083, 979824185, 979421973, 979425013, 979356766, 979258239, 979419291, 979765058, 979987025, 979995787, 979824364, 979309320, 979013741]
3823.8I79013741J8775M4227K15232L20614L02553J98245j49608k84731k69413l44396
3844.2I79065239j06394L57449N72205j06514j087844m33385K02059J83463k0742q4162
3864.6I78541374J41382J40906l457L040j09554j47640j89901j53720J48356J20938
3885I78491724l100O3300n4180j13726k4855j80781l94344k04027P3314K25186K78771
3907.4I78157282J70827J56104P1705k12074l20077j33395N3823k324k2054Q8453o6876
3929.8I77941394k12491k7418J37627K18809J26123j88231j87695J01626J67966P3909
3950.2I78151619m7504q6725N1200J3888j71304q7976P1585o020o8367J76728J94848
3972.7I78191972l01600l76165J18256K64704J04070J71602K05576j18077l51607j60993
$$ y = [979013741, 979032516, 979076743, 979291975, 979612589, 979915142, 980113387, 979963779, 979679048, 979409635, 979065239, 978958845, 979316294, 979888499, 979781985, 978694141, 978260756, 978462815, 978646278, 978625536, 978541374, 978682756, 978823662, 978820205, 978823245, 978713691, 978566051, 978376150, 978222430, 978370786, 978491724, 978488624, 978551924, 978497744, 978384018, 978359163, 978178382, 977784038, 977580011, 977653325, 977878511, 978157282, 978328109, 978484213, 978555918, 978343844, 978023767, 977890372, 977944195, 977941871, 977919817, 978008270, 977941394, 977728903, 977701485, 977839112, 978057921, 978184044, 977995813, 977808118, 977909744, 978077710, 978151619, 978104115, 978017390, 978068590, 978082478, 977911174, 977823198, 977894783, 977888763, 977820396, 977997124, 978191972, 977890372, 977514207, 977632463, 977897167, 978001237, 978172839, 978378415, 978260338, 977908731, 977747738]
3993.1I77747738J49966K74658
3997.1I78172362
$$ y = [977747738, 977897704, 978172362]
##END=$$ End of the data block
