##TITLE=Rachel - Amostra 4 $$ Begin of the data block
##JCAMP-DX=5.00 $$ ACD/SpecManager v 10.08
##SPECTROMETER/DATA SYSTEM=Alpha
##DATE=21 May 2015 14:09:38
##DATA TYPE=INFRARED SPECTRUM
##DATA CLASS=XYDATA
##ORIGIN=
##OWNER=
##NPOINTS=1667
##FIRSTX=599.57470703
##LASTX=3997.16503906
##MAXX=3997.16503906
##MINX=599.57470703
##MAXY=0.97986406
##MINY=0.15020116
##XFACTOR=1.0000000000
##YFACTOR=1.000000000000000e-9
##FIRSTY=0.45952776
##DELTAX=2.03937006
##XUNITS=1/CM
##YUNITS=ARBITRARY UNITS
##XYDATA=(X++(Y..Y))
599.6D59527761l016681N748719J4985681K1970361K4740041K2578597J6755819J1168182
615.9E74458480Q713007Q011043P533491Q081793Q985639Q781850P472873O143332
632.2F38181508N001902L554642K223373J739263K188981L934503O537139P829547
648.5F71190858O640613M254639K762675L319085N477727O826579O054163M454911
664.8G10981250L984570L560365J403391M20928M59969J069784J757801J526475P03752
683.2G25868285K15590K41160J259685L508508N595684O386220N961836M976213M275083
701.5G58288264L966451L948808M129350L756106K906143K545476K644778K871811
717.9G85057187L420591M284323N070209N437672N185068M699767M277527L725946
$$ y = [459527761, 456511080, 462259799, 477245480, 499215841, 523955882, 546534479, 563290298, 574458480, 583171487, 591182530, 598716021, 606797814, 615783453, 624565303, 632038176, 638181508, 643183410, 646738052, 648961425, 650700688, 652889669, 656824172, 663361311, 671190858, 677831471, 682086110, 684848785, 688167870, 693645597, 700472176, 706526339, 710981250, 714965820, 718526185, 719929576, 720350504, 720810473, 721880257, 723638058, 725164533, 725868285, 726083875, 726325035, 727584720, 731093228, 736688912, 743075132, 749036968, 754013181, 758288264, 762254715, 766203523, 770332873, 774088979, 776995122, 779540598, 782185376, 785057187, 788477778, 792762101, 797832310, 803269982, 808455050, 813154817, 817432344, 821158290]
734.2H21158290L159702K688586K219439J766622J604259J714110J711548J543462
750.5H37566018J524150J586497J537025J428843J301765J297593J383305J374543
766.8H48999739J271426J180470J178623J237988J091302R83297J189292J127064Q16226
785.2H59075427P57814P30872O62207P66814O98090M88877M57942N02170N37812L98159
805.6H65076184J60158J73986K64883J89125o139l10302n36680q49664j290739j674771
825.9H61196041k389908l337443l831088l584623k675713j280844K41518J508415K233863
844.3H48080218K404153K167762J491189N36799m69029j618505k860903m308939o294191
862.7H39128554q689582j1600137j4893949j7012179j6084790j2010575o907165l025293
$$ y = [821158290, 824317992, 827006578, 829226017, 830992639, 832596898, 834311008, 836022556, 837566018, 839090168, 840676665, 842213690, 843642533, 844944298, 846241891, 847625196, 848999739, 850271165, 851451635, 852630258, 853868246, 854959548, 855942845, 857132137, 858259201, 859075427, 859833241, 860564113, 861226320, 861993134, 862691224, 863180101, 863638043, 864140213, 864678025, 865076184, 865236342, 865410328, 865675211, 865864336, 865858197, 865547895, 865011215, 864161551, 862870812, 861196041, 858806133, 855468690, 851637602, 848052979, 845377266, 844096422, 844337940, 845846355, 848080218, 850484371, 852652133, 854143322, 854680121, 854211092, 852592587, 849731684, 845422745, 839128554, 830438972, 818838835, 803944886, 786932707, 770847917, 758837342, 751930177, 748904884]
879G48904884j363278k139508m979790r012937j3457775j8107355k2621572k5429189
895.3F51793480k4361670j8501461r449482k42948P095516J2544453J6674697J9048214
911.6F54600799J9029975J6930521J3879418J1417091J0377943J0283769J0291397
925.9G46810913R847999Q671581O834269M607618K303719J09971j905620l726304n484760
944.2G68069386o984531p834733p853687o872177m998088k945363k036572l410458
960.5G25133777p249296j3102293j9772053k5316179k8213977k8293670k6427447k3694456
976.9E53064406k0892739j8288970j5925676j4040619j2632162j1458724j0842026
991.1D48983490j1617273j4262288j8216670k2021890k4553507k5609076k5462866
$$ y = [748904884, 747541606, 745402098, 740422308, 731409371, 717951596, 699844241, 677222669, 651793480, 627431810, 608930349, 599480867, 599237919, 606333435, 618877888, 635552585, 654600799, 673630774, 690561295, 704440713, 715857804, 726235747, 736519516, 746810913, 756658912, 765330493, 772164762, 776772380, 779076099, 779186070, 777280450, 773554146, 768069386, 761084855, 753250122, 745396435, 738524258, 733526170, 730580807, 728544235, 725133777, 717884481, 704782188, 685010135, 659693956, 631479979, 603186309, 576758862, 553064406, 532171667, 513882697, 497957021, 483916402, 471284240, 459825516, 448983490, 437366217, 423103929, 404887259, 382865369, 358311862, 332702786, 307239920]
1005.4C07239920k4458438k2904516k1111145j9148991j7050817j4898986j2577146
1019.7A75089881j0001823p415250m989073k482578M93079L997684P375940R740457
1036A71808317J0687590J0618865J0367513J0657266J1773869J3653651J5965700J8156410
1052.3B73689181J9841909K0736158K0473838J8733561J5835732J2771189J0564983
1066.6C92646551R697169R953141J0855020J1833131J2472153J2843817J3371199J4395774
1082.9D88067955J6027480J8163443K0556867K2688031K3563504K2405982J9403577
1097.2F30876839J5301705J0807752O534457K960802J79171k050817l747940m659414
1113.5F56202555m880488m733563l928303j739741K053261O643355J0658681J3205290
$$ y = [307239920, 282781482, 259876966, 238765821, 219616830, 202566013, 187667027, 175089881, 165088058, 157672808, 152683735, 150201157, 150694236, 154691920, 162067860, 171808317, 182495907, 193114772, 203482285, 214139551, 225913420, 239567071, 255532771, 273689181, 293531090, 314267248, 334741086, 353474647, 369310379, 382081568, 392646551, 402343720, 412296861, 423151881, 434985012, 447457165, 460300982, 473672181, 488067955, 504095435, 522258878, 542815745, 565503776, 589067280, 611473262, 630876839, 646178544, 656986296, 663520753, 666481555, 666660726, 664609909, 660861969, 656202555, 651322067, 646588504, 642660201, 640920460, 642973721, 649617076, 660275757, 673481047]
1129.8F73481047J3922751J2820780J0499835P673920M706621J687586j754939n918622
1146.1G17118979j0233701j3646960j5084207j4117658j1187017p070422k698422J231849
1162.4F44312441M526854P206738R368122J1081576J2269556J2859762J2578309J1120140
1178.8G25323498Q522928M772067l39091o803572j4531493k3667097l4204126m5573473
1195.1F13499641n6417822o4514131o7251682o3036025n2726775l9261937k5923610
1209.4B44367659j4945000p047385j723752J929730M373655N557522N659446N533994
1225.7B43705869O011858P680849J0688930J4445007J8075049K1015585K3084044K4276912
1242C68984103K4852425K5211215K5663942K6096076K6239544K6149154K5965571K5700271
$$ y = [673481047, 687403798, 700224578, 710724413, 718398333, 723104954, 724792540, 723037601, 717118979, 706885278, 693238318, 678154111, 664036453, 652849436, 645779014, 643080592, 644312441, 648839295, 656046033, 665414155, 676495731, 688765287, 701625049, 714203358, 725323498, 733846426, 738618493, 738279402, 731475830, 716944337, 693277240, 659073114, 613499641, 557081819, 492567688, 425316006, 362279981, 309553206, 270291269, 244367659, 229422659, 222375274, 220651522, 222581252, 226954907, 232512429, 238171875, 243705869, 249717727, 257398576, 268087506, 282532513, 300607562, 321623147, 344707191, 368984103, 393836528, 419047743, 444711685, 470807761, 497047305, 523196459, 549162030, 574862301]
1258.3E74862301K5254548K4410248K3401022K2821128K2756696K2792160K2323728
1272.6G38621831K1088421J9369722J7329752J5057862J2911677J1003971R373725
1286.8H44756961Q166015P360637O771028O160915N374670M327655L073871J838267
1303.2H87830019O62863o11603j798987k700568l171026l093541k554297j485289m470
1321.5H73073101J501143K879202L785491L874958L390789K576888J641511P56443
1337.8H93479526j69516j272440k535998m007042o197989r970486j5998542k4610341
1354.2H28717172l4593403m2139292m4476747m0530742k8622389j4367342l647029
1368.4F20340228M684687J1642098J7033100J8576205J8323362J9414544K1145701
$$ y = [574862301, 600116849, 624527097, 647928119, 670749247, 693505943, 716298103, 738621831, 759710252, 779079974, 796409726, 811467588, 824379265, 835383236, 844756961, 852922976, 860283613, 867054641, 873215556, 878590226, 882917881, 885991752, 887830019, 888492882, 887881279, 886082292, 883381724, 880210698, 877117157, 874562860, 873077571, 873073101, 874574244, 877453446, 881238937, 885113895, 888504684, 891081572, 892723083, 893479526, 893310010, 892037570, 889501572, 885494530, 879296541, 869326055, 853327513, 828717172, 794123769, 751984477, 707507730, 666976988, 638354599, 623987257, 620340228, 625024915, 636667013, 653700113, 672276318, 690599680, 710014224, 731159925]
1382.7G31159925K2897482K5822461K6903510K3007810J9087732J6193569J1675894
1397H76748383P259965M009247J421928k05934j017093j662195k475381l231585l830433
1415.3H77016902m488230m999637m390538l862560l657520k707720j382648K22980
1431.6H51751029J767636L381610M974544N031407M822194M732311M477620M390001
1448H85328352M023493L265083K687573L031135L917098L637612L601789M659653N401253
1466.3I19553041M981816M750729N024791M399895L243864K461970J882076J485109
1482.6I47783291J077772P37845N50747O16193O78241N68629L27468O7770J52350M68671
1503I53028977L79324n73814o31392P9513L03566K25306J70946K26617J36971j51038
$$ y = [731159925, 754057407, 779879868, 806783378, 829791188, 848878920, 865072489, 876748383, 884008348, 888017595, 889439523, 889233589, 888216496, 886554301, 884078920, 880847335, 877016902, 872528672, 867529035, 863138497, 859275937, 855618417, 852910697, 851528049, 851751029, 853518665, 856900275, 861874819, 866906226, 871728420, 876460731, 880938351, 885328352, 889351845, 892616928, 895304501, 898335636, 902252734, 905890346, 909492135, 914151788, 919553041, 924534857, 929285586, 934310377, 938710272, 941954136, 944416106, 946298182, 947783291, 948861063, 949598908, 950149655, 950765848, 951444089, 952012718, 952340186, 952407956, 952560306, 953028977, 953408301, 952834487, 952203095, 952282608, 952586174, 952811480, 952982426, 953209043, 953346014, 953194976]
1523.4I53194976k61605o2823J65581J84775P9632K94864O25312J99080j003683r55045
1543.8I52461064l04699m4227K1339J72436L01003M48883J50800q34227n06937j33753
1564.2I51731682j05202j78576m74989l27051n1677n82934j115083q65519p84994r20057
1584.6I46325600j118183j262486j382709j596808j910925k199113k426386k763152
1600.9I31665838l030658l316641l684938m068494m242360l977001m174054n306303
1617.2H99865389m771471l718197l912509l565371k739251k102494j281917p81715
1633.6H76992464r60469q57175j92761L67224Q59082J188993J529754J722335K132833
1651.9H82782280K474666K071381K231240K583861K712012K373874J874328J647651
$$ y = [953194976, 952933371, 952870548, 953036129, 953220904, 953300536, 953595400, 954220712, 954419792, 953416109, 952461064, 952156365, 952112138, 952133477, 952305913, 952606916, 953055799, 953206599, 952372372, 951865435, 951731682, 951626480, 951447904, 950972915, 950645864, 950594187, 950011253, 948896170, 948030651, 947245657, 946325600, 945207417, 943944931, 942562222, 940965414, 939054489, 936855376, 934428990, 931665838, 928635180, 925318539, 921633601, 917565107, 913322747, 909345746, 905171692, 899865389, 895093918, 891375721, 887463212, 883897841, 881158590, 879056096, 877774179, 876992464, 876031995, 875174820, 874982059, 875349283, 876208365, 877397358, 878927112, 880649447, 882782280, 885256946, 887328327, 889559567, 892143428, 894855440, 897229314, 899103642, 900751293]
1668.2I00751293J368344P67648K37524m43697r46581j015782j430631l182471m034817
1686.6H92070830l912509m839182n340814p221878r697020j1775136j6975403j7753243
1702.9H14555645k0381987k7967453l2005489l5116315l8913905m3657184n0999582
1717.2E65513730m7044039l2900184k6004046k1273166j4046431p969349k886028K048105
1733.5D15438592O300629P747829J0198652J2160808J2260050J3174832J5190363J9786119
1749.8E12257874K5094569K8001070L4187019M2156040M5643211M9832761M5734406
1764.1G82906950L5999178L0010820K3950577J9136965J4059663R343445P273376O312430
1780.4I28993404N101383M241764L625632L044724K548277K257884J804590J601279
$$ y = [900751293, 902119637, 902887285, 903124809, 902681112, 901734531, 900718749, 899288118, 896105647, 892070830, 888158321, 883319139, 877978325, 870756447, 861059427, 849284291, 832308888, 814555645, 794173658, 766206205, 734200716, 699084401, 660170496, 616513312, 565513730, 518469691, 485569507, 459565461, 438292295, 424245864, 416276515, 413390487, 415438592, 421739221, 429487050, 439685702, 451846510, 464106560, 477281392, 492471755, 512257874, 537352443, 565353513, 599540532, 641696572, 687339783, 737172544, 782906950, 818906128, 848916948, 872867525, 892004490, 906064153, 915407598, 922680974, 928993404, 934094787, 938336551, 941962183, 945006907, 947555184, 949813068, 951617658, 953218937]
1796.7I53218937J613319J333535J334726J377106J303494J167715J197576J117289
1813I63663697R97544R12129R13859R26196P95663Q17776Q10265P09951N79417O66737
1833.4I71793234O04034M27067L13878K72691K16484P4745J74701K99871K99990K02358
1853.8I74679053J84536P4804k2889M8221J65224R1493o9320P4982K24829J70469K8730
1876.2I75650132K1815L3975M2379N2273J5735o1214M411J64390Q0824j2994p5281
1898.7I75916445j73151k43962k23517k20240k11894j33097p1407r3162k28822k62022
1919.1I74055171j87576o2823J5497k4676l0756K6583r357j12892j19030q3447j01447
1941.5I73365247n2213M1127j9789k8610O4015J06931O4015j4424j8001P3910J07706
$$ y = [953218937, 954832256, 956165791, 957500517, 958877623, 960181117, 961348832, 962546408, 963663697, 964661241, 965573370, 966487229, 967413425, 968209088, 969026864, 969837129, 970547080, 971126497, 971793234, 972397268, 972824335, 973138213, 973410904, 973627388, 973702133, 973876834, 974176705, 974476695, 974679053, 974863589, 974938393, 974915504, 974963725, 975128949, 975220442, 975151122, 975226104, 975450933, 975621402, 975650132, 975671947, 975705922, 975748301, 975800574, 975816309, 975755095, 975759506, 975923896, 976004720, 975991726, 975916445, 975743294, 975499332, 975275815, 975055575, 974843681, 974710584, 974639177, 974546015, 974317193, 974055171, 973867595, 973804772, 973820269, 973795593, 973764837, 973791420, 973782063, 973669171, 973550141, 973466694, 973365247, 973313034, 973354161, 973334372, 973305762, 973369777, 973476708, 973540723, 973526299, 973508298, 973582208, 973689914]
1963.9I73689914k682M2200K45988K70069J64628J40249J06037O0499Q4698P8797k205
1986.4I74878192p3910n4955K3067P8082J8298n5790m3749J7702M0293n5611j95682
2008.8I74575937k71917k20239j41620j10805m0293K8789J4603o6042r7692J2457J10209
2031.2I73793387O8665p927l9041q7560j31011m1604P1705M1425o7413r4354P212M6015
2055.7I73559499p9334j60813j25826r0718k1756J28150J53005o4790k34902j17123
2076.1I72945392M8697K0683q3685j34230j61469k39551k62439j78695j51336k08974
2096.5I71594393k51233k04981j22666j46091k15650j91390j53244j47462j05857o3241
2116.9I69992578j09315p7605N0127N1797L4094M7743L2842R1374J97172J81377J38521
$$ y = [973689914, 973687232, 973729432, 973975420, 974245489, 974410117, 974550366, 974656403, 974716902, 974801600, 974880397, 974878192, 974804282, 974749327, 974772394, 974850476, 974868774, 974812984, 974769235, 974786937, 974827230, 974771619, 974575937, 974304020, 974083781, 973942161, 973831356, 973791063, 973819852, 973834455, 973768413, 973670721, 973683178, 973793387, 973862052, 973854125, 973815084, 973727524, 973596513, 973554909, 973626614, 973668039, 973600626, 973506272, 973513484, 973559499, 973480165, 973319352, 973193526, 973102808, 973081052, 973209202, 973362207, 973297417, 973062515, 972945392, 972994089, 973014772, 972931087, 972796857, 972635388, 972395837, 972133398, 971954703, 971803367, 971594393, 971343160, 971138179, 971015513, 970869422, 970653772, 970462382, 970309138, 970161676, 970055819, 969992578, 969883263, 969805658, 969855785, 969907582, 969941676, 969989419, 970022261, 970113635, 970310807, 970492184, 970630705]
2139.3I70630705J84238K13564J50323O5505J07229J71900K07722K57790K35140J72615
2159.7I72396731J82152J89364J32203J54078K32816K67923K79009K67148J72734Q1480
2180.1I74355638R3699R6559K5213j2100O0737J32084TJ30296J35183P1526j7465o675
2204.6I75196779P4804R5427R5367J15693P5996N1975N5611O6936J02818N4479j8776
2227I75967109J4246L0756m351M8279R2566P511o5029r358M9174J788n5611m9591l3737
2253.5I75993752m8160n1141L1531J25885Q8036j311k2769j2458n9J3828K8551M2140
2278I76187825M5419L7193J5557L4154O9141O4611Q8990J51038J83165J17421k9444
2300.4I76965070o3598P867n7280j58071o3360J80483L45588K30014N2512J9610L9994
$$ y = [970630705, 970814943, 971028507, 971178830, 971244335, 971351564, 971523464, 971731186, 971988976, 972224116, 972396731, 972578883, 972768247, 972900450, 973054528, 973287344, 973555267, 973834276, 974101424, 974274158, 974355638, 974449337, 974545896, 974571109, 974559009, 974619746, 974751830, 974883914, 975014210, 975149393, 975220919, 975203454, 975196779, 975271583, 975367010, 975462377, 975578070, 975654066, 975706041, 975761652, 975828588, 975931406, 975985885, 975967109, 975981355, 976012111, 976007760, 976056039, 976148605, 976156116, 976091087, 976081729, 976130903, 976132691, 976077080, 976027489, 975993752, 975945592, 975894451, 975925982, 976051867, 976139903, 976138592, 976115823, 976103365, 976103306, 976117134, 976145685, 976187825, 976233244, 976270437, 976285994, 976320148, 976389289, 976453900, 976542890, 976693928, 976877093, 976994514, 976965070, 976901472, 976909339, 976852059, 976693988, 976630628, 976811111, 977156699, 977386713, 977439225, 977458835, 977498829]
2322.9I77498829J81020L05712L00050M49121M48525J34647P5697O9559k30789m31359
2343.3I78801012n36621m93884o7293L86715M38749K40267K69651J38343j81079k07842
2363.6I78788018k51174m52220m68314l53694l74496l34084j92880j00673N6565J78993
2384I76496041J88529K02298J33873K384l6121m3809q7738j01328p2479p5221r0003
2406.5I76516426p0572q1361r9480m0114j907j6928L6061R2268O1870J0848J0311n126
2430.9I76412296q3148q3566M292L8623K385m8638l874Q5831O139j10388o7532J848
2455.4I76154268p3374j23083J6570Q8930o020q0705n7995k8133J251L9518Q762J5557
2479.9I75955546Q0228P3611M3571K4081j5080r716L4929N4121K6524l1650j9908P4684
$$ y = [977498829, 977679849, 977985561, 978285611, 978734732, 979183257, 979317904, 979393601, 979463160, 979232371, 978801012, 978264391, 977770507, 977703214, 978089929, 978528678, 978768945, 979038596, 979176939, 978995860, 978788018, 978536844, 978084624, 977616310, 977262616, 976888120, 976554036, 976361156, 976260483, 976317048, 976496041, 976684570, 976886868, 977020741, 977023125, 976987004, 976943195, 976855457, 976754129, 976681650, 976606429, 976516426, 976445854, 976364493, 976265013, 976224899, 976222992, 976206064, 976242125, 976334393, 976396263, 976407111, 976417422, 976412296, 976329148, 976245582, 976249874, 976288497, 976290882, 976242244, 976238370, 976324201, 976330340, 976219952, 976152420, 976154268, 976080894, 975957811, 975974381, 976063311, 976057291, 975976586, 975918591, 975890458, 975891709, 975931227, 975939989, 975955546, 976035774, 976109385, 976152956, 976177037, 976161957, 976152241, 976187170, 976241291, 976267815, 976236165, 976216257, 976290941]
2504.4I76290941J37031Q8036J1683j4305n3942k1220Q3506Q8573O3777K3663n3704
2526.8I76644039l3855O2823P6652K682K5928Q6665j252q7499o0201k4438l3081n5074
2551.3I76603389l1412L1293M2378o4849j70768j05619k5988k4914q35J8060K6703
2573.7I76297438J7047j1086m5360o6697k9326n96l2067j19328j29879j6808J9490
2596.1I75882828n0068q1122p2658q3506n9962l2246l3438k2471k8670n0366m8220
2618.6I75320101k1696r716k5153j15573k13266j71840r4533p9513n8055k3782j6749
2641I74490225j5556j5498P749N7220K921r2745O914K01106J67311k5273p6174k1399
2665.5I74686801J9432J9311p6949j59264m3869J13726J788j55091o0082N8651J8060
$$ y = [976290941, 976427972, 976516008, 976527691, 976513386, 976459444, 976438224, 976521730, 976610303, 976674080, 976697743, 976644039, 976610184, 976673007, 976749659, 976752341, 976778269, 976864934, 976863682, 976776183, 976715982, 976691544, 976658463, 976603389, 976571977, 976603270, 976645648, 976580799, 976410031, 976304412, 976278424, 976253510, 976252675, 976270735, 976297438, 976314485, 976303399, 976258039, 976191342, 976162016, 976161420, 976129353, 976010025, 975880146, 975863338, 975882828, 975832760, 975751638, 975678980, 975595474, 975535512, 975503266, 975469828, 975447357, 975418687, 975368321, 975320101, 975298405, 975288689, 975263536, 975147963, 974934697, 974762857, 974668324, 974588811, 974530756, 974506974, 974490225, 974474669, 974459171, 974466920, 974524140, 974527061, 974434316, 974441230, 974642336, 974809647, 974784374, 974708200, 974686801, 974706233, 974725544, 974648595, 974489331, 974445462, 974559188, 974560976, 974405885, 974345803, 974404454, 974422514]
2687.9I74422514p4148r4056p4804r4771p9870J3649N0724k861j19686k26856j61528
2710.3I73558307m4167m3631r3341p9274m0531p5996p2599l0219q0586o9081P7664
2732.8I73006546J30296M7267p75J9014O8903O8187j0728j7047R6440J85490P8618
2755.2I73672211j17779r9361L8267K5391o7413j06990j51813j79827j25468l1412
2775.6I72855806Q1182R5248l7551j32739j62840j96517j90139j52289q6248p4983
2796I71998930j35541j22309j62303k54691j57893n5015q0883m6432l9280j87754k78056
2818.4I70478773j86264q5235j01984j85668j77622r6142j91987m05788n00798n04017
2838.8I68043268n47886o54638q26538r95040r29296o63518n10395n89192p12216o99878
$$ y = [974422514, 974348366, 974254310, 974179506, 974084735, 974004865, 974018514, 974069238, 974066377, 973946691, 973719835, 973558307, 973514140, 973470509, 973377168, 973297894, 973257363, 973181367, 973108768, 973078549, 972997963, 972928882, 973006546, 973136842, 973184109, 973183334, 973202348, 973271251, 973339438, 973328710, 973311663, 973408103, 973593593, 973672211, 973554432, 973455071, 973493338, 973518729, 973451316, 973344326, 973192513, 973012686, 972887218, 972855806, 972936988, 973032236, 972994685, 972861946, 972699106, 972502589, 972312450, 972160161, 972073913, 971998930, 971863389, 971741080, 971578777, 971324086, 971166193, 971111178, 971030295, 970983863, 970944583, 970756829, 970478773, 970292509, 970207274, 970105290, 969919622, 969742000, 969645858, 969453871, 969048083, 968547285, 968043268, 967495382, 966840744, 966014206, 965019166, 964089870, 963426352, 962915957, 962326765, 961614549, 960914671]
2859.2I60914671o87599p55429p61330p80106q44478p83742o61194o46532o91890o22333
2879.6I53680038m84168m23968l46899k15709j39237r3877m0293L5405J91272L66211
2900I52528775M59671L39865Q5295j9372p4565j96815l44753m85241m83871l63827
2920.4I51445162j99198n4837o1512k86102n93603p87019q67963p72000n00857k95520
2940.8I47026551p7188K71439L72291K14398J75357R0599j15991j02341L5644Q7976
2961.2I47978735L32952Q64863J419246J777649J864731J737178J426339J102388Q82625
2979.5I59386706O98448N63323M31597L40343L01599K28882K58267L64423L91006M11451
2999.9I63376045M56333M04776K09152J09315K19643K45631J43230O2168J8477M1723
$$ y = [960914671, 960227072, 959471643, 958710313, 957930207, 957085729, 956301987, 955640793, 954994261, 954302371, 953680038, 953195870, 952771902, 952425003, 952209294, 952070057, 951976180, 951935887, 951971292, 952162564, 952528775, 952988446, 953328311, 953413606, 953394234, 953319669, 953122854, 952778101, 952292860, 951808989, 951445162, 951245964, 951191127, 951129615, 950843513, 950249910, 949462891, 948594928, 947822928, 947322071, 947026551, 946949363, 947220802, 947593093, 947807491, 947982848, 948073447, 947957456, 947855115, 947890759, 947978735, 948311687, 949176550, 950595796, 952373445, 954238176, 955975354, 957401693, 958504081, 959386706, 960085154, 960648477, 961080074, 961420417, 961722016, 961950898, 962209165, 962573588, 962964594, 963376045, 963832378, 964237154, 964446306, 964555621, 964775264, 965020895, 965164125, 965226293, 965244770, 965286493]
3020.3I65286493O6638P8857J82331L42727L49998J77503O1214M4167O4194J91748
3040.7I66845870L44634L22819J93775N2511p2956m5001L576k1219L0934L4869r119
3063.1I67680693M3332N603r8586j08361j22011j37985r2387j7285M6730L5822o1393
3085.6I67174172j57117j79351k28882k93672j49667N8472Q285j86443k45810j55747
3106I65644240l8206o378q4937j42991j67251k45690k93493j94371q3387p2956o7651
3128.4I64246929r2149k06649k78712k29418k16842k81214k33412p5698o2108k81811
3148.8I62288916m34816l10421j48415j08481j77681l64900m54724l66866l11792l29316
3169.2I59281504l49581l49939k41280j61767k51174l26991l92794m62950m75943m13596
$$ y = [965286493, 965353131, 965431988, 965614319, 965957046, 966307044, 966484547, 966545761, 966589928, 966654122, 966845870, 967190504, 967513323, 967707098, 967759609, 967686653, 967641652, 967645228, 967624009, 967654943, 967689812, 967680693, 967724025, 967729628, 967631042, 967522681, 967400670, 967262685, 967170298, 967153013, 967199743, 967235565, 967174172, 967017055, 966837704, 966608822, 966315150, 966165483, 966223955, 966232240, 966045797, 965799987, 965644240, 965606034, 965599656, 965514719, 965371728, 965204477, 964958787, 964665294, 964470923, 964387536, 964314580, 964246929, 964154780, 963948131, 963669419, 963440001, 963223159, 962941945, 962708533, 962632835, 962570727, 962288916, 961854100, 961543679, 961395264, 961286783, 961109102, 960744202, 960289478, 959922612, 959610820, 959281504, 958931923, 958581984, 958340704, 958178937, 957927763, 957600772, 957207978, 956745028, 956269085, 955855489]
3189.6I55855489k49624k06709l45230l77477l08692k94864k98441l91960m96387m25697
3210I52460408l35872l58164l44396l05355l43739l35038l00467l69489m36485l40879
3230.4I48990524j81735j55389k48373l64661m13656l42190k17200j80065k53141l25918
3250.7I46308196k90752k52128l11732l44932l13401k67446k49028k62678l17574k86281
3271.1I43412244o1154j4782k08259k40683j28687j19567k49743m06504m07397k81096
3291.5I41294372k09272j25885l576n9426k91288m02391l00526k11835k36392l02434
3311.9I39151347m05193m09364k49088k23875l88503m42744m15444l98815k78711k24888
3332.3I35714722l16441m12286n39362o53982n80371l56555k74121l22044l49045l75688
$$ y = [955855489, 955605865, 955399156, 955053926, 954676449, 954367757, 954072893, 953774452, 953382492, 952886105, 952460408, 952124536, 951766372, 951421976, 951116621, 950772882, 950437844, 950137377, 949767888, 949331403, 948990524, 948808789, 948653400, 948405027, 948040366, 947626710, 947284520, 947067320, 946887255, 946634114, 946308196, 946017444, 945765316, 945453584, 945108652, 944795251, 944527805, 944278777, 944016099, 943698525, 943412244, 943351090, 943336308, 943128049, 942887366, 942758679, 942639112, 942389369, 941982865, 941575468, 941294372, 941085100, 940959215, 940955639, 940896213, 940604925, 940202534, 939902008, 939690173, 939453781, 939151347, 938746154, 938336790, 938087702, 937863827, 937475324, 937032580, 936617136, 936218321, 935939610, 935714722, 935398281, 934985995, 934446633, 933792651, 933212280, 932855725, 932581604, 932259560, 931910515, 931534827]
3352.7I31534827l64244l94821n89312p16626n12660l54886n37514o02901l82424k70665
3373.1I26808774l51429l96966m25518n16653n18382l83675l60429m93407n26071l95298
3393.5I22440946l01003k75731k28465k63453k92420j96338k19345m62472n75900l22521
3413.9I19303298j14679k52486m33623l69192j57892j67549m05908m13954k17259k43902
3434.3I16526854l28183k50220j18971R060o1214k38359j68980q5115j71184j85729
3454.7I14927959j62184j64985r1196L1472o914j57774p9155P7903R9182N8175n1856
3477.1I14480627o3241J28210K32935J52349J77145L10958K81751J72019J69396K45810
3497.5I16287959K94804K27332L46721N97417M93705L15964L22283L47972M18067M52280
$$ y = [931534827, 931170583, 930775762, 930186450, 929469824, 928957164, 928602278, 928064764, 927461863, 927079439, 926808774, 926457345, 926060379, 925634861, 925118208, 924599826, 924216151, 923855722, 923362315, 922836244, 922440946, 922139943, 921864212, 921635747, 921372294, 921079874, 920883536, 920664191, 920201719, 919625819, 919303298, 919188619, 918936133, 918502510, 918133318, 917975426, 917807877, 917401969, 916988015, 916770756, 916526854, 916198671, 915948451, 915829480, 915838540, 915777326, 915538967, 915369987, 915284872, 915113688, 914927959, 914765775, 914600790, 914509594, 914541066, 914534152, 914376378, 914297223, 914375126, 914474308, 914532483, 914480627, 914417386, 914545596, 914778531, 914930880, 915108025, 915418983, 915700734, 915872753, 916042149, 916287959, 916582763, 916810095, 917156816, 917754233, 918247938, 918563902, 918886185, 919234157, 919652224, 920104504]
3517.9I20104504K73347L874j0193L08216M92513L73006K46286J95921K84553M11570
3538.3I22683597L32832J33693K0385K74837O64830N55277K93434L68297M92275M20808
3558.7I26240265K69354J51634M2677K09510O70612P96318N78284L79205K84910K89977
3579.1I29912746M27782M09365J60396J94669N09441N06163M49478O15359O64413M87804
3599.5I34337616N51522Q34346O47187K28584K83360N11944O49393R03249R13858N85139
3619.9I40446198N84841J001835J227676R74238Q62539J155615J310706J290441J251280
3638.2I50105369J334310J480817J604081J632571J478851J331389J254379J151145
3654.5I61372912J129329J088858J161039J412928J530528J380801J087964R47117
$$ y = [920104504, 920377851, 920381725, 920371532, 920679748, 921172261, 921545267, 921791553, 921987474, 922272027, 922683597, 923016429, 923150122, 923170507, 923445344, 924110174, 924665451, 924958885, 925327182, 925819457, 926240265, 926509619, 926661253, 926703930, 926913440, 927584052, 928380370, 928958654, 929337859, 929622769, 929912746, 930340528, 930749893, 930910289, 931104958, 931614399, 932120562, 932570040, 933185399, 933849812, 934337616, 934889138, 935723484, 936370671, 936599255, 936882615, 937394559, 938043952, 938947201, 939861059, 940446198, 941031039, 942032874, 943260550, 944234788, 945097327, 946252942, 947563648, 948854089, 950105369, 951439679, 952920496, 954524577, 956157148, 957635999, 958967388, 960221767, 961372912, 962502241, 963591099, 964752138, 966165066, 967695594, 969076395, 970164359, 971111476]
3670.8I71111476R56297P90179N71609N01632M95673O45279P57099N74648K43723J04785
3691.2I76752400J76907K64287L45647L72887J15395r7573K15351N28336K70247l68237
3711.6I78575647l25382R5010O7174j00851j58250q3089K17140M94778M40001l6954
3732I79185224o22154m79400K11120N64873M09782n6446p5638K09510n6862n11945
3752.4I78778064k59220R0778M7802P8261L31700M35353L61323p689m77970m10795
3772.8I78967607N4777L84509J74642k24769k06352j24812o4671J12653K14815J91272
3793.2I79479671M6372O4790K50697m2617k68340o0499j72913k23160P8738K88248
3813.6I79440987K27213P8321k02120n15818k22922O7234Q9705J67251K35915K55287
$$ y = [971111476, 972067773, 972857952, 973429561, 973931193, 974426866, 975072145, 975829244, 976403892, 976647615, 976752400, 976929307, 977193594, 977539241, 977912128, 978027523, 977929950, 978145301, 978673637, 978943884, 978575647, 978250265, 978345275, 978412449, 978311598, 978153348, 978070259, 978287399, 978782177, 979222178, 979185224, 978563070, 978083670, 978294790, 978859663, 979269445, 979212999, 979137361, 979346871, 979290009, 978778064, 978518844, 978609622, 978657424, 978735685, 979067385, 979502738, 979864061, 979856372, 979378402, 978967607, 979022384, 979406893, 979581535, 979356766, 979150414, 979025602, 978960931, 979073584, 979288399, 979479671, 979526043, 979590833, 979841530, 979798913, 979530573, 979470074, 979297161, 979074001, 979152739, 979440987, 979668200, 979746521, 979544401, 979028583, 978805661, 978872895, 978962600, 979129851, 979365766, 979621053]
3834I79621053K3007l01123j51574o0558j82450o3718K17319L96907k01404j010835
3854.4I78286624j91629M26650K90573p2480k92062r4056L5822k921Q8275J84655K32637
3876.8I78892088J192k38061j10745j37568k02179j48058j28925P8380J74821r1732
3897.2I78089213l40283j57833J62244K92719K42054N9605n067n245j58250k14100
3917.6I77965057o5148l3259j34766k5988K35855J20998j87636j05619J05977J67966
3938I78043437K6643l14891l01302N8711J46568P0989P7665J3411r4414p1525O9141
3960.4I77724433J62601P5043o1751j1205J10805k206k42531k06590K7359R954o6459
3982.9I77519453R2446J88887R1255m2021n1022L5107O6042
$$ y = [979621053, 979644060, 979342937, 979191363, 979130805, 978948355, 978884637, 979101956, 979498863, 979297459, 978286624, 978094995, 978521645, 978812218, 978739738, 978447676, 978353620, 978389442, 978386521, 978474796, 978659451, 978892088, 978893280, 978655219, 978544474, 978406906, 978204727, 978056669, 977927744, 978006124, 978180945, 978089213, 977748930, 977591097, 977753341, 978046060, 978288114, 978347719, 978342652, 978337407, 978179157, 977965057, 977899909, 977866650, 977731884, 977705896, 977941751, 978062749, 977875113, 977769494, 977875471, 978043437, 978070080, 977755189, 977453887, 977512598, 977659166, 977730155, 977807820, 977821231, 977726817, 977655292, 977724433, 977887034, 977962077, 977900326, 977889121, 977999926, 977997720, 977755189, 977548599, 977575958, 977585912, 977519453, 977611899, 977800786, 977892041, 977850020, 977798998, 977834105, 977900147]
3997.1I77900147
$$ y = [977900147]
##END=$$ End of the data block
