##TITLE=Rachel - Amostra 3 $$ Begin of the data block
##JCAMP-DX=5.00 $$ ACD/SpecManager v 10.08
##SPECTROMETER/DATA SYSTEM=Alpha
##DATE=21 May 2015 14:09:38
##DATA TYPE=INFRARED SPECTRUM
##DATA CLASS=XYDATA
##ORIGIN=
##OWNER=
##NPOINTS=1667
##FIRSTX=599.57470703
##LASTX=3997.16503906
##MAXX=3997.16503906
##MINX=599.57470703
##MAXY=0.98087656
##MINY=0.14102270
##XFACTOR=1.0000000000
##YFACTOR=1.000000000000000e-9
##FIRSTY=0.45506686
##DELTAX=2.03937006
##XUNITS=1/CM
##YUNITS=ARBITRARY UNITS
##XYDATA=(X++(Y..Y))
$$ plain form
599.6 455066860 452302635 458188802 472718775 494199336 518837810 541225672 557694137 568704665
615.9 568704665 577189505 585080981 592906892 601184428 609975219 618787706 626498759 632523239
632.2 632523239 637267113 640886724 643384874 645291626 647308707 650969744 657607436 665556610
648.5 665556610 672036827 676268280 679375529 683062553 688340187 694579959 700493515 705364823
664.8 705364823 709643543 713113189 714571655 714984715 715104163 715764761 717488110 719548285 720953822
683.2 720953822 721368074 721408248 722477376 725773394 731206000 737591684 743682384 748796165 753170133
701.5 753170133 757326066 761384308 765416622 769245863 772456527 775105536 777534783 780147970
717.9 780147970 783497751 787930191 793137908 798432350 803445280 808352172 813139975 817362726
$$ packed form
599.6D55066860k764225N886167J4529973K1480561K4638474K2387862J6468465J1010528
615.9E68704665Q484840P891476P825911Q277536Q790791Q812487P711053O024480
632.2F32523239M743874L619611K498150J906752K017081L661037O637692P949174
648.5F65556610O480217M231453L107249L687024N277634O239772N913556M871308
664.8G05364823M278720L469646J458466M13060J19448O60598J723349K060175J405537
683.2G20953822M14252M0174J069128L296018N432606O385684O090700N113781M373968
701.5G53170133M155933M058242M032314L829241L210664K649009K429247K613187
717.9G80147970L349781M432440N207717N294442N012930M906892M787803M222751
$$ plain form
734.2 817362726 820612073 822965145 824934959 826775849 828547239 830234349 831743419 833304226
750.5 833304226 835124612 836864591 838359177 839702129 840858281 842006624 843318164 844751716
766.8 844751716 846175551 847509563 848711252 849790275 850762427 851615727 852460682 853465676 854483485
785.2 854483485 855015159 855068624 855232000 855763137 856312811 856639326 856845677 857015967 857277334 857662320
805.6 857662320 857893288 857909799 858074963 858459055 858667672 858482718 858109653 857459128 856245041 854591548
825.9 854591548 852523565 849668860 846045911 842501283 839952469 838931620 839432299 841017544 843294382
844.3 843294382 845790386 847954214 849371195 849782884 849172413 847495019 844546318 840029240 833579302
862.7 833579302 824866474 813148618 797858000 780321300 763843715 751586735 744503677 741309166
$$ packed form
734.2H17362726L249347K353072J969814J840890J771390J687110J509070J560807
750.5H33304226J820386J739979J494586J342952J156152J148343J311540J433552
766.8H44751716J423835J334012J201689J079023R72152Q53300Q44955J004994J017809
785.2H54483485N31674N3465J63376N31137N49674L26515K06351J70290K61367L84986
805.6H57662320K30968J6511J65164L84092K08617j84954l73065o50525j214087j653493
825.9H54591548k067983k854705l622949l544628k548814j020849N00679J585245K276838
844.3H43294382K496004K163828J416981M11689o10471j677394k948701m517078o449938
862.7H33579302q712828j1717856j5290618j7536700j6477585j2256980p083058l194511
$$ plain form
879 741309166 739828229 737774312 732932627 723963022 710434914 692046165 668987751 643196642
895.3 643196642 618792355 600488603 591183841 590952396 598035514 610631824 627457380 646764815
911.6 646764815 665959179 682814419 696555138 707915068 718354225 728723466 739006221
925.9 739006221 748856604 757560968 764372885 768953025 771270096 771424949 769513071 765663564 760026634
944.2 760026634 752831101 744565904 736195564 729043663 723981082 720942795 718840122 715449512
960.5 715449512 708110809 694811702 674901783 649463654 620960832 592312634 565700591 541841865
976.9 541841865 520624340 501973629 485722512 471420139 458686233 447228551 436359137
991.1 436359137 424661487 410321295 392052889 369995534 345517427 320135564 294928253
$$ packed form
879G41309166j480937k053917m841685q969605j3528108j8388749k3058414k5791109
895.3F43196642k4404287j8303752r304762k31445P083118J2596310J6825556J9307435
911.6F46764815J9194364J6855240J3740719J1359930J0439157J0369241J0282755
925.9G39006221R850383Q704364O811917M580140K317071J54853j911878l849507n636930
944.2G60026634p195533q265197q370340p151901n062581l038287k102673l390610
960.5G15449512p338703j3299107j9909919k5438129k8502822k8648198k6612043k3858726
976.9E41841865k1217525j8650711j6251117j4302373j2733906j1457682j0869414
991.1D36359137j1697650j4340192j8268406k2057355k4478107k5381863k5207311
$$ plain form
1005.4 294928253 270671517 247946709 227043852 208116829 191245839 176573038 164368957
1019.7 164368957 154805526 147821426 143217355 141022697 141644344 145624846 152956724 162671238
1036 162671238 173343852 183931366 194292888 205087334 217065573 230794460 246651262 264617205
1052.3 264617205 284312397 304863602 324935943 343180686 358729899 371441305 382039726
1066.6 382039726 391864002 402043015 413104206 425044835 437629759 450707406 464250654
1080.9 464250654 478625119 494649023 512878537 533352554 555711925 578859329 600990415
1095.1 600990415 620224178 635288954 645820558 652100503 654880643 655030310 653079927 649554491
1111.5 649554491 645123243 640303731 635585904 631770670 630170643 632256567 638762176 649252474
$$ packed form
1005.4B94928253k4256736k2724808k0902857j8927023j6870990j4672801j2204081
1019.7A64368957r563431o984100m604071k194658O21647L980502P331878R714514
1036A62671238J0672614J0587514J0361522J0794446J1978239J3728887J5856802J7965943
1052.3B64617205J9695192K0551205K0072341J8244743J5549213J2711406J0598421
1066.6C82039726R824276J0179013J1061191J1940629J2584924J3077647J3543248
1080.9D64250654J4374465J6023904J8229514K0474017K2359371K3147404K2131086
1095.1F00990415J9233763J5064776J0531604O279945K780140J49667j950383l525436
1111.5F49554491m431248m819512m717827l815234j600027K085924O505609J0490298
$$ plain form
1127.8 649252474 662337899 676099181 688771427 699204803 706887960 711662889 713339448 711439669
1144.1 711439669 705298126 694772243 680859923 665641725 651505351 640356064 633309364 630618751
1160.4 630618751 631891191 636456966 643748999 653323114 664562047 676777244 689434886 701827705
1176.7 701827705 712880552 721431911 726274014 725936890 718893349 703873932 679631650 644828618
1193 644828618 598623693 541700184 477122039 410317630 347987860 296011895 257455736 232130826
1209.4 232130826 217598528 210748658 209166795 211310565 215871692 221593902 227504432 233403459
1225.7 233403459 239969775 248384476 259787023 274776876 293233842 314495116 337696791 361991912
1242 361991912 386817664 412018865 437649369 463620335 489674151 515626132 541414380 566958845
$$ packed form
1127.8F49252474J3085425J3761282J2672246J0433376P683157M774929J676559j899779
1144.1G11439669o141543j0525883j3912320j5218198j4136374j1149287p046700k690613
1160.4F30618751J272440M565775P292033R574115J1238933J2215197J2657642J2392819
1176.7G01827705J1052847Q551359M842103l37124p043541j5019417k4242282l4803032
1193F44828618m6204925n6923509o4578145o6804409o2329770n1975965l8556159k5324910
1209.4B32130826j4532298o849870j581863K143770M561127N722210N910530N899027
1225.7B33403459O566316Q414701J1402547J4989853J8456966K1261274K3201675K4295121
1242C61991912K4825752K5201201K5630504K5970966K6053816K5951981K5788248K5544465
$$ plain form
1258.3 566958845 592092752 616550982 640257061 663470626 686502397 709457755 731917024
1272.6 731917024 753153503 772655129 790065587 805201113 818255305 829481483 839091480
1286.8 839091480 847457528 854999661 861902177 868134320 873589694 878032804 881214023 883089662
1303.2 883089662 883740783 883164883 881428063 878740013 875542700 872435749 869938254 868532836 868540227
1321.5 868540227 870021880 872885823 876672745 880528390 883803606 886301696 888011694 888832152
1337.8 888832152 888628542 887262702 884565771 880301356 873709619 863225996 846651375 821352720
1354.2 821352720 785913944 742842913 697443545 656057775 626838803 612292647 608826160
1368.4 608826160 613913238 625999272 643411160 662272573 680867970 700658798 722309768
$$ packed form
1258.3E66958845K5133907K4458230K3706079K3213565K3031771K2955358K2459269
1272.6G31917024K1236479J9501626J7410458J5135526J3054192J1226178R609997
1286.8H39091480Q366048P542133O902516O232143N455374M443110L181219J875639
1303.2H83089662O51121n75900j736820k688050l197313l106951k497495j405418P391
1321.5H68540227J481653K863943L786922L855645L275216K498090J709998Q20458
1337.8H88832152k03610j365840k696931m264415o591737j0483623j6574621k5298655
1354.2H21352720l5438776m3071031m5399368m1385770k9218972j4546156l466487
1368.4F08826160N087078J2086034J7411888J8861413J8595397J9790828K1650970
$$ plain form
1382.7 722309768 745791972 772266984 799810112 823255420 842627764 859133661 871206939
1397 871206939 878830433 882986605 884394526 884133101 883013785 881293654 878827691 875570118 871717989
1415.3 871717989 867253363 862225831 857736647 853763878 850005209 847192347 845640004 845669925 847386897
1433.7 847386897 850950003 856172800 861311257 866194129 871036410 875684321 880251288 884392679
1450 884392679 887724102 890491545 893723905 897933662 901761174 905559361 910534024 916233540 921446502
1468.4 921446502 926509738 931965709 936635017 939870119 942315817 944276810 945828140 946927369
1484.7 946927369 947739303 948433220 949133992 949829042 950406671 950720429 950780392 950940847 951383770 951768577
1505.1 951768577 951321602 950737715 950708568 950886130 951075613 951258183 951417506 951432347 951266110 951105773
$$ packed form
1382.7G22309768K3482204K6475012K7543128K3445308J9372344J6505897J2073278
1397H71206939P623494M156172J407921k61425j119316j720131k465963l257573l852129
1415.3H71717989m464626n027532m489184l972769l758669k812862j552343K9921J716972
1433.7H47386897L563106N222797N138457M882872M842281M647911M566967M141391
1450H84392679L331423K767443L232360M209757L827512L798187M974663N699516N212962
1468.4I21446502N063236N455971M669308L235102K445698J960993J551330J099229
1484.7I46927369Q11934O93917P00772O95050N77629L13758N9963J60455M42923L84807
1505.1I51768577m46975n83887k9147J77562J89483J82570J59323J4841j66237j60337
$$ plain form
1525.5 951105773 951101363 951160073 951123834 950991809 951177597 951848328 952287197 951492667 950554669 950154006
1545.9 950154006 949976444 949863195 949901640 950093746 950415790 950502515 949788153 949289918 949055254 948867559
1566.3 948867559 948670506 948178947 947732151 947514474 946874321 945815206 944934368 944030941 943002701
1584.6 943002701 941812754 940441906 938919604 937219381 935277939 933045387 930540800 927699149
1600.9 927699149 924564958 921084464 917158067 912823439 908416271 904350281 900061965 894605935
1617.2 894605935 889688134 885866463 881922722 878274441 875271738 872876883 871469080 870709062
1633.6 870709062 869833410 869075358 869006515 869480252 870430529 871760190 873329401 874921679 877021849
1651.9 877021849 879675508 881753445 883875966 886425316 889238536 891775727 893743515 895424843
$$ packed form
1525.5I51105773m410N8710l6239j32025J85788O70731M38869p94530r37998m00663
1545.9I50154006j77562j13249L8445J92106L22044Q6725p14362m98235k34664j87695
1566.3I48867559j97053m91559m46796k17677o40153j059115q80838r03427j028240
1584.6I43002701j189947j370848j522302j700223j941442k232552k504587k841651
1600.9I27699149l134191l480494l926397m334628m407168m065990m288316n456030
1617.2H94605935m917801l821671l943741l648281l002703k394855j407803p60018
1633.6H70709062q75652p58052o8843M73737R50277J329661J569211J592278K100170
1651.9H77021849K653659K077937K122521K549350K813220K537191J967788J681328
$$ plain form
1668.2 895424843 896799743 897620618 897966027 897537708 896516621 895409167 893829584 890419900 886104405
1686.6 886104405 881891787 876716554 870986998 863281071 853015840 840565681 822504580 803517580
1702.9 803517580 781920493 752639532 719331980 682893336 642721474 598016143 546223164
1717.2 546223164 498811632 465967357 440297872 419551283 406080663 398611903 396111310 398508996
1733.5 398508996 405137002 413176209 423787892 436533481 449569076 463706523 479839146 500499547
1749.8 500499547 526473463 555239022 590109289 632968009 679244518 729681849 776042402
1764.1 776042402 812696695 843422115 868038535 887705863 902116358 911733150 919332266 925967515
1780.4 925967515 931328714 935847461 939705074 942858160 945515156 947996199 950016320 951683402
$$ packed form
1668.2H95424843J374900Q20875L45409m28319j021087j107454j579583l409684m315495
1686.6H86104405m212618n175233n729556p705927j0265231j2450159j8061101j8987000
1702.9H03517580k1597087k9280961l3307552l6438644m0171862m4705331n1792979
1717.2E46223164m7411532l2844275k5669485k0746589j3470620p468760k500593K397686
1733.5C98508996O628006Q039207J0611683J2745589J3035595J4137447J6132623K0660401
1749.8E00499547K5973916K8765559L4870267M2858720M6276509N0437331M6360553
1764.1G76042402L6654293L0725420K4616420J9667328J4410495R616792P599116O635249
1780.4I25967515N361199M518747L857613L153086K656996K481043K020121J667082
$$ plain form
1796.7 951683402 953338861 954823911 956329823 957809269 959170520 960392237 961648703 962796450
1813 962796450 963821530 964831471 965807974 966684163 967479229 968358338 969163775 969894886 970530987 971175790
1833.4 971175790 971792102 972331583 972764075 973118603 973379970 973515034 973727345 973978937 974244893 974454343
1853.8 974454343 974598527 974581003 974506974 974577963 974789143 974972606 975033700 975163341 975342035 975443244
1874.2 975443244 975444615 975449443 975435078 975458920 975592732 975743711 975722611 975638509 975691736 975673676 975622058
1896.6 975622058 975627959 975547194 975303650 975045443 974842310 974730492 974673390 974534035 974335492 974134743
1917 974134743 974030495 973951280 973819673 973682463 973551571 973484933 973525405 973540425 973484218 973428667 973354876
1939.5 973354876 973245978 973189533 973207176 973161817 973088920 973072171 973161399 973297715 973326802 973301232 973371983
$$ packed form
1796.7I51683402J655459J485050J505912J479446J361251J221717J256466J147747
1813I62796450J025080J009941R76503Q76189P95066Q79109Q05437P31111O36101O44803
1833.4I71175790O16312N39481M32492L54528K61367J35064K12311K51592K65956K09450
1853.8I74454343J44184j7524p4029P0989K11180J83463O1094J29641J78694J01209
1874.2I75443244J371M828j4365K3842J33812J50979k1100q4102N3227j8060n1618
1896.6I75622058N901q0765k43544k58207k03133j11818n7102j39355j98543k00749
1917I74134743j04248p9215j31607j37210j30892o6638M0472J5020n6207n5551p3791
1939.5I73354876j08898n6445J7643m5359p2897j6749Q9228J36316K9087k5570P0751
$$ plain form
1961.9 973371983 973501682 973583639 973708749 973886907 974046230 974228919 974422693 974528015 974571824 974637747
1982.3 974637747 974706709 974743068 974742591 974709988 974673152 974684715 974712312 974727869 974732041 974718332 974690676 974622786
2006.8 974622786 974466205 974237502 974032164 973857939 973704398 973624408 973601937 973605514 973620892 973594189 973556340
2029.2 973556340 973567486 973574996 973530054 973478734 973456383 973435223 973425686 973452806 973476827 973474920 973465383 973434031
2053.7 973434031 973356307 973276794 973285258 973318756 973238885 973079562 973011255 973077178 973092675 972960889 972834110
2076.1 972834110 972813010 972763717 972597420 972419739 972283900 972091079 971824646 971610606 971484601 971358716
2096.5 971358716 971176326 970967948 970773816 970603526 970409453 970178068 969991267 969875097 969783604 969701409
2116.9 969701409 969616890 969582796 969608188 969619453 969712973 969830930 969783187 969759583 969937086 970148742 970291018
$$ packed form
1961.9I73371983J29699Q1957J25110J78158J59323J82689J93774J05322M3809O5923
1982.3I74637747O8962L6359m77l2603l6836J1563K7597J5557M172j3709k7656o7890
2006.8I74622786j56581k28703k05338j74225j53541p9990k2471L577J5378k6703l7849
2029.2I73556340J1146P510m4942n1320k2351k1160r537K7120K4021j907r537l1352
2053.7I73434031p7724p9513Q464L3498p9871j59323o8307O5923J5497j31786j26779
2076.1I72834110k1100m9293j66297j77681j35839j92821k66433k14040j26005j25885
2096.5I71358716j82390k08378j94132j70290j94073k31385j86801j16170r1493q2195
2116.9I69701409q4519l4094K5392J1265R3520J17957m7743k3604J77503K11656J42276
$$ plain form
2139.3 970291018 970445812 970651805 970815599 970945716 971165895 971439481 971689284 971907854 972108305 972302556
2159.7 972302556 972529650 972783029 972956896 973044813 973157585 973354042 973603725 973897696 974173307 974328816
2180.1 974328816 974397659 974494219 974628866 974740326 974821150 974887609 974970043 975074708 975203097 975332916
2200.5 975332916 975437284 975518346 975531161 975482345 975452781 975522935 975675344 975795329 975878179 975942194 975957870
2222.9 975957870 975999892 976080835 976124406 976128936 976112008 976090848 976119220 976201713 976263106 976275921 976249754 976187468
2247.4 976187468 976151049 976200223 976272643 976273000 976206422 976185620 976277292 976356506 976324379 976272404 976275802 976262391
2271.9 976262391 976177752 976136208 976214528 976299286 976363242 976517022 976701796 976760507 976740658 976777911 976900220
2294.3 976900220 977081537 977218032 977223575 977222264 977272093 977215588 977083325 977050066 977191329 977471054 977704763
$$ packed form
2139.3I70291018J54794K05993J63794J30117K20179K73586K49803K18570K00451J94251
2159.7I72302556K27094K53379J73867Q7917J12772J96457K49683K93971K75611J55509
2180.1I74328816O8843R6560J34647J11460Q0824O6459Q2434J04665J28389J29819
2200.5I75332916J04368Q1062J2815m8816k9564P0154J52409J19985Q2850O4015J5676
2222.9I75957870M2022Q0943M3571M530j6928k1160K8372Q2493O1393J2815k6167o2286
2247.4I76187468l6419M9174P2420L57o6578k0802R1672P9214l2127n1975L398j3411
2271.9I76262391q4639m1544P8320Q4758O3956J53780J84774N8711j9849L7253J22309
2294.3I76900220J81317J36495N543j311M9829n6505j32263l3259J41263K79725K33709
$$ plain form
2316.7 977704763 977808654 977855682 977919579 978093565 978363514 978620827 978958368 979302227 979399204 979467928
2337.1 979467928 979616523 979517579 979118586 978510857 977930844 977836251 978347600 979038298 979370177 979401052
2357.5 979401052 979223728 979012966 979005039 978889167 978534579 978174686 977871418 977509320 977115154 976834714
2377.9 976834714 976684272 976661146 976795673 977002025 977133751 977196395 977255762 977273405 977196395 976985872
2398.3 976985872 976732314 976621151 976643205 976711929 976784289 976791799 976697505 976558149 976468444 976417720 976389825
2420.7 976389825 976456761 976591170 976644576 976575434 976482034 976433337 976418734 976429045 976449072 976446807 976412296
2443.2 976412296 976387739 976403773 976390362 976307273 976182342 976104259 976095855 976108432 976177871 976208210 976102650
2465.6 976102650 976004839 976023138 976083577 976127386 976156831 976163566 976151347 976172090 976251543 976309657 976337075 976385236
$$ packed form
2316.7I77704763J03891M7028O3897J73986K69949K57313L37541L43859R6977O8724
2337.1I79467928J48595r8944l98993o07729n80013r4593N11349O90698L31879L0875
2357.5I79401052j77324k10762p927j15872l54588l59893l03268l62098l94166k80440
2377.9I76834714j50442k3126J34527K06352J31726O2644N9367J7643p7010k10523
2398.3I76985872k53558j11163K2054O8724P2360P510r4294j39356q9705n0724k7895
2420.7I76389825O6936J34409N3406o9142r3400m8697j4603J0311K0027k265l4511
2443.2I76412296k4557J6034j3411q3089j24931p8083q404J2577O9439L0339j05560
2465.6I76102650r7811J8299O0439M3809K9445O735j2219K0743P9453N8114K7418M8161
$$ plain form
2490.1 976385236 976449072 976518214 976553261 976526380 976526856 976588964 976623893 976660788 976743042 976803720 976801455 976750791
2514.6 976750791 976699948 976705015 976758242 976811409 976825595 976832032 976895571 976913810 976858020 976864040 976926565 977006316
2539 977006316 977092624 977101564 977009416 976937413 976923823 976851821 976749539 976770341 976859093 976840973 976740241 976675034
2563.5 976675034 976605535 976520538 976479292 976465046 976474762 976455808 976378858 976321459 976297915 976281464 976302207 976339996
2588 976339996 976261735 976111472 976039231 975999057 975913942 975819528 975763917 975713670 975659192 975613534 975597978 975625277
2612.4 975625277 975588202 975494087 975451350 975403130 975327551 975321293 975270271 975041986 974791348 974634945 974577367
2634.9 974577367 974574268 974556744 974588335 974653482 974662900 974648833 974672973 974708796 974700570 974755704 974916518 974963248
2659.3 974963248 974825144 974681377 974613428 974576175 974562645 974569857 974562645 974610150 974720061 974707186 974580050
$$ packed form
2490.1I76385236O3836O9142L5047k6881M76O2108L4929L6895Q2254O0678k265n0664
2514.6I76750791n0843N067N3227N3167J4186O437O3539J8239n5790O020O2525P9751
2539I77006316Q6308Q940r2148p2003j3590p2002j02282K0802Q8752j8120j00732o5207
2563.5I76675034o9499q4997m1246j4246R716j8954p6950n7399k3544j6451K0743L7789
2588I76339996p8261j50263p2241m0174q5115r4414n5611n0247n4478m5658j5556K7299
2612.4I75625277l7075r4115m2737m8220p5579o258n1022k28285k50638j56403n7578
2634.9I74577367l099j7524L1591O5147R418j4067K4140L5823q226N5134J60814M6730
2659.3I74963248j38104j43767o7949l7253j3530P212p212M7505J09911j2875j27136
$$ plain form
2681.8 974580050 974487722 974425912 974410653 974443257 974396169 974274158 974180102 974143028 974151433 974131525 974088967
2704.2 974088967 974027514 973863482 973653555 973509550 973444581 973419905 973355651 973238230 973159611 973136187 973114610
2726.6 973114610 973053098 972976565 972952306 972952664 972974241 973078489 973184824 973216772 973233163 973208129 973171175
2749.1 973171175 973244667 973371446 973398685 973320663 973299026 973370194 973417759 973387241 973316193 973240554 973146975
2771.5 973146975 973032653 972919106 972862601 972844601 972788453 972730875 972670913 972528815 972286463 972027242
2791.9 972027242 971890450 971825540 971698880 971544325 971364915 971159995 971014023 970865488 970686138 970632792
2812.3 970632792 970625520 970466852 970241368 970023096 969805598 969617724 969426215 969271183 969147503 968931735
2832.7 968931735 968587399 968121171 967593968 967047989 966376543 965482771 964447558 963480830 962659001
$$ packed form
2681.8I74580050r2328o1810j5259L2604m7088j22011r4056l7074Q405j9908m2558
2704.2I74088967o1453j64032k09927j44005o4969k4676o4254j17421p8619k3424k1577
2726.6I73114610o1512p6533k4259L58K1577J04248J06335L1948J6391k5034l6954
2749.1I73171175P3492J26779K7239p8022k1637P1168M7565l0518p1048p5639r3579
2771.5I73146975j14322j13547n6505j8000n6148n7578n9962j42098k42352k59221
2791.9I72027242j36792o4910j26660j54555j79410k04920j45972j48535j79350n3346
2812.3I70632792p272j58668k25484k18272k17498j87874j91509j55032j23680k15768
2832.7I68931735l44336m66228n27203n45979o71446q93772j035213r66728q21829
$$ plain form
2851 962659001 961927176 961238861 960493326 959666550 958828032 957978010 957095146 956219792 955372751 954476237
2871.4 954476237 953573585 952791333 952114284 951518297 950998485 950516522 950138748 949896097 949729919 949703813
2891.8 949703813 949778557 949837148 949955523 950224578 950566113 950827181 951012671 951162577 951174378 950990617
2912.2 950990617 950670719 950291872 949920237 949589014 949292958 949014246 948713124 948265433 947588146 946712077
2932.6 946712077 945651114 944639325 944020152 943749666 943701267 943891406 944118083 944284379 944547534
2951 944547534 944743633 944675207 944448769 944238722 944263816 944685936 945611238 947166800 949187636 951268971
2971.4 951268971 953154683 954704940 955969155 957094431 958043993 958734870 959201813 959585488 959980071
2989.7 959980071 960371792 960782290 961233020 961637795 961971879 962366998 962854981 963253915 963495672 963696361
$$ packed form
2851I62659001p31825o88315p45535q26776q38518q50022q82864q75354q47041q96514
2871.4I54476237r02652p82252o77049n95987n19812m81963l77774k42651j66178k6106
2891.8I49703813P4744N8591J18375K69055L41535K61068J85490J49906J1801j83761
2912.2I50990617l19898l78847l71635l31223k96056k78712l01122m47691o77287q76069
2932.6I46712077j060963j011789o19173k70486m8399J90139K26677J66296K63155
2951I44547534J96099o8426k26438k10047K5094M22120R25302J555562K020836K081335
2971.4I51268971J885712J550257J264215J125276R49562O90877M66943L83675L94583
2989.7I59980071L91721M10498M50730M04775L34084L95119M87983L98934K41757K00689
$$ plain form
3010.1 963696361 963865459 964023948 964190125 964301288 964412034 964490414 964484811 964577079 964874148 965303898
3030.5 965303898 965738952 966003537 966095328 966167510 966337442 966628313 966883540 967011511 967064500 967073083
3050.9 967073083 967069030 967012167 966900289 966867089 966970742 967098176 967114687 966994584 966856062 966823220 966818392
3073.3 966818392 966750741 966658771 966573596 966484070 966372371 966329455 966309845 966119945 965840459 965646386 965625703
3095.8 965625703 965745568 965739965 965463281 965106785 964855075 964702368 964587569 964504480 964460492 964383423
3116.2 964383423 964172542 963848591 963585794 963439167 963338137 963300109 963272512 963066757 962669075 962334335
3136.5 962334335 962139189 961892426 961585462 961426914 961347997 961071849 960661292 960329294 960099459 959899962
3156.9 959899962 959622979 959245443 958869278 958553493 958281755 957983196 957578540 957133770 956820905 956619143
$$ packed form
3010.1I63696361J69098J58489J66177J11163J10746P8380n603R2268K97069M29750
3030.5I65303898M35054K64585R1791P2182J69932K90871K55227J27971N2989Q583
3050.9I67073083m053n6863j11878l3200J03653J27434J6511j20103j38522l2842m828
3073.3I66818392o7651r1970q5175q9526j11699m2916j9610j89900k79486j94073k0683
3095.8I65625703J19865n603k76684l56496k51710j52707j14799q3089m3988p7069
3116.2I64383423k10881l23951k62797j46627j01030l8028k7597k05755l97682l34740
3136.5I62334335j95146k46763l06964j58548p8917k76148m10557l31998k29835j99497
3156.9I59899962k76983l77536l76165l15785k71738k98559m04656m44770l12865k01762
$$ plain form
3177.3 956619143 956401169 956127584 955669522 955068946 954566479 954179108 953844130 953543663 953175783 952705383
3197.7 952705383 952265441 951936603 951617956 951223910 950853765 950514734 950101793 949672759 949255943 948799908
3218.1 948799908 948362470 947998822 947674930 947314501 946880937 946483254 946206748 945989490 945725858 945334196
3238.5 945334196 944903374 944591999 944372356 944111645 943763733 943357348 942988634 942765713 942562401 942201555
3258.9 942201555 941830099 941596329 941371143 941061437 940720677 940507531 940490425 940330684 939935625 939675927
3279.3 939675927 939576924 939409494 939065218 938571274 938142776 937915921 937789321 937702060 937621772 937426388
3299.7 937426388 937113345 936805367 936594188 936359048 935955226 935542405 935222208 934885502 934535325 934189439
3320.1 934189439 933737516 933262169 932870448 932490110 932190776 931898773 931447625 930931151 930364788 929704010
$$ packed form
3177.3I56619143k17974k73585m58062o00576n02467l87371l34978l00467l67880m70400
3197.7I52705383m39942l28838l18647l94046l70145l39031m12941m29034m16816m56035
3218.1I48799908m37438l63648l23892l60429m33564l97683k76506k17258k63632l91662
3238.5I45334196m30822l11375k19643k60711l47912m06385l68714k22921k03312l60846
3258.9I42201555l71456k33770k25186l09706l40760k13146j7106j59741l95059k59698
3279.3I39675927r9003j67430l44276m93944m28498k26855j26600q7261q0288j95384
3299.7I37426388l13043l07978k11179k35140m03822m12821l20197l36706l50177l45886
3320.1I34189439m51923m75347l91721l80338k99334k92003m51148n16474n66363o60778
$$ plain form
3340.5 929704010 929128945 928771555 928482771 928132534 927747011 927405477 927123010 926762223 926159620 925380707
3360.9 925380707 924690902 924126863 923566282 923032999 922587693 922171056 921667218 921134949 920714736 920388281
3381.3 920388281 920027316 919535041 918917239 918359101 918003857 917687118 917267919 916868687 916547596 916227460
3401.7 916227460 915923774 915684044 915473402 915121019 914559782 914081037 913839638 913559973 913077116 912656844
3422 912656844 912506938 912404716 912121952 911766768 911426365 911037266 910681427 910461783 910301030 910123169
3442.4 910123169 909949720 909812093 909784615 909727097 909476519 909217060 909068942 908984661 908897042 908805013
3462.8 908805013 908737361 908731401 908832312 908858180 908729553 908641458 908696711 908836484 908971906 909031987 909121394
3485.3 909121394 909377396 909757912 910141349 910423100 910724223 911097229 911298573 911314845 911536336 912074327
$$ packed form
3340.5I29704010n75065l57390k88784l50237l85523l41534k82467l60787o02603p78913
3360.9I25380707o89805n64039n60581n33283m45306m16637n03838n32269m20213l26455
3381.3I20388281l60965m92275o17802n58138l55244l16739m19199l99232l21091l20136
3401.7I16227460l03686k39730k10642l52383n61237m78745k41399k79665m82857m20272
3422I12656844j49906j02222k82764l55184l40403l89099l55839k19644j60753j77861
3442.4I10123169j73449j37627k7478n7518k50578k59459j48118q4281q7619r2029
3462.8I08805013o7652n960J00911K5868j28627q8095N5253J39773J35422O0081Q9407
3485.3I09121394K56002L80516L83437K81751L01123L73006K01344J6272K21491N37991
$$ plain form
3505.7 912074327 912620902 913158476 913755774 914182663 914323270 914361894 914471805 914747775 915175617 915597498
3526.1 915597498 915999949 916465938 916928351 917295098 917616785 917904198 918071389 918225229 918596148 919187307
3546.4 919187307 919776976 920243800 920756638 921415687 921963215 922271550 922544181 922828972 922923326 923038185
3566.8 923038185 923600912 924445271 925239742 925750375 925937831 926198006 926854551 927531898 927804768 928031564
3587.2 928031564 928693056 929347336 929659486 930078506 930806935 931471765 932079256 932755291 933302224 933687747
3607.6 933687747 934106231 934612811 935230792 936121643 937212467 938190877 939032912 940038323 941269100
3626 941269100 942485929 943532586 944616556 945889831 947263181 948687255 950151682 951654017 953229070
3644.3 953229070 954831421 956458330 958075881 959540009 960913777 962279916 963575006 964894772
$$ packed form
3505.7I12074327N46575N37574N97298M26889J40607L8624J09911K75970M27842M21881
3526.1I15597498M02451M65989M62413L66747L21687K87413J67191J53840L70919N91159
3546.4I19187307N89669M66824N12838O59049N47528L08335K72631K84791R4354J14859
3566.8I23038185N62727Q44359P94471N10633J87456K60175O56545O77347K72870K26796
3587.2I28031564O61492O54280L12150M19020P28429O64830O07491O76035N46933L85523
3607.6I33687747M18484N06580O17981Q90851J090824R78410Q42035J005411J230777
3626I41269100J216829J046657J083970J273275J373350J424074J464427J502335J575053
3644.3I53229070J602351J626909J617551J464128J373768J366139J295090J319766
$$ plain form
3660.6 964894772 966251612 967582822 968932688 970189452 971261263 972216070 973014832 973741829 974567056
3679 974567056 975294828 975854576 976366580 976780832 977015257 977183402 977492571 977993786 978523374 978901505
3699.4 978901505 978997827 978944242 979127407 979547620 979815543 979614854 979342937 979313493 979301453 979214847
3719.8 979214847 979110241 979001760 978973925 979195476 979594827 979827821 979623020 979339480 979481220 979926944
3740.2 979926944 980277956 980194569 980019987 980041087 979889870 979607880 979619980 979800701 979823887 979753196
3760.6 979753196 979868948 980168402 980461478 980472982 980225146 980104029 980189204 980343401 980364978 980243683
3781 980243683 980191708 980094194 979951739 979945481 980085909 980344236 980565667 980706394 980834842 980718493 980541885
3803.4 980541885 980460465 980165601 980025530 980304956 980648100 980767608 980738223 980527282 980044246 979818940
$$ packed form
3660.6I64894772J356840J331210J349866J256764J071811R54807P98762P26997Q25227
3679I74567056P27772N59748N12004M14252K34425J68145L09169N01215N29588L78131
3699.4I78901505R6322n3585J83165M20213K67923k00689k71917k9444j2040q6606
3719.8I79214847j04606j08481k7835K21551L99351K32994k04801k83540J41740M45724
3740.2I79926944L51012q3387j74582K1100j51217k81990J2100J80721K3186p0691
3760.6I79753196J15752K99454K93076J1504k47836j21117Q5175J54197K1577j21295
3781I80243683n1975r7514j42455o258J40428K58327K21431J40727J28448j16349j76608
3803.4I80541885q1420k94864j40071K79426L43144J19508k9385k10941m83036k25306
$$ plain form
3823.8 979818940 979887128 979943037 980030119 980251193 980631113 980876565 980625033 980336368 980392814 980441928
3844.2 980441928 980277300 980198503 980432451 980337441 979523301 979262888 979563773 979874611 979928970 979709804
3864.6 979709804 979604065 979680002 979680419 979635775 979671896 979848683 979909122 979686499 979522645 979404867 979286671
3887 979286671 979317963 979339063 979268134 979238391 979256213 979189157 979108870 979176164 979300141 979392588 979467750 979540467
3911.5 979540467 979468644 979176044 978882849 978818417 978939831 979014754 979005814 979009151 979007959 979020655 979036093
3933.9 979036093 978989959 979024291 979115307 978908777 978677869 978885591 979112983 979018331 978889585 978821278
3954.3 978821278 978804827 978910327 979059994 979215205 979232013 979086459 979085624 979216278 979159415 978934228 978793502
3976.7 978793502 978790998 978777051 978729308 978856146 979080498 979032636 978778183 978719473 978861511 978998661
$$ packed form
3823.8I79818940O8188N5909Q7082K21074L79920K45452k51532k88665N6446M9114
3844.2I80441928j64628p8797K33948r5010q14140k60413L00885L10838N4359k19166
3864.6I79709804j05739P5937M17m4644L6121J76787O0439k22623j63854j17778j18196
3887I79286671L1292K1100p0929k9743J7822o7056q0287O7294J23977R2447P5162P2717
3911.5I79540467p1823k92600k93195o4432J21414P4923q940L337j192J2696J5438
3933.9I79036093m6134L4332R1016k06530k30908K07722K27392r4652j28746o8307
3954.3I78821278j6451J05500J49667J55211J6808j45554q35J30654n6863k25187j40726
3976.7I78793502k504j3947m7743J26838K24352m7862k54453n8710J42038J37150
$$ plain form
3997.1 978998661
$$ packed form
3997.1I78998661
##END=$$ End of the data block
