##TITLE=Rachel - Amostra 2 $$ Begin of the data block
##JCAMP-DX=5.00 $$ ACD/SpecManager v 10.08
##SPECTROMETER/DATA SYSTEM=Alpha
##DATE=21 May 2015 14:09:38
##DATA TYPE=INFRARED SPECTRUM
##DATA CLASS=XYDATA
##ORIGIN=
##OWNER=
##NPOINTS=1667
##FIRSTX=599.57470703
##LASTX=3997.16503906
##MAXX=3997.16503906
##MINX=599.57470703
##MAXY=0.98116553
##MINY=0.14826037
##XFACTOR=1.0000000000
##YFACTOR=1.000000000000000e-9
##FIRSTY=0.45846820
##DELTAX=2.03937006
##XUNITS=1/CM
##YUNITS=ARBITRARY UNITS
##XYDATA=(X++(Y..Y))
$$ plain form
599.6 458468199 456195921 462348282 476871669 498349786 523030519 545311868 562024295 573506951
615.9 573506951 582008064 589855552 597727776 606025815 614790440 623211145 630492270 636589766
632.2 636589766 641615510 645236313 647448063 649103761 651238799 655024350 661527932 669662058
648.5 669662058 676545978 680854619 683635414 686748564 691867292 698678017 705085397 709814012
664.8 709814012 713908434 717752874 719257891 719168127 718903959 719644845 721524656 723466218 724600375
683.2 724600375 724787056 724730611 725906372 729429841 735096097 741608977 747655153 752902269 757530451
701.5 757530451 761503994 765175641 769157410 773201346 776582301 779123604 781285226 783851147
717.9 783851147 787301719 791675627 796827793 802287161 807393074 812035918 816347063 820242107
$$ packed form
599.6D58468199k272278O152361J4523387K1478117K4680733K2281349J6712427J1482656
615.9E73506951Q501113P847488P872224Q298039Q764625Q420705P281125O097496
632.2F36589766N025744L620803K211750J655698K135038L785551O503582Q134126
648.5F69662058O883920M308641K780795L113150N118728O810725O407380M728615
664.8G09814012M094422L844440J505017q9764k64168P40886J879811J941562J134157
683.2G24600375J86681n6445J175761L523469N666256O512880O046176N247116M628182
701.5G57530451L973543L671647L981769M043936L380955K541303K161622K565921
717.9G83851147L450572M373908N152166N459368N105913M642844M311145L895044
$$ plain form
734.2 820242107 823645353 826435626 828647912 830440521 832016289 833583415 835171103 836717367
750.5 836717367 838293493 840000033 841765523 843316436 844512224 845612764 846864760 848248184
766.8 848248184 849617839 850901902 852164388 853526294 854774415 855668724 856527925 857607007 858698010
785.2 858698010 859600902 860354125 861043930 861730456 862286270 862611413 862914562 863389730 863919497 864254415
805.6 864254415 864459336 864734232 864945471 864982903 864964366 864857793 864515662 863699555 862364709 860564232
825.9 860564232 857995570 854551911 850695789 847089767 844376922 843110204 843460977 845137000 847503304
844.3 847503304 849897087 851874709 853148103 853621304 853242874 851723373 848780453 844353497 838169932
862.7 838169932 829559863 817736924 802488983 785111666 768623114 756259263 749242961 746371210
$$ packed form
734.2H20242107L403246K790273K212286J792609J575768J567126J587688J546264
750.5H36717367J576126J706540J765490J550913J195788J100540J251996J383424
766.8H48248184J369655J284063J262486J361906J248121Q94309Q59201J079082J091003
785.2H58698010R02892P53223O89805O86526N55814L25143L03149M75168N29767L34918
805.6H64254415K04921K74896K11239L7432j8537j06573l42131q16107j334846j800477
825.9H60564232k568662l443659l856122l606022k712845j266718L50773J676023K366304
844.3H47503304K393783J977622J273394M73201l78430j519501k942920m426956o183565
862.7H38169932q610069j1822939j5247941j7377317j6488552j2363851p016302k871751
$$ plain form
879 746371210 745180666 743068218 738071322 729095459 715539455 697102845 674118400 648385286
895.3 648385286 623788059 605076969 595381439 594931662 601885498 614308715 631035388 650513828
911.6 650513828 670099676 687350512 701472044 713219523 723817647 734144092 744527102
925.9 744527102 754619777 763528824 770532310 775311887 777770102 777998984 776170611 772444546
942.2 772444546 766903520 759791136 751705348 743612111 736674368 731682539 728748441 726887882
958.5 726887882 723756313 716582894 703322947 683339179 657835722 629479408 601075530 574521244
974.8 574521244 550625801 529436648 510855734 494672835 480375737 467562586 456020087
989.1 456020087 445201486 433686256 419520438 401446462 379616290 355165035 329589069
$$ packed form
879G46371210j190544k112448m996896q975863j3556004j8436610k2984445k5733114
895.3F48385286k4597227j8711090r695530m49777O953836J2423217J6726673J9478440
911.6F50513828J9585848J7250836J4121532J1747479J0598124J0326445J0383010
925.9G44527102J0092675Q909047P003486M779577K458215K28882j828373l726065
942.2G72444546n541026p112384q085788q093237o937743m991829k934098j860559
958.5G26887882l131569p173419j3259947j9983768k5503457k8356314k8403878k6554286
974.8E74521244k3895443k1189153j8580914j6182899j4297098j2813151j1542499
989.1D56020087j0818601j1515230j4165818j8073976k1830172k4451255k5575966
$$ plain form
1003.4 329589069 304264247 280002028 257269233 236394510 217490569 200578064 185742706
1017.6 185742706 173146591 163058311 155631438 150710255 148260370 148666382 152429551 159546912
1034 159546912 169171393 179849342 190427303 200659931 211144716 222835153 236453503 252413779
1050.3 252413779 270676881 290624261 311353922 331854582 350779921 366840810 379699051
1064.6 379699051 390185177 399708956 409487963 420098245 431477875 443447053 455981255 469209433
1080.9 469209433 483467221 499344558 517534256 538367629 561411321 585338593 608247459
1095.1 608247459 628207445 643861473 654719234 661126614 664046526 664280951 662212551 658372104
1111.5 658372104 653558373 648445427 643478990 639354467 637509108 639599681 646315873 657058954
$$ packed form
1003.4C29589069k5324822k4262219k2732795k0874723j8903941j6912505j4835358
1017.6A85742706j2596115j0088280p426873m921183k449885M06012L763169P117361
1034A59546912R624481J0677949J0577961J0232628J0484785J1690437J3618350J5960276
1050.3B52413779J8263102J9947380K0729661K0500660J8925339J6060889J2858241
1064.6C79699051J0486126R523779R779007J0610282J1379630J1969178J2534202J3228178
1080.9D69209433J4257788J5877337J8189698K0833373K3043692K3927272K2908866
1095.1F08247459J9959986J5654028J0857761O407380K919912K34425k068400l840447
1111.5F58372104m813731n112946m966437m124523j845359K090573O716192J0743081
$$ plain form
1127.8 657058954 670448601 684640348 697723031 708415270 716217577 721047461 722841501 721124828
1144.1 721124828 715202808 704976976 691330254 676096976 661680043 650233030 643002510 640157819
1160.4 640157819 641191065 645470917 652496576 661901653 673199356 685685396 698695660 711433470
1176.7 711433470 722796738 731621265 736662090 736479282 729726553 715186536 691380739 656843960
1193 656843960 610792994 553860009 488975525 421530128 358363271 305536747 266173959 240153044
1209.4 240153044 225222871 218313724 216795847 218953073 223454803 229035079 234692097 240142718
1225.7 240142718 246032476 253622204 264068335 278156608 296054542 317073852 340192378 364464790
1242 364464790 389298648 414600581 440437138 466629148 492924869 519170225 545232177 570987284
$$ packed form
1127.8F57058954J3389647J4191747J3082683J0692239P802307M829884J794040j716673
1144.1G21124828n922020j0225832j3646722j5233278j4416933j1447013p230520k844691
1160.4F40157819J033246M279852P025659R405077J1297703J2486040J3010264J2737810
1176.7G11433470J1363268Q824527N040825j82808o752729j4540017k3805797l4536779
1193F56843960m6050966n6932985o4884484o7445397o3166857n2826524l9362788k6020915
1209.4B40153044j4930173o909147j517877K157226M501730N580276N657018N450621
1225.7B40142718N889758P589728J0446131J4088273J7897934K1019310K3118526K4272412
1242C64464790K4833858K5301933K5836557K6192010K6295721K6245356K6061952K5755107
$$ plain form
1258.3 570987284 596237421 620660007 644153118 667071521 689958274 713061452 735849738
1272.6 735849738 757395983 777101398 794692278 810026169 823162854 834325373 843758643
1286.8 843758643 851848781 859208167 866144240 872490585 877959311 882258654 885317385 887213528
1303.2 887213528 887912631 887342095 885607660 882961035 879758477 876548171 873916090 872400463 872375369
1321.5 872375369 873863161 876749694 880586863 884504318 887850761 890413761 892267227 893314242
1337.8 893314242 893202364 891757607 888945103 884626269 878166497 867917180 851475716 826198757
1354.2 826198757 790685713 747518837 702281356 661438823 632818460 618613243 615153134
1368.4 615153134 619991601 631878912 649319470 668271899 686796129 706334054 727630496
$$ packed form
1258.3E70987284K5250137K4422586K3493111K2918403K2886753K3103178K2788286
1272.6G35849738K1546245J9705415J7590880J5333891J3136685J1162519R433270
1286.8H43758643Q090138P359386O936073O346345N468726M299343L058731J896143
1303.2H87213528O99103n70536j734435k646625l202558l210306k632081j515627k5094
1321.5H72375369J487792K886533L837169L917455L346443K563000J853466J047015
1337.8H93314242j11878j444757k812504m318834o459772j0249317j6441464k5276959
1354.2H26198757l5513044m3166876m5237481m0842533k8620363j4205217l460109
1368.4F15153134M838467J1887311J7440558J8952429J8524230J9537925K1296442
$$ plain form
1382.7 727630496 750744998 776951969 804397643 827932417 847505748 864126921 876096904
1397 876096904 883435786 887298405 888584018 888330579 887227654 885516226 883040905 879720092 875786126
1415.3 875786126 871225178 866023064 861338317 857230783 853405476 850609124 849223435 849540830
1431.6 849540830 851456344 855087042 860298276 865323663 870066345 874829948 879528701 884268999
1448 884268999 888519347 891815484 894505024 897624671 901575327 905135274 908720732 913498521 919063449
1466.3 919063449 924136341 929010808 934341550 939052582 942383051 944865882 946828961 948373616
1482.6 948373616 949464023 950278759 950937390 951529860 952108264 952636600 953024387 953149378 953247428 953577459
1503 953577459 953928292 953701019 953320622 953327060 953520536 953682184 953826606 954037309 954103172 953933895
$$ packed form
1382.7G27630496K3114502K6206971K7445674K3534774J9573331J6621173J1969983
1397H76096904P338882L862619J285613k53439j102925j711428k475321l320813l933966
1415.3H75786126m560948n202114m684747m107534l825307k796352j385689L17395
1431.6H49540830J915514L630698N211234N025387M742682M763603M698753M740298
1448H84268999M250348L296137K689540L119647L950656L559947L585458M777789N564928
1466.3I19063449N072892M874467N330742M711032L330469K482831J963079J544655
1482.6I48373616J090407Q14736O58631N92470N78404N28336L87787J24991R8050L30031
1503I53577459L50833k27273l80397O438J93476J61648J44422K10703O5863j69277
$$ plain form
1523.4 953933895 953752220 953667760 953663111 953674436 953632891 953766763 954130471 954194129 953552425 952985168 952768803
1545.9 952768803 952720046 952696621 952713668 952832222 953022182 953006148 952417910 952035308 951875508 951728404
1566.3 951728404 951493442 951006651 950627267 950426877 949809015 948829234 948022664 947210073 946255028 945080936
1586.6 945080936 943741679 942323089 940701544 938763559 936568797 934151113 931389272 928291738
1603 928291738 924828053 920979917 916776359 912458777 908378720 904025376 898682117 894044876 890403330
1621.3 890403330 886546373 882992387 880113721 877820313 876386881 875521421 874654591 874042094 874061644
1639.7 874061644 874559045 875466347 876653373 878109753 879654229 881655812 884349406 886634767 888878882
1658 888878882 891459882 894236624 896721840 898653567 900345743 901882231 902854025 903236091 902939320
$$ packed form
1523.4I53933895j81675q4460m649J1325m1545J33872L63708O3658o41704n67257k16365
1545.9I52768803m8757k3425J7047J18554J89960j6034n88238l82602j59800j47104
1566.3I51728404k34962m86791l79384k00390o17862r79781q06570q12591r55045j174092
1586.6I45080936j339257j418590j621545j937985k194762k417684k761841l097534
1603I28291738l463685l848136m203558m317582m080057m353344n343259m637241l641546
1621.3H90403330l856957l553986k878666k293408j433432q65460q66830o12497J9550
1639.7H74061644M97401R07302J187026J456380J544476K001583K693594K285361K244115
1658H88878882K581000K776742K485216J931727J692176J536488R71794L82066k96771
$$ plain form
1676.4 902939320 902123451 901125789 899578691 896271884 892113686 888008535 883003950 877521873 870111883
1694.7 870111883 860176921 848109782 830689311 812317848 791218281 762480974 729671061
1709 729671061 693652987 653799057 609302104 557628572 510117114 476975352 450912625 429709136
1725.3 429709136 415861607 408215821 405625463 407865226 414299011 422160923 432547987 444885164
1741.6 444885164 457180083 470328301 485456228 505160987 530243576 558377147 593009353
1755.9 593009353 635950089 682503760 733333290 779986799 816758692 847427011 871806741
1770.2 871806741 891243100 905518353 914995670 922456443 928983033 934230745 938599765 942302048
1786.5 942302048 945351958 947897553 950169921 951985180 953508854 955044210 956479013 957944393
$$ packed form
1676.4I02939320q15869r97662j547098l306807m158198m105151n004585n482077p409990
1694.7H70111883r934962j2067139j7420471j8371463k1099567k8737307l2809913
1709G29671061l6018074l9853930m4496953n1673532m7511458l3141762k6062727k1203489
1725.3D29709136j3847529p645786k590358K239763O433785P861912J0387064J2337177
1741.6D44885164J2294919J3148218J5127927J9704759K5082589K8133571L4632206
1755.9E93009353M2940736M6553671N0829530M6653509L6771893L0668319K4379730
1770.2H71806741J9436359J4275253R477317P460773O526590N247712M369020L702283
1786.5I42302048L049910K545595K272368J815259J523674J535356J434803J465380
$$ plain form
1802.8 957944393 959315658 960633218 961908877 963184416 964333117 965355575 966238081 967098355 968041003
1821.2 968041003 968908548 969779909 970625758 971411288 972018480 972594798 973121464 973595202 974020481 974326015
1841.6 974326015 974540174 974745095 975015998 975191414 975338995 975559831 975840986 975930929 975830078 975809813
1862 975809813 975984931 976199329 976303756 976395667 976488411 976567447 976583898 976606846 976633072 976665497 976734459
1884.4 976734459 976839900 976879001 976848364 976897955 976947069 976949692 976868153 976705432 976501107 976300657 976079762
1906.8 976079762 975883961 975761414 975660563 975517392 975264966 975052238 974971771 974965155 974920511 974810004
1927.2 974810004 974700212 974646807 974601567 974510372 974440098 974385023 974298775 974243462 974261284 974257767 974230528
1949.7 974230528 974207342 974236488 974336326 974407434 974400342 974434674 974574685 974687696 974801421 974972725 975134730
$$ packed form
1802.8I57944393J371265J317560J275659J275539J148701J022458Q82506Q60274R42648
1821.2I68041003Q67545Q71361Q45849P85530O07192N76318N26666M73738M25279L05534
1841.6I74326015K14159K04921K70903J75416J47581K20836K81155Q9943j00851k0265
1862I75809813J75118K14398J04427R1911R2744P9036J6451K2948K6226L2425O8962
1884.4I76734459J05441L9101l0637M9591M9114K623q1539j62721k04325k00450k20895
1906.8I76079762j95801j22547j00851j43171k52426k12728q0467o616m4644j10507
1927.2I74810004j09792n3405m5240r1195p0274n5075q6248n5313J7822l517k7239
1949.7I74230528k3186K9146R9838P1108p092L4332J40011J13011J13725J71304J62005
$$ plain form
1972.1 975134730 975296676 975489438 975637019 975729585 975802124 975785315 975728393 975753725 975799501 975779414 975760639
1994.5 975760639 975749791 975731552 975749433 975771010 975714743 975609064 975518644 975385785 975183487 974962413 974785686
2017 974785686 974702716 974677801 974665344 974649072 974608481 974588871 974610388 974608302 974577963 974577188 974592686 974572361
2041.4 974572361 974554181 974562228 974560857 974560559 974546194 974505126 974465311 974384725 974292159 974278688 974299073 974280477
2065.9 974280477 974274576 974287331 974205852 974045694 973959923 973946393 973846555 973661363 973509669 973388612 973232388
2088.3 973232388 973036408 972837210 972637355 972433329 972264528 972122788 971943438 971721530 971492231 971261203
2108.7 971261203 971036375 970880330 970840693 970878005 970861018 970806122 970804513 970799625 970792413 970775902 970773220 970899224
2133.2 970899224 971131921 971343458 971474111 971576512 971709967 971850038 972007573 972209632 972405553 972624362
$$ packed form
1972.1I75134730J61946J92762J47581R2566P2539j6809n6922K5332M5776k0087j8775
1994.5I75760639j0848j8239J7881K1577n6267j05679r0420j32859k02298k21074j76727
2017I74785686q2970k4915j2457j6272m0591j9610K1517k086l0339p75J5498k0325
2041.4I74572361j8180Q047j371k98j4365m1068l9815q0586r2566j3471K0385j8596
2065.9I74280477n901J2755q1479j60158q5771j3530r9838j85192j51694j21057j56224
2088.3I73232388j95980j99198j99855k04026j68801j41740j79350k21908k29299k31028
2108.7I71261203k24828j56045l9637L7312j6987n4896j609m888p212j6511k682J26004
2133.2I70899224K32697K11537J30653J02401J33455J40071J57535K02059J95921K18809
$$ plain form
2153.6 972624362 972909272 973172367 973308206 973394811 973542869 973742843 973983824 974244714 974536061 974855304
2174 974855304 975122392 975250065 975290120 975370884 975494444 975582480 975637913 975734234 975880384 976033270 976132870
2196.4 976132870 976153672 976148069 976219893 976354778 976411402 976398170 976413727 976459205 976560414 976754963 976921558
2218.9 976921558 976983607 977019668 977086246 977164805 977208138 977188051 977108300 977072358 977161407 977224588 977166951
2241.3 977166951 977152944 977231026 977263808 977236152 977222502 977217615 977174282 977101803 977118254 977257907 977331400
2263.7 977331400 977271438 977193773 977146387 977137864 977163970 977225304 977297962 977334201 977368653 977440655 977558374
2286.2 977558374 977685273 977760255 977828145 977955520 978096366 978189290 978224337 978234351 978281081 978306353 978237092
2308.6 978237092 978179514 978264868 978477478 978704095 978818178 978748083 978641629 978694439 978846848 979013503
$$ packed form
2153.6I72624362K84910K63095J35839Q6605J48058J99974K40981K60890K91347L19243
2174I74855304K67088J27673M0055Q0764J23560Q8036N5433R6321J46150J52886R9600
2196.4I76132870K0802n603P1824J34885N6624j3232J5557M5478J01209J94549J66595
2218.9I76921558O2049L6061O6578P8559M3333k0087p9751l5942Q9049O3181n7637
2241.3I77166951j4007P8082L2782k7656j3650m887m3333p2479J6451J39653P3493
2263.7I77331400n9962p7665m7386q523K6106O1334P2658L6239L4452P2002J17719
2286.2I77558374J26899P4982O7890J27375J40846R2924L5047J0014M6730K5272o9261
2308.6I78237092n7578Q5354K12610K26617J14083p0095j06454N2810J52409J66655
$$ plain form
2329 979013503 979332924 979676127 979704857 979587793 979577005 979583502 979512215 979252934 978863776 978691995 978849232
2351.4 978849232 979041934 979088366 979241252 979359627 979173958 978844225 978572547 978493929 978494048 978363454
2371.8 978363454 978182912 978041291 977893710 977757752 977723420 977850318 978040457 978168607 978240192 978271842
2392.2 978271842 978264153 978181362 977968752 977722704 977576613 977527261 977553010 977587163 977541208 977440953 977371037
2414.6 977371037 977378488 977421939 977453232 977493763 977544725 977544069 977491856 977444053 977443397 977487147 977517009 977503717
2439.1 977503717 977474093 977451026 977457941 977496624 977463841 977313042 977157950 977134466 977165043 977126360 977120340
2461.5 977120340 977148652 977115929 977067232 977062106 977070689 977055550 977042079 977076471 977152169 977227569 977277458 977267742
2486 977267742 977208853 977199733 977298439 977403939 977434456 977431536 977456570 977512360 977562368 977631032 977695048 977712572
$$ packed form
2329I79013503L19421L43203K8730j17064j0788O497p1287k59281l89158j71781J57237
2351.4I78849232J92702M6432J52886J18375j85669l29733k71678p8618J19j30594
2371.8I78363454j80542j41621j47581j35958l4332J26898J90139J28150P1585L1650
2392.2I78271842p689q2791k12610k46048j46091m9352K5749L4153m5955j00255o9916
2414.6I77371037P451M3451L1293M0531N0962o56n2213m7803o56M3750K9862j3292
2439.1I77503717k9624k3067O915L8683l2783j50799j55092k3484L0577l8683o020
2461.5I77120340K8312l2723m8697n126Q583j5139j3471L4392P5698P5400M9889r716
2486I77267742n8889r120R8706J05500L0517k920K5034N5790N0008O8664O4016J7524
$$ plain form
2510.5 977712572 977724969 977751493 977769792 977722228 977654040 977719843 977849126 977858126 977797031 977787614 977841914 977942169
2535 977942169 978039086 978082418 978117347 978177547 978178203 978080034 977974892 977909565 977866828 977876961 977944553 977941453
2559.4 977941453 977803111 977679551 977623284 977578282 977574050 977602005 977611780 977581203 977516890 977443516 977395117
2581.9 977395117 977366865 977366269 977403462 977344990 977203608 977169871 977205217 977145195 976996779 976870596 976788819
2604.3 976788819 976752162 976725399 976687789 976729751 976794839 976753473 976635516 976540983 976470351 976389766 976315975
2626.7 976315975 976193666 976005316 975805163 975626111 975527048 975540936 975593686 975621879 975658953 975685000 975710213
2649.2 975710213 975767195 975804269 975855172 975933909 975948989 975869894 975781798 975797653 975894809 975949943 975908816
2671.6 975908816 975838006 975829124 975863874 975826919 975693047 975599706 975605905 975631893 975641787 975601435 975474536 975298703
$$ packed form
2510.5I77712572J2397K6524J8299m7564o8188O5803J29283R000o1095r417N4300J00255
2535I77942169R6917M3332L4929O0200O56r8169j05142o5327m2737J0133O7592l100
2559.4I77941453j38342j23560n6267m5002m232K7955R775l0577o4313p3374m8399
2581.9I77395117k8252n96L7193n8472j41382l3737L5346o0022j48416j26183q1777
2604.3I76788819l6657k6763l7610M1962O5088m1366j17957r4533p0632q0585p3791
2626.7I76315975j22309j88350k00153j79052r9063J3888N2750K8193L7074K6047K5213
2649.2I75710213N6982L7074N0903P8737J5080p9095q8096J5855R7156N5134m1127
2671.6I75908816p0810q882L4750l6955j33872r3341O199K5988R894m0352j26899j75833
$$ plain form
2696.1 975298703 975185275 975194812 975236475 975227654 975100756 974876940 974744916 974748909 974747360 974659085 974551380
2718.5 974551380 974472344 974377692 974299669 974251747 974183917 974164784 974281967 974413991 974410713 974411309 974501669 974541783
2743 974541783 974509656 974434972 974413157 974561810 974770606 974849343 974797904 974796534 974870622 974825978 974595308
2765.4 974595308 974350691 974255741 974284530 974272549 974166632 974138260 974197686 974159062 974011004 973844171 973701656
2787.8 973701656 973561049 973378718 973235309 973149955 973005474 972825110 972660959 972516418 972382247 972200036
2808.2 972200036 972069740 972050428 971981108 971818805 971651554 971470416 971266329 971103549 970960438 970823824
2828.6 970823824 970703781 970471025 970017552 969416142 968787551 968143523 967428148 966490209 965294123
2847 965294123 964196682 963436484 962850273 962269306 961623907 960931540 960204005 959414005 958645701 957880139
$$ packed form
2696.1I75298703j13428R537M1663q821j26898k23816j32024L993j549q8275j07705
2718.5I74551380p9036r4652p8023m7922o7830j9133J17183J32024l278N96R0360M0114
2743I74541783l2127p4684k1815J48653K08796P8737n1439j370P4088m4644k30670
2765.4I74595308k44617r4950K8789j1981j05917k8372N9426l8624j48058j66833j42515
2787.8I73701656j40607j82331j43409q5354j44481j80364j64151j44541j34171j82211
2808.2I72200036j30296j9312o9320j62303j67251j81138k04087j62780j43111j36614
2828.6I70823824j20043k32756m53473o01410o28591o44028p15375r37939j196086
2847I65294123j097441p60198n86211n80967o45399o92367p27535p90000p68304p65562
$$ plain form
2867.4 957880139 957026243 956179500 955449760 954799175 954131782 953480899 952978075 952579558 952208161 951915503
2887.8 951915503 951696217 951545417 951479495 951543331 951789320 952153146 952563763 952877223 952987552 952985287
2908.1 952985287 952843547 952463806 951955140 951476872 951062679 950733960 950528026 950361550 950130522 949703515
2928.5 949703515 949021280 948251307 947480917 946790695 946312845 946043074 946027339 946310043 946690798 947004914
2948.9 947004914 947248697 947278917 947052062 946800888 946725309 946909428 947436035 948421896 949935436 951831400
2969.3 951831400 953845441 955754995 957328320 958555758 959590077 960452259 961087644 961510658 961884797
2987.7 961884797 962263584 962597728 962925494 963246226 963555515 963906109 964348376 964838028 965161681 965262473
3008.1 965262473 965398788 965683937 965945721 966017425 966000915 966047525 966075361 966138244 966383755 966739476
$$ packed form
2867.4I57880139q53896q46743p29740o50585o67393o50883n02824l98517l71397k92658
2887.8I51915503k19286j50800o5922O3836K45989L63826M10617L13460J10329k265
2908.1I52985287j41740l79741n08666m78268m14193l28719k05934j66476k31028m27007
2928.5I49703515o82235p69973p70390o90222m77850k69771j5735K82704L80755L14116
2948.9I47004914K43783L0220k26855k51174p5579J84119N26607R85861J513540J895964
2969.3I51831400K014041J909554J573325J227438J034319Q62182O35385M23014L74139
2987.7I61884797L78787L34144L27766L20732L09289L50594M42267M89652L23653J00792
3008.1I65262473J36315K85149K61784P1704j6510M6610K7836O2883K45511L55721
$$ plain form
3028.5 966739476 967107415 967406929 967581451 967733264 967926085 968127251 968346059 968560576 968725979 968810499
3048.9 968810499 968825936 968808949 968766987 968791544 968901396 968910694 968814731 968754590 968678892 968621373 968641996
3071.3 968641996 968581438 968431354 968317807 968251109 968223751 968220830 968184769 968025029 967771292 967537522 967359483
3093.7 967359483 967332542 967438400 967462659 967269838 966908753 966641068 966599286 966602921 966505885 966317892 966113389
3116.2 966113389 965944171 965769470 965552926 965395868 965375900 965390980 965327501 965063810 964636862 964332104
3136.5 964332104 964193285 963991165 963695407 963517070 963443398 963248134 962951005 962707281 962518692 962327480
3156.9 962327480 962103307 961781502 961337149 960879564 960508049 960158646 959746599 959364712 959178925 959071696
3177.3 959071696 958853066 958575249 958163261 957608104 957137227 956794500 956510901 956223607 955856562 955497682
$$ packed form
3028.5I66739476L67939K99514J74522J51813J92821K01166K18808K14517J65403Q4520
3048.9I68810499J5437j6987m1962K4557J09852R298r5963o0141p5698n7519K0623
3071.3I68641996o0558j50084j13547o6698k7358k921l6061j59740k53737k33770j78039
3093.7I67359483k6941J05858K4259j92821l61085k67685m1782L635r7036j87993k04503
3116.2I66113389j69218j74701k16544j57058j9968J5080o3479k63691m26948l04758
3136.5I64332104j38819k02120k95758j78337p3672j95264k97129k43724j88589j91212
3156.9I62327480k24173l21805m44353m57585l71515l49403m12047l81887j85787j07229
3177.3I59071696k18630k77817m11988n55157m70877l42727k83599k87294l67045l58880
$$ plain form
3197.7 955497682 955184579 954759717 954254389 953808486 953416526 953045249 952628255 952112019 951633453 951301575
3218.1 951301575 951045394 950808883 950498223 950019717 949542880 949293971 949161828 948929310 948570788 948150873
3238.5 948150873 947792411 947555661 947322726 947032571 946730375 946412265 946122587 945857227 945507884 945148408
3258.9 945148408 944986224 944907904 944599926 944148898 943800926 943590343 943476856 943332791 943139911 942991138
3279.3 942991138 942876637 942697406 942347109 941927135 941597223 941271544 940915346 940766156 940763712 940584183
3299.7 940584183 940295577 939958155 939570427 939297080 939108908 938887000 938534737 938151538 937951684 937754393
3320.1 937754393 937269270 936665714 936262906 936045885 935762584 935292840 934819043 934418082 933957636 933432698
3340.5 933432698 932970643 932557225 932050526 931618035 931357145 931025803 930633724 930244803 929634452 928901911
$$ packed form
3197.7I55497682l13103m24862n05328m45903l91960l71277m16994n16236m78566l31878
3218.1I51301575k56181k36511l10660m78506m76837k48909j32143k32518l58522m19915
3238.5I48150873l58462k36750k32935k90155l02196l18110k89678k65360l49343l59476
3258.9I45148408j62184p8320l07978m51028l47972k10583j13487j44065j92880j48773
3279.3I42991138j14501j79231l50297m19974l29912l25679l56198j49190k444j79529
3299.7I40584183k88606l37422l87728k73347j88172k21908l52263l83199j99854j97291
3320.1I37754393m85123o03556m02808k17021k83301m69744m73797m00961m60446n24938
3340.5I33432698m62055m13418n06699m32491k60890l31342l92079l88921o10351p32541
$$ plain form
3360.9 928901911 928399682 928027809 927591085 927145422 926711082 926235497 925763667 925390482 925043523 924646437
3381.3 924646437 924200654 923637152 922996759 922434330 922045112 921833634 921604693 921211183 920754373 920340836
3401.7 920340836 919997096 919724286 919484079 919130385 918647647 918275595 918091059 917862952 917474627 917075634
3422 917075634 916716635 916373074 916034758 915670395 915378809 915143609 914879620 914676905 914527237 914362133
3442.4 914362133 914260447 914247632 914226651 914094150 913827777 913546026 913308382 913137257 913082421 913008690
3462.8 913008690 912775993 912497103 912388563 912473977 912625551 912731409 912731647 912721217 912881851 913150966
3483.2 913150966 913358033 913572073 913836360 914079010 914297700 914491117 914681733 914885998 915108919 915547788
3503.6 915547788 916184604 916648626 916920185 917268813 917679608 917964101 918102980 918155372 918296337 918707728
$$ packed form
3360.9I28901911n02229l71873m36724m45663m34340m75585m71830l73185l46959l97086
3381.3I24646437m45783n63502o40393n62429l89218k11478k28941l93510m56810m13537
3401.7I20340836l43740k72810k40207l53694m82738l72052j84536k28107l88325l98993
3422I17075634l58999l43561l38316l64363k91586k35200k63989k02715j49668j65104
3442.4I14362133j01686j2815k0981j32501k66373k81751k37644j71125n4836p3731
3462.8I13008690k32697k78890j08540Q5414J51574J05858K38j0430J60634K69115
3483.2I13150966K07067K14040K64287K42650K18690J93417J90616K04265K22921M38869
3503.6I15547788O36816M64022K71559L48628M10795K84493J38879N2392J40965M11391
$$ plain form
3524 918707728 919194639 919580579 919980347 920396149 920675933 920871317 921141267 921357512 921532512 921900749
3544.4 921900749 922396541 922923505 923423886 923810959 924176991 924632788 925126195 925520003 925798953 925994098
3564.8 925994098 926266611 926833034 927496433 928050339 928455710 928655326 928874791 929376423 929903030 930227339
3585.2 930227339 930583715 931175172 931746900 932164609 932611346 933168113 933723152 934228897 934709728 935143828
3605.6 935143828 935574651 936062396 936584651 937199593 938032448 939008594 939834714 940480351 941319644 942442894
3626 942442894 943624139 944788337 945939302 947149396 948466063 949792266 951104760 952461362 953920960
3644.3 953920960 955586135 957459748 959171593 960546494 961846709 963191748 964446664 965675116
3660.6 965675116 967025340 968405008 969672859 970782220 971732676 972638071 973621011 974541247 975230336
$$ packed form
3524I18707728M86911L85940L99768M15802K79784J95384K69950K16245J75000L68237
3544.4I21900749M95792N26964N00381L87073L66032M55797M93407L93808K78950J95145
3564.8I25994098K72513N66423O63399N53906M05371J99616K19465N01632N26607L24309
3585.2I30227339L56376N91457N71728M17709M46737N56767N55039N05745M80831M34100
3605.6I35143828M30823M87745N22255O14942Q32855R76146Q26120O45637Q39293J123250
3626I42442894J181245J164198J150965J210094J316667J326203J312494J356602J459598
3644.3I53920960J665175J873613J711845J374901J300215J345039J254916J228452
3660.6I65675116J350224J379668J267851J109361R50456R05395R82940R20236O89089
$$ plain form
3679 975230336 975790024 976342440 976847768 977299929 977712929 978009760 978250325 978518724 978884339 979309142
3699.4 979309142 979516983 979486287 979627728 979977250 980133176 979849100 979665935 979825020 979888797 979728699
3719.8 979728699 979608119 979706407 979912639 980101049 980165243 979986548 979747772 979793251 980103731 980429113
3740.2 980429113 980573297 980442643 980400383 980546176 980433941 980137110 980114520 980276465 980416656 980497181
3760.6 980497181 980607450 980819762 981040895 981044590 980787039 980556190 980609775 980873883 980924845 980694294
3781 980694294 980583727 980533481 980344534 980213344 980389774 980752647 980928183 980925918 981038213 981024563 980801821
3803.4 980801821 980700791 980602801 980513096 980652809 980968952 981157303 981035590 980710447 980434597 980445683
3823.8 980445683 980454981 980446398 980659664 980937064 981111348 981165528 981088519 981024206 980969310 980857790 980757296
$$ packed form
3679I75230336N59688N52416N05328M52161M13000K96831K40565K68399L65615M24803
3699.4I79309142K07841l0696J41441L49522J55926k84076j83165J59085O3777j60098
3719.8I79728699j20580R8288K06232J88410O4194j78695k38776M5479L10480L25382
3740.2I80429113J44184j30654m2260J45793j12235k96831k2590J61945J40191Q0525
3760.6I80497181J10269K12312K21133L695k57551k30849N3585K64108N0962k30551
3781I80694294j10567n0246j88947j31190J76430L62873J75536k265J12295j3650k22742
3803.4I80801821j01030r7990q9705J39713L16143J88351j21713l25143k75850J1086
3823.8I80445683R298q583K13266K77400J74284N4180p7009o4313n4896j11520j00494
$$ plain form
3846.2 980757296 980751395 980893910 980791509 980259240 980178416 980442584 980653465 980628550 980318367 980075657
3866.6 980075657 980099857 980205357 980219901 980217695 980321765 980363607 980297983 980312169 980279028 980183959 980080903
3889.1 980080903 979891777 979750872 979718387 979680538 979645133 979702413 979745626 979796231 979901075 979922533 979911625
3911.5 979911625 979871809 979732454 979550719 979378045 979342699 979494333 979629517 979620039 979522705 979400277
3931.9 979400277 979362547 979478240 979608059 979534030 979331970 979357064 979620337 979801953 979801774 979673922 979580879
3954.3 979580879 979691982 979759693 979653060 979543567 979401886 979222119 979121625 979194045 979404569 979492784
3974.7 979492784 979433298 979415417 979273736 979088366 979233325 979556799 979641855 979400396 979172170 979144812
3995.1 979144812 979242146
$$ packed form
3846.2I80757296n901J42515j02401n32269q0824K64168K10881k4915l10183k42710
3866.6I80075657K4200J05500J4544k206J04070M1842o5624J4186l3141r5069j03056
3889.1I80080903j89126j40905l2485l7849l5405N7280M3213N0605J04844K1458j0908
3911.5I79911625l9816j39355j81735j72674l5346J51634J35184r478r7334j22428
3931.9I79400277l7730J15693J29819p4029k02060K5094K63273J81616j79j27852r3043
3954.3I79580879J11103O7711j06633j09493j41681j79767j00494P2420K10524Q8215
3974.7I79492784n9486j7881j41681j85370J44959L23474Q5056k41459k28226k7358
3995.1I79144812R7334
$$ plain form
3997.1 979242146
$$ packed form
3997.1I79242146
##END=$$ End of the data block
