##TITLE=Rachel - Amostra 1 $$ Begin of the data block
##JCAMP-DX=5.00 $$ ACD/SpecManager v 10.08
##SPECTROMETER/DATA SYSTEM=Alpha
##DATE=21 May 2015 13:13:22
##DATA TYPE=INFRARED SPECTRUM
##DATA CLASS=XYDATA
##ORIGIN=
##OWNER=
##NPOINTS=1765
##FIRSTX=399.76428223
##LASTX=3997.64306641
##MAXX=3997.64306641
##MINX=399.76428223
##MAXY=0.80968380
##MINY=0.00004726
##XFACTOR=1.0000000000
##YFACTOR=1.000000000000000e-9
##FIRSTY=0.02612041
##DELTAX=2.03961372
##XUNITS=1/CM
##YUNITS=ARBITRARY UNITS
##XYDATA=(X++(Y..Y))
399.8B6120409J193785J851463K320329K477031K235346J439098N30355m07841j233273
$$ 26120409 27314194 29165657 31485986 33963017 36198363 37637461 38167816 37759975 36526702
418.1C6526702j657340j446434p68456k49625m25048q03211r21077r03947j029368
$$ 36526702 34869362 33422928 32654472 32404847 31979799 31176588 30255511 29351564 28322196
436.5B8322196j441285j714809j279129r30797j262339j419567j245737q22469L8258
$$ 28322196 26880911 25166102 23886973 22956176 21693837 20274270 19028533 18206064 18244322
454.8A8244322Q17815J050594R31289P00060L06291j72473m96106o39594q16114p59644
$$ 18244322 19062137 20112731 21044020 21744080 22050371 21877898 21381792 20742198 19926084 19166440
475.2A9166440n26417m02531n7494M42741N20850L35445L15859J69791j37942L893
$$ 19166440 18640023 18237492 18179998 18622739 19143589 19479034 19794893 19964684 19826742 19830635
495.6A9830635O94327J231173J292471J131458R42364P97116O44031M79352L96067
$$ 19830635 20524962 21756135 23048606 24180064 25122428 25919544 26563575 27042927 27438994
514B7438994N56693Q70461Q97845N08260P4783q4966L9181L45012O22233N75017J44493
$$ 27438994 27995687 28866148 29763993 30272253 30347036 30262070 30301251 30646263 31268496 31843513 31988006
536.4C1988006n33119j169333j492145j623630j687016j626281j516119j422303j191134
$$ 31988006 31454887 30285554 28793409 27169779 25482763 23856482 22340363 20918060 19726926
554.8A9726926p86611l69776K64663J094773J571071J777680K024664K028080J730430
$$ 19726926 18940315 18570539 18835202 19929975 21501046 23278726 25303390 27331470 29061900
573.1B9061900J168877K85659o67747j687545k895273l942432m206294l571725k602390
$$ 29061900 30230777 30516436 29848689 28161144 25265871 21323439 17117145 13545420 10943030
591.5A0943030j995806j908659j856488j612352j198818o28832m6703M43176R67840
$$ 10943030 8947224 7038565 5182077 3569725 2370907 1742075 1695372 2138548 3106388
609.8C106388J408179J501046J232754R08358R12714J146182J375047J663454J990700
$$ 3106388 4514567 6015613 7248367 8156725 9069439 10215621 11590668 13254122 15244822
628.2A5244822K139523K071451J644068J029199N04320J11621J54512R71345K210500
$$ 15244822 17384345 19455796 21099864 22129063 22633383 22745004 22899516 23870861 26081361
646.6B6081361L030550K873689J903850J269326J692310K767067L665485L708016L004495
$$ 26081361 29111911 31985600 33889450 35158776 36851086 39618153 43283638 46991654 49996149
664.9D9996149L019970L247399J371126R9331p2751J33068L97175L72522j56533q95150
$$ 49996149 53016119 56263518 57634644 57733975 57661224 57794292 58191467 58563989 58407456 57512306
685.3E7512306j184136m45440J518260L997255N752460O164133N643107M956074M516795
$$ 57512306 56328170 55882730 57400990 61398245 67150705 73314838 78957945 83914019 88430814
703.7H8430814M372038M367792M240587L762141L001719K376989K647258M237548O652713
$$ 88430814 92802852 97170644 101411231 105173372 108175091 110552080 113199338 117436886 124089599
722A24089599Q831292J0062039J0303214J0310009J0394812R975403Q880809P414312
$$ 124089599 132920891 142982930 153286144 163596153 173990965 183966368 192847177 200261489
738.3B00261489O107464N234167M751369M522711M493624M500509M378482M250512
$$ 200261489 206368953 211603120 216354489 220877200 225370824 229871333 234249815 238500327
754.7B38500327M232466M202470M166886M242182M191160M040003L931523L874033
$$ 238500327 242732793 246935263 251102149 255344331 259535491 263575494 267507017 271381050
771B71381050L826917L834635M010796M246146M335463M257351M107266L854782L604650
$$ 271381050 275207967 279042602 283053398 287299544 291635007 295892358 299999624 303854406 307459056
789.3C07459056L424317L232926K924144K643913K422810K178609K010256J863868
$$ 307459056 310883373 314116299 317040443 319684356 322107166 324285775 326296031 328159899
805.6C28159899J706838J461566J070469O44893K88486k91765j409888l089636n246729
$$ 328159899 329866737 331328303 332398772 333043665 333332151 333040386 331630498 328540862 323294133
824C23294133p768959j0414272j2538374j3220698j1834621q611202m219800N70029
$$ 323294133 315525174 305110902 292572528 279351830 267517209 258906007 254686207 255256236
840.3B55256236M948258Q113295R440094Q914441P046550M386455J256585k158463
$$ 255256236 260204494 268317789 277757883 286672324 293718874 298105329 299361914 297203451
856.6B97203451n872696r960175j4553845k0053312k6261851l1285569l2242716k7646392
$$ 297203451 291330755 281370580 266816735 246763423 220501572 189216003 156973287 129326895
873A29326895j9200906j0511257m259028j347981j607820m061528p219888j0018520
$$ 129326895 110125989 99614732 95355704 94007723 92399903 88338375 81118487 71099967
889.3G1099967j2162399j3434361j3123673j0812463p414408m309496k101000o62978
$$ 71099967 58937568 45503207 32379534 21567071 14152663 9843167 7742167 7079189
905.6G079189M08988J516963K845696M118945M913351N181614N341720N937993P130363
$$ 7079189 7488177 9005140 11850836 15969781 20883132 26064746 31406466 37344459 44474822
923.9D4474822Q616652R980231J0906168J1009879J0099292Q416086O227516L792569
$$ 44474822 53091474 63071705 73977873 84987752 95087044 103503130 109730646 113523215
940.3A13523215J338534j070484l209673m626133m926972l909707j737595R70103L186502
$$ 113523215 114861749 113791265 110581592 105955459 101028487 97118780 95381185 96351288 99537790
958.6I9537790L560446J128987l796168r519361j3748892j5081439j3819680j1255305
$$ 99537790 103098236 104227223 100431055 90911694 77162802 62081363 48261683 37006378
974.9C7006378q560866o310370m650131l478720k586085j870592j304933q46141m71098
$$ 37006378 28445512 22135142 17485011 14006291 11420206 9549614 8244681 7398540 6927442
993.3F927442k91673m25692p36602r68918j038121r93330q37356o10578m03432k80096
$$ 6927442 6635769 6210077 5473475 4504557 3466436 2473106 1635750 1025172 621740 341644
1013.7C41644j79452M023o530j8194R637j4970n8543K3498M5269j634k3607K45N863
$$ 341644 162192 166215 159685 141491 151128 136158 77615 101113 146382 144748 121141 121386 127249
1040.2A27249L1441R993l5246j4250O953m9625k9251P5398O0804k9075n4020O7068
$$ 127249 158690 168683 133437 119187 126140 76515 47264 122662 183466 154391 100371 167439
1064.7A67439P809J4948N1646L0852l1179p0434n4846K82J3232l8217k465l8643J1176
$$ 167439 175248 190196 241842 272694 241515 171081 116235 116517 129749 91532 89067 50424 61600
1091.2F1600N8264Q2808J9331l6186k1931k6752l0002M023J8516L2152J0585j8954
$$ 61600 119864 202672 222003 185817 163886 137134 107132 111155 129671 161823 172408 153454
1115.7A53454J945J2316J9623l097m5836n7587j2494L8607R5632P1450K7818N9277
$$ 153454 155399 167715 187338 184241 138405 80818 68324 106931 202563 274013 301831 361108
1140.1C61108J16440P5012N731n8400j37506j17630k9945q389k1467o552j0133k9154
$$ 361108 477548 552560 558291 499891 362385 244755 214810 206421 184954 178402 168269 139115
1164.6A39115m51K3758L6970J14922K71819M36808O89600J019188J262580J263400
$$ 139115 138664 162422 199392 314314 586133 1022941 1712541 2731729 3994309 5257709
1185E257709Q76665J46420o40354j189841j375138j238579r14301n26915k03714m9409
$$ 5257709 6134374 6280794 5640440 4450599 3075461 1836882 922581 395666 191952 142543
1205.4A42543O885J8288j9213m7774j8161K7606M9889J0628l9304l6526J6970M4028
$$ 142543 149428 167716 148503 100729 82568 110174 160063 170691 131387 94861 111831 155859
1229.9A55859p816o3394k8284J4188J6583J6478N251l222o833R216K3400R874J5376
$$ 155859 148043 84649 56365 70553 87136 103614 108865 105643 98810 108026 131426 141300 156676
1256.4A56676K4549j61m3173m612J4925o62K3015L1845r447l5988j1110K3831P8944
$$ 156676 181225 181064 137891 133279 148204 147542 170557 202402 192955 156967 145857 169688 248632
1282.9B48632J52248K65727M29996O17283Q46780J109391J343640J484988J498996
$$ 248632 400880 666607 1096603 1713886 2560666 3670057 5013697 6498685 7997681
1301.3G997681J372549J014354M16734k23445o74090q60257q22838o06755k24094K44501
$$ 7997681 9370230 10384584 10801318 10577873 9903783 9043526 8220688 7613933 7389839 7634340
1321.7G634340Q33094J584986K315567K876744L204920L288532L089150K495522J360567
$$ 7634340 8467434 10052420 12367987 15244731 18449651 21738183 24827333 27322855 28683422
1340B8683422o1188j259317k249195l405234m724321n508253n129442l623242j854286
$$ 28683422 28622234 27362917 25113722 21708488 16984167 11475914 6346472 2723230 868944
1358.4H68944o69895j06989L2331j226j3012j7342Q134j3932L664K0949L187J9631
$$ 868944 199049 92060 124391 123165 110153 92811 100945 87013 90677 111626 114813 134444
1382.9A34444M1436N2049J41721M40899J165037K203994K867891K862093K213532J240387
$$ 134444 175880 227929 369650 810549 1975586 4179580 7047471 9909564 12123096 13363483
1403.3A3363483M93157r5740n56491r66469j320537j463804j491377j419396j154696
$$ 13363483 13856640 13760900 13204409 12237940 10917403 9453599 7962222 6542826 5388130
1421.6E388130q85482p26537m89625k50523j2811K14521N18649Q70153J024389J307216
$$ 5388130 4502648 3776111 3286486 3035963 3023152 3237673 3756322 4626475 5650864 6958080
1442F958080J609727K019195K494623K683072K502417K467042L512499N018922N025046
$$ 6958080 8567807 10587002 13081625 15764697 18267114 20734156 24246655 29265577 34290623
1460.4C4290623O223429J0530259J4924940J6442053J9404665K5571868K6326701K1955579
$$ 34290623 40514052 51044311 65969251 82411304 101815969 127387837 153714538 175670117
1476.7A75670117J8859208J6865790J4963254J2451559J0869846J0366350R182185
$$ 175670117 194529325 211395115 226358369 238809928 249679774 260046124 269228309
1491B69228309O748021N629212N972057N378396L971696K911746L115326M141450L056169
$$ 269228309 275976330 281605542 287577599 292955995 296927691 299839437 302954763 307096213 310152382
1509.3C10152382J782506J448006J377404J473516J537412J916468J919389J684785
$$ 310152382 311934888 313382894 314760298 316233814 317771226 319687694 321607083 323291868
1525.6C23291868J720786J340300J164943J333773R42230N68301J067251J194060Q31276
$$ 323291868 325012654 326352954 327517897 328851670 329793900 330362201 331429452 332623512 333454788
1544C33454788O24746L53068J50055j8686k01881l48628P5430L93837j49875m85033
$$ 333454788 334079534 334432602 334582657 334563971 334362090 334013462 334088892 334482729 334332854 333847821
1564.4C33847821o71685j061887j630008k176881k922117m155159m728288n135983
$$ 333847821 333176136 332114249 330484241 328307360 325385243 321230084 316501796 311365813
1580.7C11365813o352454p625521q829355j0103106j1543990j2979596j4448151j5629039
$$ 311365813 305013359 297387838 288558483 278455377 266911387 253931791 239483640 223854601
1597B23854601j6507983j7508879j8256635j8326535j8143833j7776482j6340166j4042944
$$ 223854601 207346618 189837739 171581104 153254569 135110736 117334254 100994088 86951144
1613.4H6951144j3120122j2954612r660359p053200o360769n048581l598442k639758
$$ 86951144 73831022 60876410 51216051 44162851 37802082 32753501 29155059 26515301
1629.7B6515301j802833j238557q15371k77314R9443L55154O00513J177521J608214
$$ 26515301 24712468 23473911 22658540 22381226 22480669 22835823 23436336 24613857 26222071
1648B6222071J384696K290941M282259L777865L539045M375718N409539N514271M580819
$$ 26222071 27606767 29897708 34179967 37957832 41496877 45872595 51282134 56796405 61377224
1666.4F1377224M601780M688747L330916K222725J227699l29763j591623k980053n021580
$$ 61377224 65979004 70667751 73998667 76221392 77449091 77119328 75527705 72547652 67526072
1684.7F7526072n603414n763862o500874o476458p102869p545714o815571o703045
$$ 67526072 61922658 56158796 49657922 43181464 36078595 28532881 21717310 15014265
1701.1A5014265n005842l601390k986688j838094r79776m70818j2014N7291M699P994
$$ 15014265 10008423 6407033 3420345 1582251 602475 131657 119643 176934 181633 189627
1721.5A89627j4641j0238l3223J2311K048O51K8019k0901j4304j1601o511J2697K3310
$$ 189627 174986 164748 131525 143836 145884 146535 174554 153653 139349 127748 121237 133934 157244
1748A57244J3076j697O920j2473l0091j8018J4975K9390L0468O8621K06609Q29178
$$ 157244 170320 168623 175543 163070 132979 114961 129936 159326 189794 258415 465024 1294202
1772.4A294202J718605K798018M373572O450714Q254606R846190J0916281J1057046
$$ 1294202 3012807 5810825 10184397 16635111 24889717 34735907 45652188 56709234
1788.8E6709234J2372847J4330671J3736344J2759559J3735652J5108973J5469387
$$ 56709234 69082081 83412752 97149096 109908655 123644307 138753280 154222667
1803A54222667J5337259J5862539J6993180J8181056J8479392J8387928J8977106J9239307
$$ 154222667 169559926 185422465 202415645 220596701 239076093 257464021 276441127 295680434
1819.4B95680434J8814563J8963695J9549668J8695950J8745125J8601954J6448229
$$ 295680434 314494997 333458692 353008360 371704310 390449435 409051389 425499618
1833.6D25499618J5311748J4741301J3258607J1806190J2048423J1722147R932757
$$ 425499618 440811366 455552667 468811274 480617464 492665887 504388034 514320791
1847.9E14320791Q899867Q346439P738530P149876O587326O059408N522847M870534
$$ 514320791 523220658 531567097 539305627 546455503 553042829 559102237 564625084 569495618
1864.2E69495618M452467M658997M965425M506349M150689M159331M133761L978908
$$ 569495618 573948085 578607082 583572507 588078856 592229545 596388876 600522637 604501545
1880.5F04501545L699482L312826K690017K152682J611590Q24809j14024r51230j788437
$$ 604501545 608201027 611513853 614203870 616356552 617968142 618792951 618678927 617727697 615939260
1898.9F15939260k634705l328979l857851m240155m471838m376829m150569l961504
$$ 615939260 613304555 609975576 606117725 601877570 597405732 593028903 588878334 584916830
1915.2E84916830l799379l329396k801538k526581k254069j994848j801908j683533
$$ 584916830 581117451 577788055 574986517 572459936 570205867 568211019 566409111 564725578
1931.5E64725578j639903j607179j507223j479685j414597j241267j055777q16763
$$ 564725578 563085675 561478496 559971273 558491588 557076991 555835724 554779947 553963184
1947.9E53963184m10556J64747P92324J461745K163291K850353L368378L766716M208505
$$ 553963184 553552628 553717375 554509699 555971444 558134735 560985088 564353466 568120182 572328687
1966.2E72328687M646122M759610M614591M473865M271269L991664L659606L285885
$$ 572328687 576974809 581734419 586349010 590822875 595094144 599085808 602745414 606031299
1982.5F06031299K812743K303898J764715J232326P16865J42932m50492j032352j612902
$$ 606031299 608844042 611147940 612912655 614144981 614861846 615004778 614554286 613521934 611909032
2000.9F11909032k160728k587080l009558l372967l537357l535271l433108l220439
$$ 611909032 609748304 607161224 604151666 600778699 597241342 593706071 590272963 587052524
2017.2E87052524k883494k471626k003610j534700j098693p10964l62277j06990K4855
$$ 587052524 584169030 581697404 579693794 578159094 577060401 576349437 575987160 575880170 575905025
2035.6E75905025N6684M3392L0518m2916j81794l41475m81546n98251p18713q60989
$$ 575905025 575961709 576005101 576035619 575992703 575810909 575469434 574987888 574389637 573670924 572809935
2056E72809935r93312j097977j163602j237869j404226j613974j837492k102256k450645
$$ 572809935 571816623 570718646 569555044 568317175 566912949 565298975 563461483 561359227 558908582
2074.3E58908582k842605l230095l636658l995419m278779m564107m879415n195379
$$ 558908582 556065977 552835882 549199224 545203805 540925026 536360919 531481504 526286125
2090.6E26286125n476773n744814o011367o226242o379574o397427o185859n795807
$$ 526286125 520809352 515064538 509053171 502826929 496447355 490049928 483864069 478068262
2106.9D78068262n262226m569411l747850k890468k094656j346022n71192J75924P94142
$$ 478068262 472806036 468236625 464488775 461598307 459503651 458157629 457586437 457762361 458556503
2125.3D58556503J284599J681984K045661K407551K745271L073483L424108L791005
$$ 458556503 459841102 461523086 463568747 465976298 468721569 471795052 475219160 479010165
2141.6D79010165M174471M584700M984259N335212N606383N824685O030321O250203
$$ 479010165 483184636 487769336 492753595 498088807 503695190 509519875 515550196 521800399
2157.9E21800399O469965O650090O766558O805777O808639O727576O562352O391585
$$ 521800399 528270364 534920454 541687012 548492789 555301428 562029004 568591356 574982941
2174.3E74982941O162048N893647N719066N556941N298734M998326M743218M571975
$$ 574982941 581144989 587038636 592757702 598314643 603613377 608611703 613354921 617926896
2190.6F17926896M357278M062474L767967L477931L168285K915203K770961K667427
$$ 617926896 622284174 626346648 630114615 633592546 636760831 639676034 642446995 645114422
2206.9F45114422K588093K523899K468825K417266K361536K272248K121270J934886
$$ 645114422 647702515 650226414 652695239 655112505 657474041 659746289 661867559 663802445
2223.2F63802445J739561J511217J286924J093089Q37624N93662M59552L44157J98722
$$ 663802445 665542006 667053223 668340147 669433236 670270860 670864522 671324074 671668231 671866953
2241.6F71866953J31190J40488J61350J95146K25126K24650J41144O1453P6651J02222
$$ 671866953 671998143 672138631 672299981 672495127 672720253 672944903 673086047 673147500 673224151 673326373
2262F73326373N6803P16M4763K14934M69863P93994J222551J749635K285182K734840
$$ 673326373 673383176 673383892 673428655 673643589 674113452 674907446 676129997 677879632 680164814 682899654
2282.3F82899654L099739L388644L573239L665685L735721L758431L654659L446042
$$ 682899654 685999393 689388037 692961276 696626961 700362682 704121113 707775772 711221814
2298.7G11221814L176809K871990K556383K256155J920760J585126J329064J042068
$$ 711221814 714398623 717270613 719826996 722083151 724003911 725589037 726918101 727960169
2315G27960169O74188M12524L16799J32263j78039m45843p55012j220227j700878k243876
$$ 727960169 728634357 729046881 729363680 729495943 729317904 728872061 728117049 726896822 725195944 722952068
2335.4G22952068k787948k617478j713216j126290j307905j497566j299083r71258
$$ 722952068 720164120 717546642 715833426 714707136 713399231 711901665 710602582 709631324
2351.7G09631324n84662j28150K77817M93705N85735P79152J020670J048982R97305
$$ 709631324 709046662 708918512 709196329 709690034 710275769 711054921 712075591 713124573 714121878
2370.1G14121878R97842R43422Q00311O00219L82960J60515j13129n26965j030207
$$ 714121878 715119720 716063142 716863453 717463672 717846632 718007147 717894018 717367053 716336846
2388.4G16336846j511037k030075k598404l090442l485918l788888l904224l785848
$$ 716336846 714825809 712795734 710197330 707106888 703620970 699832082 695927858 692142010
2404.7F92142010l521323l118098k516985j860619j291573p70151k53499J84238M51148
$$ 692142010 688620687 685502589 682985604 681124985 679833412 679063261 678809762 678994000 679445148
2423.1F79445148N79893O08027N41866M32134L19957J37151j20461l51131n44787o52432
$$ 679445148 680025041 680633068 681174934 681607068 681927025 682064176 681943715 681592584 681047797 680395365
2443.5F80395365o59764p10547q11338q36194p92205p22766o66201o12736n15580m08829
$$ 680395365 679735601 679025054 678213716 677377522 676585317 675862551 675196350 674583614 674068034 673659205
2463.9F73659205k81453j46746N364K26498M64558O79195Q70824J024485J148164J267970
$$ 673659205 673377752 673231006 673236370 673462868 673927426 674606621 675477445 676501930 677650094 678918064
2484.3F78918064J404762J576900J715660J765371J857281K058923K161562K148927
$$ 678918064 680322826 681899726 683615386 685380757 687238038 689296961 691458523 693607450
2500.6F93607450K197086K265156K264082K195656K122581K049566J919388J781345
$$ 693607450 695804536 698069692 700333774 702529430 704652011 706701577 708620965 710402310
2516.9G10402310J697600J601279J432299J243651J141191J111805J031041R59993
$$ 710402310 712099910 713701189 715133488 716377139 717518330 718630135 719661176 720621169
2533.2G20621169R91225J036763J032651R74953Q58485P63536O90997N51462L25739
$$ 720621169 721612394 722649157 723681808 724656761 725515246 726278782 726969779 727521241 727846980
2551.6G27846980P570l25024o69182j101136j550555j943111k285719k567470k752126
$$ 727846980 727854550 727529526 726860344 725759208 724208653 722265542 719979823 717412353 714660227
2569.9G14660227k812326k744674k600193k396822k144099j927077j760543j589000
$$ 714660227 711847901 709103227 706503034 704106212 701962113 700035036 698274493 696685493
2586.2F96685493j442432j352430j328766j356721j394570j501441j710057j947105
$$ 696685493 695243061 693890631 692561865 691205144 689810574 688309133 686599076 684651971
2602.6F84651971k124727k236009k343952k488673k632439k703846k752900k891779
$$ 684651971 682527244 680291235 677947283 675458610 672826171 670122325 667369425 664477646
2618.9F64477646l088176l200710l209412l198087l160894l014445k759218k484680
$$ 664477646 661389470 658188760 654979348 651781261 648620367 645605922 642846704 640362024
2635.2F40362024k192080j799404j343489r29594n23031p4863L84092P92921J106381
$$ 640362024 638169944 636370540 635027051 634097457 633574426 633499563 633883655 634676576 635782957
2653.5F35782957J300931J327574J236975J072586Q03948N02526K13266r6560m05133
$$ 635782957 637083888 638411462 639648437 640721023 641524971 642027497 642240763 642144203 641739070
2671.9F41739070o85572r23932j095831j225889j352727j476944j597106j767278j945257
$$ 641739070 641053498 640129566 639033735 637807846 636455119 634978175 633381069 631613791 629668534
2690.3F29668534k093792k319634k626300k962768l353953l783167m154801m463136
$$ 629668534 627574742 625255108 622628808 619666040 616312087 612528920 608374119 603910983
2706.6F03910983m715979m840374m860640m768968m496395m089713l583968k963901
$$ 603910983 599195004 594354630 589493990 584725022 580228627 576138914 572554946 569591045
2722.9E69591045k292454j587391q44478j36078M98235J032651J464844J822650K055526
$$ 569591045 567298591 565711200 564866722 564730644 565228879 566261530 567726374 569549024 571604550
2741.2E71604550K079964J973867J895785J829028J641632J269996P94410L53337m9353
$$ 571604550 573684514 575658381 577554166 579383194 581024826 582294822 583089232 583442569 583393216
2759.6E83393216m68731q72075j219273j474440j677990j937628k207279k345800k435148
$$ 583393216 582924485 582052410 580833137 579358697 577680707 575743079 573535800 571190000 568754852
2778E68754852k645731k931059l218531l513515l812969m095077m281640m371584m459977
$$ 568754852 566109121 563178062 559959531 556446016 552633047 548537970 544256330 539884746 535424769
2796.3E35424769m499197m439771m401446m353702m183292l975928l830433l778755
$$ 535424769 530925572 526485801 522084355 517730653 513547361 509571433 505741000 501962245
2812.6E01962245l811121l895432m025311m197090m443527m712999m995912n492091
$$ 501962245 498151124 494255692 490230381 486033291 481589764 476876765 471880853 466388762
2828.9D66388762o244034p118612q204460r539485j0903061j2301981j3803989j5193015
$$ 466388762 460144728 453026116 444821656 435282171 424379110 412077129 398273140 383080125
2845.3C83080125j6253561j7015159j7694771j8369615j8900693j9111782j8901736
$$ 383080125 366826564 349811405 332116634 313747019 294846326 275734544 256832808
2859.5B56832808j8292144j7378226j6231015j4892548j3503880j2150168j0816902
$$ 256832808 238540664 221162438 204931423 190038875 176534995 164384827 153567925
2873.8A53567925r590089q453757p309615o173253n061619l965885k884120j803890
$$ 153567925 143977836 135524079 128214464 122041211 116979592 113013707 110129587 108325697
2890.1A08325697o89536N02214J727611K777271L444724L738962L756642L445894K820223
$$ 108325697 107636161 108138375 109865986 112643257 116087981 119826943 123583585 127029479 129849702
2908.5A29849702K089337J351520N68345k26259r55686j687795k579734l707431n097732
$$ 129849702 131939039 133290559 133858904 133632645 132676959 130989164 128409430 124701999 119604267
2926.8A19604267o752081q412488r550370r702332q679063o703779m343733k185099
$$ 119604267 112852186 104439698 94889328 85186996 76507933 69804154 65460421 63275322
2943.2F3275322n36188N63048J095220R88394L25382m94212r40658o40497M98697K428055
$$ 63275322 62739134 63302182 64397402 65385796 65711178 65216966 64276308 63635811 64134508 66562563
2963.6F6562563N068116Q196622J1374191J4029227J5572466J5688173J4592886J2740165
$$ 66562563 71630679 79827301 91201492 105230719 120803185 136491358 151084244 163824409
2979.9A63824409J0534033Q351267O547257N411133N095259N526334O431535P505029
$$ 163824409 174358442 182709709 189256966 194668099 199763358 205289692 211721227 219226256
2996.2B19226256Q494362R156853R283781Q797705P707984O153255M390896K732545
$$ 219226256 227720618 236877471 246161252 254958957 262666941 268820196 273211092 275943637
3012.5B75943637J562893J128048J439601K302706L448427M692465N823851O702095
$$ 275943637 277506530 278634578 280074179 282376885 285825312 290517777 296341628 303043723
3028.8C03043723P318735P619471P609158P401675P068068O635755O098748N432993
$$ 303043723 310362458 317981929 325591087 332992762 340060830 346696585 352795333 358228326
3045.1C58228326M699468L957868L218830K550095J974940J462877R95427N80073J90228
$$ 358228326 362927794 366885662 370104492 372654587 374629527 376092404 377087831 377667904 377858132
3063.5C77858132k17914n16922o67453q43793j111597j381814j574874j753002j938969
$$ 377858132 377640218 377123296 376455843 375612050 374500453 373118639 371543765 369790763 367851794
3081.9C67851794k030969k127379k318770k459973k546728k691149k851993k935529
$$ 367851794 365820825 363693446 361374676 358914703 356367975 353676826 350824833 347889304
3098.2C47889304k968609l032029l099680l114790l141939l203303l192216l178865
$$ 347889304 344920695 341888666 338788986 335674196 332532257 329328954 326136738 322957873
3114.5C22957873l272116l356933l419012l527671l604502l634721l721088l888071
$$ 322957873 319685757 316328824 312909812 309382141 305777639 302142918 298421830 294533759
3130.8B94533759m050970m142254m171759m227460m397273m598677m697561m694492
$$ 294533759 290482789 286340535 282168776 277941316 273544043 268945366 264247805 259553313
3147.1B59553313m698813m799097m921407m986361n011394n007074n002126n040735
$$ 259553313 254854500 250055403 245133996 240147635 235136241 230129167 225127041 220086306
3163.4B20086306n089372n098715n085350n060255n033016n030632n011916m946664
$$ 220086306 214996934 209898219 204812869 199752614 194719598 189688966 184677050 179730386
3179.8A79730386m933313m954800m866019m736468m703745m688233m611955m514649
$$ 179730386 174797073 169842273 164976254 160239786 155536041 150847808 146235853 141721204
3196.1A41721204m425138m354120m283398m174314m047633l981255l917649l786229
$$ 141721204 137296066 132941946 128658548 124484234 120436601 116455346 112537697 108751468
3212.4A08751468l627881l501602l431588l335305l176301l011070k899364k797008
$$ 108751468 105123587 101621985 98190397 94855092 91678791 88667721 85768357 82971349
3228.7H2971349k664983k557844k488099k407238k271838k132245k018138j928389
$$ 82971349 80306366 77748522 75260423 72853185 70581347 68449102 66430964 64502575
3245F4502575j867243j778952j655613j579210j554679j508977j419861j325503j275256
$$ 64502575 62635332 60856380 59200767 57621557 56066878 54557901 53138040 51812537 50537281
3263.4E0537281j221340j171522j179386j132801j040895j027610j026839r86707r65759
$$ 50537281 49315941 48144419 46965033 45832232 44791337 43763727 42736888 41750181 40784422
3281.7D0784422r94738r99533r27552q75302q62844q56306q64130q75048q88996r00444
$$ 40784422 39789684 38790151 37862599 36987297 36124453 35268147 34404017 33528969 32639973 31739529
3302.1C1739529r12990r16831r25623r34184r09714q73243q27555q26456q89504r13171
$$ 31739529 30826539 29909708 28984085 28049901 27140187 26266944 25439389 24612933 23723429 22810258
3322.5B2810258q79880q60799q14056p46144p74700q18890p85503p20166o93344p26404
$$ 22810258 21930378 21069579 20255523 19509379 18734679 17915789 17130286 16410120 15716776 14990372
3342.9A4990372p55835p43167o59180n55483n62650o16549n83506n39559n56375n32520
$$ 14990372 14234537 13491370 12832190 12276707 11714057 11097508 10514002 9974443 9418068 8885548
3363.3H885548m18185l80851m34448m15662l55332l37119l32138l09083k82656k71860
$$ 8885548 8467363 8086512 7652064 7236402 6881070 6543951 6211813 5902730 5620074 5348214
3383.7E348214l03642k93883k55913k35806j57928j08104j44264j85043j92368k16259
$$ 5348214 5044572 4750689 4494776 4258970 4101042 3992938 3848674 3663631 3471263 3255004
3404.1C255004j85788j31047j85801j95207r9139r5398j54379j51110j22795q4451
$$ 3255004 3069216 2938169 2752368 2557161 2458022 2362624 2208245 2057135 1934340 1849889
3424.5A849889p4475q2875q6336r4866n6537o960l6785q9928p3792m7844m8135r5312
$$ 1849889 1775414 1692539 1606203 1511337 1454800 1447840 1411055 1321127 1247335 1199491 1151356 1056044
3449A056044j11185n6002K777K5505j528n2244n0426k2090m7127l3987L5978L2767
$$ 1056044 944859 888857 891634 917139 915611 863367 812941 790851 743724 709737 745715 778482
3473.4G78482k87K6068L6986R688j814P128J2797k3594l9779j0504m839j7937L5370
$$ 778482 778195 804263 841249 850937 849123 856251 869048 845454 805675 795171 790332 772395 807765
3500H07765Q9477M8545k2483k0829J4104Q733J8203M9440L4286J1375N7444J19054
$$ 807765 897242 945787 923304 902475 916579 925312 943515 992955 1027241 1038616 1096060 1215114
3524.4A215114J01057L4445O64n1058q6247l171J05234R7973L0958K282L1299O3968
$$ 1215114 1316171 1350616 1351280 1300222 1213975 1210804 1316038 1414011 1444969 1447251 1478550 1542518
3548.9A542518J01617J03517J3172k8380M0510Q7784L6004M7418J41600J18682K7968
$$ 1542518 1644135 1747652 1760824 1732444 1772954 1860738 1896742 1944160 2085760 2204442 2232410
3571.3B232410L5784R2776J53326J65204O9437L622M5323J11759J17834P7719O0836
$$ 2232410 2268194 2360970 2514296 2679500 2748937 2752559 2797882 2909641 3027475 3105194 3166030
3593.8C166030J02494J81382K04373K12615J68106R5976J48309L10124L54666K73647
$$ 3166030 3268524 3449906 3654279 3866894 4035000 4130976 4279285 4589409 4944075 5217722
3614.2E217722K34912L69586N71053N87814N34295O17187J033111J352042J335206
$$ 5217722 5452634 5822220 6393273 6981087 7515382 8132569 9165680 10517722 11852928
3632.5A1852928J535853J904655K311299K812367L262598L726784N001448P360160
$$ 11852928 13388781 15293436 17604735 20417102 23679700 27406484 32407932 39768092
3648.8C9768092Q556620Q130923R649373J2814291J4400497J5782647J8086418J9751951
$$ 39768092 48324712 56455635 66105008 78919299 93319796 109102443 127188861 146940812
3665.2A46940812K1949098K7245745K9691473K8431087L4068108L6134064L0890256
$$ 146940812 168889910 196135655 225827128 254258215 288326323 324460387 355350643
3679.4C55350643K9626310K9090941K7983815K9838562L1765997K7721226K2626698
$$ 355350643 384976953 414067894 442051709 471890271 503656268 531377494 554004192
3693.7E54004192K0326794J8907070J7666995J6935468J4649808J1713446J0536432
$$ 554004192 574330986 593238056 610905051 627840519 642490327 654203773 664740205
3708F64740205J0788262J0650396Q706808O898701O161273N800485N391598N102158
$$ 664740205 675528467 686178863 694885671 701784372 707945645 713746130 719137728 724239886
3724.3G24239886M576087L839373L334165L303468L551543L589392K968430K284706
$$ 724239886 728815973 732655346 735989511 739292979 742844522 746433914 749402344 751687050
3740.6G51687050K551675K731025J851976J722812K728642K916812K322376K060116
$$ 751687050 754238725 756969750 758821726 760544538 763273180 766189992 768512368 770572484
3756.9G70572484K106726K033710J667619J584232J721263J903534K004265J817227
$$ 770572484 772679210 774712920 776380539 777964771 779686034 781589568 783593833 785411060
3773.3G85411060J523197J415252J363158J318396J326561J360237J467586J413405
$$ 785411060 786934257 788349509 789712667 791031063 792357624 793717861 795185447 796598852
3789.6G96598852J054346P12097P32005P51495P51555P98404Q71599J134157J117349
$$ 796598852 797653198 798365295 799097300 799848795 800600350 801398754 802270353 803404510 804521859
3807.9H04521859O15060K21431K03133K54393L06129M92096O10173M71174L87311M38035
$$ 804521859 805136919 805358350 805561483 805815876 806122005 806614101 807224274 807695448 808082759 808520794
3828.3H08520794K56956j12772j74463J13308K74062K03014K43246L24309L5346l11792
$$ 808520794 808777750 808664978 808490515 808603823 808877885 809080899 809324145 809648454 809683800 809372008
3848.7H09372008l02315k34365m17710m12166l10719m33564o61016p24554n47468n28634
$$ 809372008 809069693 808835328 808417618 808005452 807694733 807261169 806600153 805875599 805328131 804799497
3869.1H04799497o93261o67573n95986o87361q81493q75294p53105p63059o73115o28829
$$ 804799497 804106236 803438663 802842677 802155316 801273823 800398529 799645424 798882365 798209250 797580421
3889.5G97580421q29697r32991q44836q99077j120448j182735j124859j137495j062393
$$ 797580421 796750724 795817733 794972897 794073820 792953372 791770637 790645778 789508283 788445890
3907.9G88445890j068831j253843j451969j651943j683831j479387j469195j642585
$$ 788445890 787377059 786123216 784671247 783019304 781335473 779856086 778386891 776744306
3924.2G76744306j564681j452685j613736j705825j545430j506924j726151j883864
$$ 776744306 775179625 773726940 772113204 770407379 768861949 767355025 765628874 763745010
3940.5G63745010j791954j677215j855076k086937Tk154053k431750k704740k848506
$$ 763745010 761953056 760275841 758420765 756333828 754246891 752092838 749661088 746956348 744107842
3958.9G44107842k963066l170192l367126l325403l065586k772033k349257j694024
$$ 744107842 741144776 737974584 734607458 731282055 728216469 725444436 723095179 721401155
3975.2G21401155r68218l43919J67787O75202J106918J238584J149357J010060Q60691
$$ 721401155 720432937 720089018 720256805 720932007 722038925 723277509 724426866 725436926 726297617
3993.5G26297617P00235M55976
$$ 726297617 726997852 727453828
3997.6G27453828
$$ 727453828
##END=$$ End of the data block
