##TITLE=Rachel - Amostra 1 $$ Begin of the data block
##JCAMP-DX=5.00 $$ ACD/SpecManager v 10.08
##SPECTROMETER/DATA SYSTEM=Alpha
##DATE=21 May 2015 14:09:38
##DATA TYPE=INFRARED SPECTRUM
##DATA CLASS=XYDATA
##ORIGIN=
##OWNER=
##NPOINTS=1667
##FIRSTX=599.57470703
##LASTX=3997.16503906
##MAXX=3997.16503906
##MINX=599.57470703
##MAXY=0.98411697
##MINY=0.12377676
##XFACTOR=1.0000000000
##YFACTOR=1.000000000000000e-9
##FIRSTY=0.45081794
##DELTAX=2.03937006
##XUNITS=1/CM
##YUNITS=ARBITRARY UNITS
##XYDATA=(X++(Y..Y))
599.6D50817943k805591O511360J5534103K2740007K6251107K3673177J6972542J1100650
615.9E70795298Q348643P800997Q157432Q971274R355008Q828998P643342O566465
632.2F36467457N378246L573835K110302J620293J818895L741682P126808Q420706
648.5F70258224O665170M265666K864003L398061N551636O865919O164312M681826
664.8G10714817M333437M098475J660823O7234k25901M56154J418233J693308J078248
683.2G25294828J56999j78039Q45015L292084N907655P050275O392658N217075M644931
701.5G58623481M287004L921390M033983L885746L077387K555490K459824K755582
717.9G85599887L643334M636884N277395N568087N309046M786312M532814M259885
$$ y = [450817943, 448012352, 454523712, 470057815, 492797822, 519048929, 542722106, 559694648, 570795298, 579143941, 586944938, 595102370, 604073644, 613428652, 622257650, 629900992, 636467457, 641845703, 645419538, 647529840, 649150133, 650969028, 654710710, 661837518, 670258224, 676923394, 681189060, 684053063, 687451124, 693002760, 699868679, 706032991, 710714817, 715048254, 719146729, 720807552, 720874786, 720648885, 721105039, 722523272, 724216580, 725294828, 725451827, 725273788, 726118803, 729410887, 735318542, 742368817, 748761475, 753978550, 758623481, 762910485, 766831875, 770865858, 774751604, 777828991, 780384481, 782844305, 785599887, 789243221, 793880105, 799157500, 804725587, 810034633, 814820945, 819353759, 823613644]
734.2H23613644L565311K692163K089500J825870J710295J587332J501798J469255
750.5H40055168J510679J390219J216412J237988J174510J212179J461745J516878
766.8H50775778J303196J159430J087785J043379R59098Q16405J028895J309455J136303
785.2H60619724P95960O28829O12974O62029O19471M90725K94805J90556L93927M21286
805.6H65730286R8049r2506j30832j67430j90258l93986q76725j499891k040029k529383
825.9H57907295l293931m266858m805088m418850l203810j492321L42607J742602K329647
844.3H40841293K494693K433002J819193O70970o99520k038717l407717n045593p092714
862.7H29974890r771347j3299763j7000616j9230187j8135667j3472557p668257l362775
$$ y = [823613644, 827178955, 829871118, 831960618, 833786488, 835496783, 837084115, 838585913, 840055168, 841565847, 842956066, 844172478, 845410466, 846584976, 847797155, 849258900, 850775778, 852078974, 853238404, 854326189, 855369568, 856328666, 857145071, 858173966, 859483421, 860619724, 861415684, 862044513, 862657487, 863319516, 863938987, 864429712, 864724517, 864915073, 865309000, 865730286, 865828335, 865735829, 865604997, 865437567, 865247309, 864853323, 863976598, 862476707, 860436678, 857907295, 854613364, 850346506, 845541418, 841122568, 837918758, 836426437, 836769044, 838511646, 840841293, 843335986, 845768988, 847588181, 848259151, 847559631, 845520914, 842113197, 837067604, 829974890, 820203543, 806903780, 789903164, 770672977, 752537310, 739064753, 731396496, 728033721]
879G28033721j598656k571225n890012j0336160j5002191j9960106k4753451k7472377
895.3F20449543k5891125j9385576r746433Q3804P895291J3586045J8001556K0611584
911.6F25604689K0484984J8055558J4759183J2137115J1035741J1009633J1039198
925.9G24126101J0616958R437263P410824M999340K583861K15530k031326m131377
942.2G53227174o066262p569015q513153q629561p442891n324602l202319k234340
958.5G04245031l725648p981718j4331340k1421433k7223527l0221224l0127585k7722180
974.8E41490376k4504125k1583468j8933058j6372591j4220059j2640148j1517376
989.1D21719551j1030286j1811316j4277012j7930507k1507979k3926586k4829268
$$ y = [728033721, 726435065, 723863840, 717973828, 707637668, 692635477, 672675371, 647921920, 620449543, 594558418, 575172842, 565426409, 565510213, 573405504, 586991549, 604993105, 625604689, 646089673, 664145231, 678904414, 691041529, 702077270, 713086903, 724126101, 734743059, 744180322, 751591146, 756590486, 759174347, 759389877, 757358551, 753227174, 747160912, 739591897, 731078744, 722449183, 715006292, 709681690, 706479371, 704245031, 700519383, 692537665, 678206325, 656784892, 629561365, 599340141, 569212556, 541490376, 516986251, 495402783, 476469725, 460097134, 445877075, 433236927, 421719551, 410689265, 398877949, 384600937, 366670430, 345162451, 321235865, 296406597]
1003.4B96406597k4449289k3288116k1728143j9860193j7813236j5948414j4100001
1017.6A59219205j1883825r443715p067114m746959k300828M92796L775597O991267
1034A35036424R282276J0246962J0183230R965494J0356039J1568994J3407528J5455201
1050.3B25502148J7426625J9051075J9835681J9498646J7834902J4997423J1926114
1064.6C46072614R753227R048075R531647J0467410J1392236J2221485J2904823J3531297
1080.9D34922814J4437706J6087561J8454761K1009892K3165941K4175346K3394585
1095.1E75648606K0594477J6284109J1498272O890059K908885r6500k342641m055083
1111.5F27330184n095124n489171n344391m366457k018035J936853O759525J1067986
$$ y = [296406597, 271957308, 248669192, 226941049, 207080856, 189267620, 173319206, 159219205, 147335380, 137891665, 130824551, 126077592, 123776764, 124269560, 128045157, 135036424, 144318700, 154565662, 164748892, 174714386, 185070425, 196639419, 210046947, 225502148, 242928773, 261979848, 281815529, 301314175, 319149077, 334146500, 346072614, 355825841, 364873916, 374405563, 384872973, 396265209, 408486694, 421391517, 434922814, 449360520, 465448081, 483902842, 504912734, 528078675, 552254021, 575648606, 596243083, 612527192, 624025464, 630915523, 633824408, 633727908, 631385267, 627330184, 622235060, 616745889, 611401498, 607035041, 605017006, 606953859, 613713384, 624781370]
1127.8F24781370J3913036J4829158J3782442J1378407Q397580N297660K122581j608669
1144.1F92893565o189704j0974527j4878153j6812742j6198755j3269007q777201l740907
1160.4F02052569Q69692M587292P592798J0123014J2131751J3399958J3880611J3554275
1176.7F78191960J2142420R480297N472958m8518p068217j5537500k5588036l7066042
1193F19979322m9060106n9837163o6930443o7981541o2121868n0729782l6916300k3799509
1209.4B02602610j3203651n647465n92679K757326M839718N856797N958647N876496
1225.7B08447799O548196Q465037J1588648J5341624J8914551K1824449K3872644K5019586
1242C40022534K5633961K6098967K6534557K6813448K6941627K6953608K6745915K6398182
$$ y = [624781370, 638694406, 653523564, 667306006, 678684413, 687081993, 692379653, 694502234, 692893565, 686703861, 675729334, 660851181, 644038439, 627839684, 614570677, 605793476, 602052569, 602922261, 607509553, 615102351, 625225365, 637357116, 650757074, 664637685, 678191960, 690334380, 699814677, 705287635, 705239117, 698170900, 682633400, 657045364, 619979322, 570919216, 511082053, 444151610, 376170069, 314048201, 263318419, 226402119, 202602610, 189398959, 183751494, 183158815, 185916141, 190755859, 196612656, 202571303, 208447799, 214995995, 223461032, 235049680, 250391304, 269305855, 291130304, 315002948, 340022534, 365656495, 391755462, 418290019, 445103467, 472045094, 498998702, 525744617, 552142799]
1258.3E52142799K5882423K4971545K3983717K3483395K3445606K3494006K3063719
1272.6G20467210K1880567K0114243J7946601J5668690J3510942J1495591R697914
1286.8H30781758Q350849P632434P180512O564498N686283M519701L210187J924634
1303.2H75850856N86391r00984k235830l177404l719628l726482l088058j834929j83641
1321.5H57570291J542270L219962M446149M632950L902435K902925K084792J162648
1337.8H81464422k30372j799524l202796m811704p422745j1795521j8638730k8451383
1354.2H05111647l9709807m7783732m9350202m3653131k9936313j4423907k814770
1368.4E77439785O178916J3669788J9382298K0708323K0211995K1342933K3161232
$$ y = [552142799, 578025222, 602996767, 626980484, 650463879, 673909485, 697403491, 720467210, 742347777, 762462020, 780408621, 796077311, 809588253, 821083844, 830781758, 839132607, 846765041, 853945553, 860510051, 866196334, 870716035, 873926222, 875850856, 876437247, 875536263, 873300433, 870123029, 866403401, 862676919, 859588861, 857753932, 857570291, 859112561, 862332523, 866778672, 871411622, 875314057, 878216982, 880301774, 881464422, 881234050, 879434526, 876231730, 871420026, 863997281, 852201760, 833563030, 805111647, 765401840, 717618108, 668267906, 624614775, 594678462, 580254555, 577439785, 583618701, 597288489, 616670787, 637379110, 657591105, 678934038, 702095270]
1382.7G02095270K5092483K8426528K9653310K5393904K1202147J8043875J2939811
1397H62847328P891894M137754J306355m06384j316131j997113k928316l854931m424333
1415.3H61256123n066276n842447n366266m713416m410267l327847j792013J02699
1431.6H30840290J973986M051924N914450N663454N349338N433381N346835N366206
1448H69939864M930079L974199L246069L679275M563570L952682L989518N508900O480098
1466.3I10264254N842685N551100O031990N298257L725886K760291K163828J706302
1482.6I43344593J270056J074970R41097P40469N97000N77688M98295K03669J24395
1501I49372232K94447L77297J15753m8519K9683P8321N9366L8982J13546J20104j3232
$$ y = [702095270, 727187753, 755614281, 785267591, 810661495, 831863642, 849907517, 862847328, 870739222, 874876976, 876183331, 875776947, 874460816, 872463703, 869535387, 865680456, 861256123, 856189847, 850347400, 844981134, 840267718, 835857451, 832529604, 830737591, 830840290, 832814276, 836866200, 842780650, 848444104, 853793442, 859226823, 864573658, 869939864, 874869943, 878844142, 882090211, 885769486, 890333056, 894285738, 898275256, 903784156, 910264254, 916106939, 921658039, 927690029, 932988286, 936714172, 939474463, 941638291, 943344593, 944614649, 945689619, 946630716, 947371185, 947968185, 948545873, 949044168, 949247837, 949372232, 949666679, 950043976, 950159729, 950111210, 950140893, 950219214, 950278580, 950317562, 950431108, 950551212, 950537980]
1523.4I50537980o2466k9862k0087q285j9014R3580K72870J56283m12285m77255k13086
1545.9I49818373n3585m7743q8334m9055K2054q0347m85182l31044j67907j27375j70588
1568.3I48239267l57092l28183l44753p50422r07839o73711p52807r86516j214743
1586.6I41923201j384020j533329j742780k045930k376020k631128k959549l292799
1603I23957646l695250m152417m559994m671394m452169m816831n865573n072415m030109
1621.3H82641494m300177l960788l166378k534747j674473j050353q81672n36144L994
1639.7H64540756M17709Q13961J181603J525640J457691J931131K948523K478897K230883
1658H79526794K532124K812088K548456J899004J630843J523256R26674K41637n18084
$$ y = [950537980, 950475514, 950445652, 950425565, 950417280, 950398266, 950491846, 950764716, 950920999, 950508714, 950031459, 949818373, 949764788, 949717045, 949628711, 949579656, 949601710, 949521363, 949036181, 948705137, 948537230, 948409855, 948239267, 947882175, 947553992, 947209239, 946458817, 945550978, 944877267, 944124460, 943137944, 941923201, 940539181, 939005852, 937263072, 935217142, 932841122, 930209994, 927250445, 923957646, 920262396, 916109979, 911549985, 906878591, 902426422, 897609591, 891744018, 886671603, 882641494, 878341317, 874380529, 871214151, 868679404, 867004931, 865954578, 865072906, 864536762, 864540756, 864958465, 865772426, 866954029, 868479669, 869937360, 871868491, 874817014, 877295911, 879526794, 882058918, 884871006, 887419462, 889318466, 890949309, 892472565, 893399239, 893640876, 893122792]
1676.4H93122792j057088j303375j943648l697216m498124m567564n761146o381512
1692.7H63913119q433283j1148214j3343215j8919349j9945204k2856116l0933499
1707G38334239l5267413l8680792m2706907m7531307n5063366n1005572l6260576k8907656
1723.3D02910650k3794741j6038865r567677m148812J434535O103724P631958J0741472
1739.6C75272244J3135195J3006657J3781935J5914917K1039307K6782454K9779404
1753.9E08712113L6710620M5716226M9842179N5060923N1152229M0941477L4700036
1768.2H22835803K7874708K2550106J6804099J1148334Q740604P677018O239593N186856
1784.5I29057121M318536L532230L047050K849400K285957J830816J859129J806140
$$ y = [893122792, 892065704, 890762329, 888818681, 885121465, 880623341, 876055777, 870294631, 863913119, 855479836, 844331622, 830988407, 812069058, 792123854, 769267738, 738334239, 703066826, 664386034, 621679127, 574147820, 519084454, 468078882, 431818306, 402910650, 379115909, 363077044, 353509367, 349360555, 350795090, 356898814, 364530772, 375272244, 388407439, 401414096, 415196031, 431110948, 452150255, 478932709, 508712113, 545422733, 591138959, 640981138, 696042061, 747194290, 788135767, 822835803, 850710511, 873260617, 890064716, 901213050, 909953654, 917630672, 923870265, 929057121, 933375657, 936907887, 939954937, 942804337, 945090294, 946921110, 948780239, 950586379]
1800.8I50586379J747250J589716J559734J455307J426518J340806J301289J239717
1817.1I62246716J062930R68039R45925J017392R77993J011252Q80540P36296O02305
1835.5I70449388N28574M97758M58241L87490K24769K00987J73688J79588J93477K75076
1855.9I73569036J83343M1604N7221J56999J95682J40130J31309R3758J40369J20938
1876.2I74830389O676o3837L1889J28030J85609J07587n1141J5736L6656o735p4208
1898.7I75146651j76608k49088k24710k25305k13206j36375j08898j34647k12550j92046
1919.1I73273218j25647r0241j06633j43528j10686j7285j5438n8532n6684p4446o5207
1941.5I72408891l0995K6048j0729j06931r3758M4227J15275O7651M3988P6473J45912
$$ y = [950586379, 952333629, 953923345, 955483079, 956938386, 958364904, 959705710, 961006999, 962246716, 963309646, 964277685, 965223610, 966241002, 967218995, 968230247, 969110787, 969847083, 970449388, 970977962, 971475720, 971933961, 972321451, 972546220, 972747207, 972920895, 973100483, 973293960, 973569036, 973752379, 973793983, 973851204, 974008203, 974203885, 974344015, 974475324, 974569082, 974709451, 974830389, 974837065, 974773228, 974805117, 974933147, 975118756, 975226343, 975175202, 975190938, 975227594, 975220859, 975146651, 974970043, 974720955, 974496245, 974270940, 974057734, 973921359, 973812461, 973677814, 973465264, 973273218, 973147571, 973057330, 972950697, 972807169, 972696483, 972679198, 972663760, 972605228, 972548544, 972474098, 972408891, 972377896, 972403944, 972393215, 972286284, 972192526, 972236753, 972352028, 972419679, 972463667, 972540140, 972686052]
1963.9I72686052J39892J16229J95742K55227K20955J57416R0718J22607J69634J03176
1984.3I74257648O8128M7982k3782j5974L5882j8180p1466p6473n5730k7358o2943
2006.8I74057734j27137j71244k03073k29597j97232j08242l9756L755J1265k3722
2027.2I72972751q226J7703j013O556O199n8949r6560m0114K9445N5850J9908n4837
2051.6I72848713p7247n3644n4956n5909l6776m8399r0718o1393K9445K9981p1585
2074.1I72357512j19150p5817j09673j97291k03371k03073k74122k97964k10225j86384
2094.5I70480442k42472k22325j88887k29299k61069k28822j85430j97947k27272j94609
2114.9I68302310j18971p6712K5392J19448M2796J6153O3240N0187Q6069J73390J95980
$$ y = [972686052, 972825944, 972942173, 973137915, 973393142, 973614097, 973771513, 973862231, 973984838, 974154472, 974257648, 974325776, 974373758, 974349976, 974334002, 974369884, 974351704, 974280238, 974203765, 974148035, 974120677, 974057734, 973930597, 973759353, 973556280, 973326683, 973129451, 973021209, 972981453, 972985208, 972996473, 972972751, 972964525, 972982228, 972981215, 972987771, 972993970, 972935021, 972838461, 972798347, 972827792, 972883642, 972903550, 972848713, 972771466, 972717822, 972662866, 972606957, 972570181, 972521782, 972431064, 972369671, 972399116, 972429097, 972357512, 972238362, 972162545, 972052872, 971855581, 971652210, 971449137, 971175015, 970877051, 970666826, 970480442, 970237970, 970015645, 969826758, 969597459, 969336390, 969107568, 968922138, 968724191, 968496919, 968302310, 968183339, 968106627, 968132019, 968251467, 968294263, 968310416, 968373656, 968423843, 968509912, 968683302, 968879282]
2137.3I68879282J75059J70470K12431K18570J68979J86861K23875K88069L49521L05057
2157.7I71178174K20060K10345K65598K62440K10464K34306L17573L08752K21074J39832
2178.1I73568618R5010J00494J31309J44243J55031J93179J84000J10328Q8513J28209
2198.5I74898934P7606L6656R6739J19924J04845Q4639N7220P1108J23144J17003Q8990
2220.9I75876808J09196J01089L8743j1384l0816j4364L8266O8545M3571j2278j8061
2243.3I76189315P093k5689k8432L6121L9398k2053k2769O3419R5069P391p7009q9943
2267.8I76171911m1425O1690J25945R7215L5823j2994M3928J53303J37270N9307M7564
2290.2I76879537R6619J65522J98603J56105J19745J42217Q3506n7161r0062k9803
$$ y = [968879282, 969054341, 969224811, 969437242, 969655812, 969824791, 970011652, 970235527, 970523596, 970873117, 971178174, 971398234, 971608579, 971874177, 972136617, 972347081, 972581387, 972898960, 973207712, 973428786, 973568618, 973663628, 973764122, 973895431, 974039674, 974194705, 974387884, 974571884, 974682212, 974770725, 974898934, 974976540, 975013196, 975109935, 975229859, 975334704, 975419343, 975476563, 975547671, 975670815, 975787818, 975876808, 975986004, 976087093, 976125836, 976114452, 976083636, 976069272, 976107538, 976176083, 976219654, 976207376, 976189315, 976196408, 976170719, 976142287, 976178408, 976217806, 976195753, 976172984, 976236403, 976331472, 976338863, 976261854, 976171911, 976130486, 976192176, 976318121, 976415336, 976451159, 976438165, 976482093, 976635396, 976772666, 976831973, 976879537, 976976156, 977141678, 977340281, 977496386, 977616131, 977758348, 977841854, 977784693, 977694631, 977664828]
2310.6I77664828N1797J72317K25842J74105L3557j43051j25289P630J09970K70486
2331I78442192J96815l4809R000L6001j69992l09051k83598j31131P8261K02179J57297
2353.5I78193164N3406R179j24514j39773N8412P1466q8453j42276j09375p2419o736
2375.9I77702081m5478j54317j04487K3425M9830M3630O1512L9041j3590p5936j43766
2398.3I77381945j77086j36852p0393o2108q1360n5433o3956q6605j7047J3769K8967
2420.7I76673841J17183J16050J3710m5062o1988o2705j2397L7670K5272M1187N7519
2443.2I76900280j3888p7725j06811j00613o7115N722K5273k9028L7134N7041o9975
2465.6I76560295j32025o3836M0054Q2493N9068J8597J6153M7922N0187K7954M9830
$$ y = [977664828, 977716625, 977888942, 978114784, 978288889, 978322446, 978179395, 978054106, 978061736, 978171706, 978442192, 978639007, 978604198, 978613198, 978649199, 978479207, 978170156, 977886558, 977755427, 977833688, 978035867, 978193164, 978246570, 978255749, 978131235, 977991462, 978049874, 978121340, 978032887, 977890611, 977781236, 977708817, 977702081, 977656603, 977502286, 977397799, 977421224, 977471054, 977514684, 977576196, 977615237, 977601647, 977525711, 977381945, 977204859, 977068007, 976997614, 976935506, 976854146, 976798713, 976734757, 976648152, 976631105, 976644874, 976673841, 976791024, 976907074, 976920784, 976875722, 976813734, 976751029, 976738632, 976776302, 976801574, 976842761, 976900280, 976886392, 976808667, 976701856, 976601243, 976534128, 976539850, 976565123, 976536095, 976573229, 976630270, 976560295, 976428270, 976364434, 976404488, 976486981, 976546049, 976564646, 976580799, 976628721, 976678908, 976706862, 976756692]
2488I76756692N9247K4080L8624M4107p092N7876J44183O2347K5451P0572N8353K1815
2512.5I77356255k0444j2815N4240Q1479R3818J05441O2287N9068J04785M4405m8637
2535I77879882R775R1434m054j29938o5386L7313k1816r4056j9550Q0406L7969p2837
2559.4I77729142j04547q5652q4400m2677O795j5676l4869k6583k2352l2365m6492
2581.9I77240324p7784j00553n3883m8160o4731l4332n8651j27018j15335m3511k0564
2604.3I76495802J6034N1498j4185r0182j36018j80900j26064j5557q642o3241j25408
2626.7I75803137j65701j42574j04189r3103q8334m6790O5923J53840O1571j12712
2647.1I75331068j29044p272R2983J70410J54257k2054j37090n2453N2333N0485j7106
$$ y = [976756692, 976815939, 976840019, 976878643, 976922750, 976915658, 976973534, 977117717, 977180064, 977205515, 977276087, 977334440, 977356255, 977335811, 977322996, 977377236, 977458715, 977552533, 977657974, 977720261, 977779329, 977884114, 977928519, 977879882, 977889657, 977981091, 977977037, 977847099, 977781713, 977819026, 977797210, 977703154, 977683604, 977764010, 977801979, 977729142, 977624595, 977538943, 977454543, 977411866, 977418661, 977402985, 977368116, 977341533, 977319181, 977286816, 977240324, 977162540, 977061987, 977008104, 976959944, 976895213, 976860881, 976802230, 976675212, 976559877, 976516366, 976495802, 976511836, 976563334, 976549149, 976458967, 976322949, 976142049, 976015985, 976000428, 975991786, 975928545, 975803137, 975637436, 975494862, 975390673, 975297570, 975209236, 975162446, 975228369, 975382209, 975443780, 975331068, 975202024, 975194752, 975287735, 975458145, 975612402, 975590348, 975453258, 975400805, 975453138, 975503623, 975486517]
2669.5I75486517j02818q2910M7147J01090j5140j39773o4790O2644M5717l1650q4698
2692I75221336j16706j31845j13905n6684l8862n4181q0466j62900j90913j20759k6763
2714.4I74127352J0431m3809j32501j96219j54614q3685r4712o9440P9334J48535O4790
2736.8I73655462O2287J19031Q4638J8180k0087o855P6950J48415Q9825q226J490M7744
2761.3I74268854Q106p1228j05738j40965j47522n7041J0669J19o8903j46151r1791
2783.7I73458409n5849j64509k39253k37525j68740j11878j41323j40428j52767k02418
2804.1I71843719j94728k13563j98663j11878j15036j44721j46448j92583k35200k15828
2824.5I70075071j68085j56880j98722l04937n11527o96957o88315o26385p27772j011849
$$ y = [975486517, 975383699, 975300789, 975347936, 975449026, 975433886, 975294113, 975229323, 975291967, 975337684, 975306034, 975221336, 975104630, 974972785, 974858880, 974802196, 974763334, 974709153, 974628687, 974465787, 974274874, 974154115, 974127352, 974137783, 974093974, 973961473, 973765254, 973610640, 973526955, 973432243, 973362803, 973442137, 973590672, 973655462, 973717749, 973836780, 973921418, 973939598, 973919511, 973912656, 973989606, 974138021, 974227846, 974219620, 974221110, 974268854, 974276960, 974205732, 974099994, 973959029, 973811507, 973754466, 973765135, 973765254, 973696351, 973550200, 973458409, 973402560, 973238051, 972998798, 972761273, 972592533, 972480655, 972339332, 972198904, 972046137, 971843719, 971648991, 971435428, 971236765, 971124887, 971009851, 970865130, 970718682, 970526099, 970290899, 970075071, 969906986, 969750106, 969551384, 969246447, 968734920, 968037963, 967349648, 966723263, 965995491, 964983642]
2844.9I64983642j269758j254320j071095r37104r42588j062811j147508j183927j181007
2863.3I54933524j087367j022518j056492j095713j056134r58324q80778p49945n38290
2881.6I46487963m34756m42982m54783l33011m1962R3639J30474L15667M58896M82380
2902I46261525M20153K92361K03610J27911j5795k54870m70578n32508m85778m16219
2922.4I45129812m24505m91917o86824r85920j175881j324534j273752q94188m47333
2940.8I37424958k0266L55303M68910L58522K88069J75119n9366j88888q5115K05994
2961.2I38923240O54816J283229J966119K394139K491117K359152J958370J505077
2977.5I53535259J278519J177788R37224O01589M52102M17470L82483M28677M98653
$$ y = [964983642, 963713884, 962459564, 961388469, 960451365, 959508777, 958445966, 957298458, 956114531, 954933524, 953846157, 952823639, 951767147, 950671434, 949615300, 948656976, 947776198, 947026253, 946487963, 946053207, 945610225, 945155442, 944822431, 944780469, 944874108, 945004582, 945320249, 945779145, 946261525, 946681678, 946974039, 947177649, 947305560, 947289765, 947034895, 946564317, 946031809, 945546031, 945129812, 944705307, 944213390, 943526566, 942540646, 941364765, 940040231, 938766479, 937872291, 937424958, 937404692, 937759995, 938228905, 938587427, 938875496, 939050615, 938991249, 938802361, 938717246, 938923240, 939578056, 940861285, 942827404, 945221543, 947712660, 950071812, 952030182, 953535259, 954813778, 955991566, 956928790, 957530379, 957982481, 958399951, 958782434, 959211111, 959709764]
2995.8I59709764M84824M86374O18815O60539M74393L31640L26097K28048Q6665Q4460
3016.2I63491619J25169J28568J15811J40906L00467N15222N76020M61518L18110K23697
3036.6I66397107J79946K59161M21882L96549J68801K146k4021L7730O1273O8963J35898
3059.1I68105435P0691p2479p9214k2650J2696J1325o2943j28865r6560k622Q9228
3081.5I67824042L1471q5413j18494k37286l24548k23994r7871o735j2160k12907l97325
3103.9I66138780k76685l8981J3888j1087l2663j83880l85762l96490j90317J9192
3124.3I64655995L2902p9751j78158l39866m21464k39432q2195j95265l58045k52187
3144.7I62542534j06275k31862l62873l19898k99871l45290l53813l47436l69489l80397
$$ y = [959709764, 960194588, 960680962, 961299777, 961960316, 962434709, 962766349, 963092446, 963320494, 963407159, 963491619, 963616788, 963745356, 963861167, 964002073, 964302540, 964817762, 965393782, 965855300, 966173410, 966397107, 966577053, 966836214, 967258096, 967654645, 967823446, 967825592, 967801571, 967839301, 967900574, 967969537, 968105435, 968176126, 968103647, 968024433, 968001783, 968014479, 968025804, 967962861, 967833996, 967737436, 967734814, 967824042, 967855513, 967770100, 967651606, 967414320, 967089772, 966865778, 966767907, 966761172, 966749012, 966536105, 966138780, 965862095, 965823114, 965837002, 965825915, 965793252, 965609372, 965223610, 964827120, 964636803, 964655995, 964688897, 964609146, 964430988, 964091122, 963669658, 963430226, 963348031, 963152766, 962794721, 962542534, 962436259, 962204397, 961841524, 961521626, 961221755, 960876465, 960522652, 960175216, 959805727, 959425330]
3165.1I59425330l59952l69728m33743m38750k78890j85132k99156m19616n32031o22750
3185.5I55485582n58078l53157k06948l03328n40912o24299n24402m29332l54528l73543
3205.9I51217055n14269n72979n11348m88758n41866n44191l87370k53797l64005n39363
3226.3I46499109n56349m30406l21745l34263m12286m64737m32670l71814l31700k90334
3246.7I42552805k79844l49223m23253m32611m39107m08232k97010k47896l21448l67343
3267.1I38986838l63529k96712j32441j96576l92139l85046k94745j86384k46108m72903
3287.5I36020255m76241l06070k51651k51949k43783k78532l32713m37200m63009l93272
3307.8I32585835m10258m44472m05193l40282k79427l15249n55038o84441n24282l80993
$$ y = [959425330, 959065378, 958695650, 958261907, 957823157, 957544267, 957359135, 957059979, 956640363, 956108332, 955485582, 954927504, 954574347, 954367399, 954064071, 953523159, 952898860, 952374458, 951945126, 951590598, 951217055, 950702786, 950129807, 949618459, 949129701, 948587835, 948043644, 947656274, 947402477, 947038472, 946499109, 945942760, 945512354, 945190609, 944856346, 944444060, 943979323, 943546653, 943174839, 942843139, 942552805, 942272961, 941923738, 941500485, 941067874, 940628767, 940220535, 939923525, 939675629, 939354181, 938986838, 938623309, 938326597, 938194156, 937997580, 937605441, 937220395, 936925650, 936739266, 936493158, 936020255, 935544014, 935237944, 934986293, 934734344, 934490561, 934212029, 933879316, 933442116, 932979107, 932585835, 932175577, 931731105, 931325912, 930985630, 930706203, 930390954, 929835916, 929151475, 928627193, 928246200]
3328.2I28246200l50177m72188o40810o47425o51420o88552o15299n02348m97937n36681
3348.6I22643363n21183n41925n85437o02603o78837p59125p07745o26266o45578o40035
3369I16334629m91679m17888o16550p36237n53608m68969n94974o45816o64949p05064
3389.4I10438895o17921m99308m93050m81844m40597m09186l50595m32372n64396n90503
3409.8I05559123o39022n59568l68595l65317m83632m67122m16517m98355n28693m36902
3430.2I00795400l74257m00067m66704m52101l23594k99215l67284l19600k11001k13623
3450.6H97367954k91168k42711j64747j29223j01626k02477l90708l93689j23381L4511
3471H95362735M17l5942j38819j07348J55092K49028K34306L40342L39806L07203L70502
$$ y = [928246200, 927896023, 927423835, 926783025, 926135600, 925484180, 924795628, 924180329, 923677981, 923180044, 922643363, 922122180, 921580255, 920994818, 920392215, 919713378, 918954253, 918246508, 917620242, 916974664, 916334629, 915842950, 915425062, 914808512, 914072275, 913518667, 913049698, 912454724, 911808908, 911143959, 910438895, 909820974, 909321666, 908828616, 908346772, 907906175, 907496989, 907146394, 906714022, 906149626, 905559123, 904920101, 904360533, 903991938, 903626621, 903142989, 902675867, 902259350, 901760995, 901232302, 900795400, 900421143, 900021076, 899554372, 899102271, 898778677, 898479462, 898112178, 897792578, 897581577, 897367954, 897076786, 896834075, 896669328, 896540105, 896438479, 896236002, 895845294, 895451605, 895328224, 895362735, 895363152, 895327210, 895188391, 895081043, 895236135, 895485163, 895719469, 896059811, 896399617, 896706820, 897077322]
3493.4H97077322L74436L29972K56717K24769M76778O99937N45323M09603M27723M08113
3513.8I01230693M36485M53531L36349K97964L90768M55022M91857N52953N38945L93331
3534.2I05577898L92079M86613L48508K74360N24938P32541O67870N25356M81069N08547
3554.6I10519779O11067O82711N13852L74377M75287N79357N35786N82874P01249N94318
3575I16170657L38852L35872O10888O70195N37097O70076Q50320O60121M16875M50790
3595.4I21711743O38485O19769N25117P34508R37402Q44836P00295O97017P77066Q99792
3615.8I29086030J044929J063823R44197R95100J282454J605451J480341J146435J211226
3634.1I39859986J462221J732350J901865J940787J957833K015114K133906K016425
$$ y = [897077322, 897451758, 897781730, 898038447, 898263216, 898739994, 899439931, 899985254, 900394857, 900822580, 901230693, 901667178, 902120709, 902457058, 902755022, 903145790, 903600812, 904092669, 904645622, 905184567, 905577898, 905969977, 906456590, 906805098, 907079458, 907604396, 908336937, 909004807, 909530163, 910011232, 910519779, 911130846, 911813557, 912327409, 912701786, 913177073, 913756430, 914292216, 914875090, 915576339, 916170657, 916509509, 916845381, 917456269, 918126464, 918663561, 919333637, 920183957, 920844078, 921260953, 921711743, 922350228, 922969997, 923495114, 924229622, 925167024, 926011860, 926712155, 927409172, 928186238, 929086030, 930130959, 931194782, 932138979, 933134079, 934416533, 936021984, 937502325, 938648760, 939859986, 941322207, 943054557, 944956422, 946897209, 948855042, 950870156, 953004062, 955020487]
3650.5I55020487J688123J675546J796484J597643J491666J642823J724482J691580
3666.8I68328834J603126J331329J016319J136720J308144R84489P15137O83188O22273
3685.1I77729559N72622O18040N15879L34143M30584O20723M29213M1604J848K87235
3705.5I81581450L97205J70827r6321j5855P9989m9710j03474n4538L5584K02835K51174
3727.9I82399166J25229O0320J27375M4584r0062K5212K41161K35498o5446j56105
3748.3I82946932k4974j0788n7877o7770j00493M2974K52068K93494K17438M7385j24335
3770.8I83414054j46031M8458K63214J35601j02520j51992k29538k09927m2558J59502
3791.2I83138263L06666J93000M9770O6578j87814l36111J491J29997Q1837J99080
$$ y = [955020487, 956708610, 958384156, 960180640, 961778283, 963269949, 964912772, 966637254, 968328834, 969931960, 971263289, 972279608, 973416328, 974724472, 975708961, 976424098, 977107286, 977729559, 978302181, 978920221, 979436100, 979770243, 980200827, 980821550, 981250763, 981292367, 981294215, 981581450, 981978655, 982149482, 982053161, 982037306, 982117295, 982067585, 981964111, 981909573, 981945157, 982147992, 982399166, 982524395, 982584715, 982712090, 982756674, 982666612, 982691824, 982932985, 983168483, 983103037, 982946932, 982921958, 982911170, 982853293, 982785523, 982685030, 982728004, 982980072, 983273566, 983491004, 983538389, 983414054, 983268023, 983316481, 983579695, 983715296, 983612776, 983460784, 983231246, 983021319, 982978761, 983138263, 983444929, 983637929, 983687699, 983754277, 983566463, 983230352, 983231843, 983361840, 983443677, 983642757]
3811.6I83642757K08855q405j94430k61784k08914J06394J68324n0962k2113J84893
3831.9I83564615L32415K19941k24530k16007N1856j40071l15905p4089K95282J03652
3852.3I83597159n19871k09391K01225K87831J53601k40028l12269N1141J54495j07765
3872.7I83056128q0585K02059K23458J8001o5089k0742m2081j19150l9398K0087q5533
3895.2I83067155j17362j84595j65344J50741L47137K21849m2201j94549j81139j54912
3915.6I82746780j10447m9711O6400N6803r9480O497J02937o5446j37389r4771j1504
3938I82410669J04189K265n8353J30773M5955k07841j42157K1815L4571L5464R0182
3960.4I82467532O0558p7009j58846r8288Q7738J69575m7326j56581l4035r5606j68204
$$ y = [983642757, 983851612, 983843207, 983648777, 983386993, 983178079, 983284473, 983452797, 983401835, 983379722, 983564615, 983897030, 984116971, 983892441, 983676434, 983728290, 983588219, 983272314, 983198225, 983493507, 983597159, 983077288, 982867897, 983069122, 983356953, 983510554, 983270526, 982958257, 983009398, 983163893, 983056128, 982975543, 983177602, 983401060, 983419061, 983353972, 983333230, 983291149, 983171999, 983132601, 983152688, 983067155, 982949793, 982765198, 982599854, 982750595, 983097732, 983319581, 983277380, 983082831, 982901692, 982746780, 982636333, 982586622, 982653022, 982709825, 982610345, 982616842, 982719779, 982654333, 982516944, 982422173, 982410669, 982514858, 982517123, 982458770, 982589543, 982635498, 982427657, 982285500, 982307315, 982341886, 982377350, 982467532, 982528090, 982451081, 982292235, 982193947, 982281685, 982451260, 982403934, 982247353, 982213318, 982117712, 981949508]
3982.9I81949508j311J59323J72198R9003J6093o2406q2194
3997.1I82250214
$$ y = [981949508, 981948197, 982107520, 982279718, 982378721, 982394814, 982332408, 982250214]
##END=$$ End of the data block
