##TITLE=$$ Begin of the data block
##JCAMP-DX=5.00 $$ ACD/SpecManager v 10.08
##SPECTROMETER/DATA SYSTEM=Alpha
##DATE=13 Jun 2014 08:26:00
##DATA TYPE=INFRARED SPECTRUM
##DATA CLASS=XYDATA
##ORIGIN=
##OWNER=
##NPOINTS=1765
##FIRSTX=399.75695801
##LASTX=3997.56933594
##MAXX=3997.56933594
##MINX=399.75695801
##MAXY=0.72398889
##MINY=0.29152244
##XFACTOR=1.0000000000
##YFACTOR=1.000000000000000e-9
##FIRSTY=0.60804087
##DELTAX=2.03957629
##XUNITS=1/CM
##YUNITS=ARBITRARY UNITS
##XYDATA=(X++(Y..Y))
399.8 608040869 608675420 607752979 607581437 608648062 608478427 607751429 607783675 607111573 605848789 605537832
420.2 605537832 604678988 603245080 603097022 603174984 602329493 602427959 603584409 604001701 604653895 606065810
440.5 606065810 606272876 605608046 605841339 605862081 604827940 604178131 603523552 601419926 599374056
458.9 599374056 598170698 596026480 593495667 592056215 591066718 590668440 592170775 594336629 595853567
477.3 595853567 597950220 600541234 602082968 603369176 605198801 606068075 606106043 606823087 607348859
495.6 607348859 606913924 606700063 606720567 606215000 605893075 606011271 605457723 604423940 603828847 602810264
516 602810264 601041377 599929154 599176228 597580850 596021831 595163465 593829334 592206955 591411769
534.4 591411769 590873063 590110481 590008497 590464950 590666950 591229022 592384756 593047619 593291163 593782544
554.8 593782544 594090700 594203353 594927311 595966697 596597552 597370386 598566830 599394560 599858046
573.1 599858046 600450575 600791633 600846112 601388395 602114797 602328181 602651596 603323996 603643656 603876770
593.5 603876770 604501605 604874492 604840159 604988515 604937553 604338050 603961051 603924811 603565156 603163064
613.9 603163064 603235483 603416860 603753626 604852378 606170893 606997132 607994914 609346807 610268831
632.3 610268831 611097157 612465739 613592982 614244819 615278482 616347015 616802812 617372692 618311167
650.6 618311167 618616819 618431866 618602574 618468940 617802322 617841363 618525207 618477702 617984176 618540168
671 618540168 619072199 619512856 620661438 621711671 622098744 622856915 623866260 624096215 624265611 625072837
691.4 625072837 625424206 625171602 625438869 625995159 626271665 626961112 627896786 627920270 627513826 627751470
711.8 627751470 628241897 628844261 630246699 631873012 633055210 634926319 637671590 639826119 641579032
730.2 641579032 643771768 645367682 646049440 647086978 648195088 648461699 648968220 650229931 650910378
748.5 650910378 651246607 652477920 653689504 654214442 655377746 657042861 657845557 658537030 659915090
766.9 659915090 660658240 660726905 661525548 662349045 662252128 662537813 663531959 663883328 664102912 665129960
787.3 665129960 665731907 665580511 666124344 666969955 667020738 667400837 668475866 668714881 668463290 668911934
807.7 668911934 668985426 668184459 668020129 668383360 668126881 668264747 669603467 670783162 671720803 673668087
828.1 673668087 675739467 676973760 678597510 680611551 681526065 681905806 682721078 682800472 681867480
846.4 681867480 681405842 680793047 678713918 677339435 678568244 680656433 682384670 683760047 683075428
864.8 683075428 678751826 670918107 660254478 649297833 642271459 641756654 647884190 659006298
881.1 659006298 671495676 681237161 687061846 690783918 693107069 693368912 692658126 692118227 690671742
899.4 690671742 688186407 686365366 685182571 683698177 682723284 682550728 682086289 681695461 682194948
917.8 682194948 682412803 681638360 680933118 680141807 678310275 676356971 675070226 673524261 671798050
936.2 671798050 670886278 670089900 668629766 667503834 667064488 666471899 666018307 666012824 665274501 663519263
956.6 663519263 661717772 659562349 656421721 653210044 650348961 646973073 643266797 639931917
972.9 639931917 636319995 631984830 627648830 623242438 618132412 612966061 608343720 603634894
989.2 603634894 598800778 594485521 590311885 585867882 581791639 578141928 574292302 570673764
1005.5 570673764 567992330 565907240 564225137 563266873 562431514 560780644 558528721 555979013 552751124
1023.9 552751124 549077630 545613945 542363346 539592564 538317978 538860798 540628970 543204188
1040.2 543204188 546009123 548072755 549231231 549971759 550211370 549818397 549318314 549073815 549183369
1058.5 549183369 550213099 552423358 555047929 557416022 559499741 561094522 561936438 562361896 562673569
1076.9 562673569 562689185 562587619 562921107 563572884 564170241 564989328 566136658 567222774 568265736
1095.2 568265736 569431365 570453763 571272910 572180271 573001027 573405981 573652446 574095547 574919045
1113.6 574919045 576399207 578476608 580559671 582373202 584297657 586482823 588786721 591470182
1129.9 591470182 594569981 597556472 600307167 603045166 605458021 607136667 608297586 609131515
1146.2 609131515 609412193 609199464 608810842 608189464 607208669 606112599 605118454 604464769 604830682
1164.6 604830682 606557310 609084666 611948848 615178406 618540823 621644557 624556780 627362311
1180.9 627362311 629764497 631690979 633303523 634392262 634807527 634849846 634548008 633696079 632586420
1199.3 632586420 631543577 630367577 629113495 628281713 627817929 627292871 626776576 626379132 625841141
1217.6 625841141 625210762 624757111 624269247 623534501 622823238 622131824 621173978 620265365 619798064 619410455
1238 619410455 618824899 618358195 617977977 617375076 616804719 616544545 616308630 615975678 615790308 615632176
1258.4 615632176 615338147 615282774 615586340 615822196 616021276 616509080 617045462 617384791 617781162 618203878
1278.8 618203878 618428826 618892550 619859517 620745420 621261001 621760726 622154593 622145534 622074902 622062504
1299.2 622062504 621599555 620758593 620002806 619030356 617582321 616127491 614863992 613559127 612574399
1317.6 612574399 612404644 612534463 612430394 612303615 611958206 610890865 609501839 608245313 606833637
1335.9 606833637 605432332 604902029 605067611 605051339 604866743 604530573 603578508 602187216 600887537
1354.3 600887537 599448621 597630441 595742404 593959332 592311263 590790212 589164615 587158501
1370.6 587158501 584899008 583040178 581661880 580011547 578008950 575826824 573372304 570959628
1386.9 570959628 568967164 566653371 563043952 558615923 554229140 549499750 544740021 540075958
1403.2 540075958 534725726 529324174 524433732 519465685 514258742 509280145 504472613 500022829
1419.5 500022829 497394651 496448278 496228099 496336073 497109294 498594999 499938458 501340687 503615856
1437.9 503615856 505754411 507225096 508476198 509465933 510126531 510994136 511971831 512299001 512284577
1456.2 512284577 513729513 515916228 517236233 518202722 519475758 520430446 520909011 521896124 523679197
1474.6 523679197 525495946 527210295 528585553 529389977 529849410 530188501 530571342 531631529 533153772
1493 533153772 534164071 534826040 536285818 538155138 539071560 538829625 539254427 541212916 542795002
1511.3 542795002 543631017 543921590 543977141 544320583 545353532 546797574 548146546 549733877 551140785
1529.7 551140785 551658869 552069366 552901685 552973509 552517951 553970218 556656599 559068203 561111629
1548 561111629 562898755 564230859 565059900 565406382 565542877 567314446 569740713 570948303 570853233
1566.4 570853233 570130527 569491267 568731368 567158580 565193892 563945234 562734246 561105967 559268057
1584.7 559268057 557001293 554477334 552002072 549306333 546388626 543775380 541323543 538577735
1601.1 538577735 535866857 533443391 530899227 528268039 526039422 523901701 521107316 518235803
1617.4 518235803 516574025 514973879 512902856 511444271 510466397 509625316 509104192 508392155 507505774
1635.7 507505774 508095562 509699762 510955751 511558652 512093842 513484180 515086174 516390204 518934906
1654.1 518934906 522370517 525274992 527773499 530338049 533227801 535902143 538410664 541413844
1670.4 541413844 544717789 548269987 552100241 555471420 558165491 560734212 564779401 569790423
1686.7 569790423 574363470 578635991 582172215 585548401 589385748 593669653 599155843 604239464
1703 604239464 608502746 612886488 616962552 620197117 622411311 624082267 626551032 630033612 633146644
1721.4 633146644 635679126 637846053 639508426 640755355 641775608 643253505 645736575 648197591
1737.7 648197591 650530279 653097093 655826390 658514321 661126137 664362907 668435097 671990991
1754 671990991 674746573 677301347 679664373 682001889 684268415 686036348 687190592 687986255 689347804
1772.4 689347804 691452980 693155646 694227636 695171833 696087122 696835935 697548509 697939396 697872877
1790.7 697872877 698380351 699652731 700564742 701033473 701855719 703159451 704326093 705249667 706144929
1809.1 706144929 707110822 708234251 709432483 710439444 711231411 711904645 712356031 712628126 712932289
1827.4 712932289 713563859 714621365 715585709 716295242 716877818 717109740 716970801 717002630 717606664 718439817
1847.8 718439817 719253540 719821453 720041811 720307589 720704734 720933378 721089184 721240103 720946968 720565498
1868.2 720565498 721128941 722077847 722491384 722661376 722942531 723044634 722983837 723118722 723197103 723000705
1888.6 723000705 723102689 723492682 723582387 723588645 723830819 723988891 723924935 723925352 723922849 723751247 723757148
1911.1 723757148 723973036 723825276 723404467 723380268 723478317 723368227 723476291 723740637 723700047 723525286
1931.5 723525286 723569810 723551095 723252177 722922981 722676992 722541988 722648501 722869873 722827673 722533941
1951.9 722533941 722379923 722314000 722071946 721879601 721838892 721580267 721184850 721118391 721175909 721023202
1972.3 721023202 720900178 720841229 720601499 720339775 720250070 720053792 719658434 719357073 719106853 718813658
1992.6 718813658 718716383 718727946 718500793 718147397 717961371 717774749 717407644 717106044 716906965 716555715
2013 716555715 716152966 715922654 715698063 715351462 715083182 714862287 714499176 714163244 713962913 713641465
2033.4 713641465 713211656 712916791 712634563 712257028 711988091 711798668 711469233 711124420 710923553 710682333
2053.8 710682333 710357189 710137546 709937096 709578991 709232509 709050477 708840728 708543539 708332658 708128870
2074.2 708128870 707799613 707504690 707310855 707033455 706705987 706488371 706221879 705834806 705550253 705343783
2094.6 705343783 705004454 704638362 704396427 704117835 703752637 703453481 703183293 702832162 702471435 702180564
2115 702180564 701883495 701561213 701311171 701066315 700751305 700487733 700261712 699938834 699595094 699346185
2135.4 699346185 699123502 698902249 698765039 698636353 698394954 698155344 698019862 697869837 697639883 697425067
2155.8 697425067 697257638 697078168 696911275 696779609 696619749 696450412 696324110 696176708 695989788 695855379
2176.2 695855379 695747852 695585430 695452988 695401192 695292354 695105255 694968343 694867492 694708586 694545388
2196.6 694545388 694431722 694267511 694069922 693968713 693897486 693738699 693556905 693384290 693145096 692899227
2217 692899227 692735016 692573428 692360282 692175031 692007005 691752434 691478074 691293001 691116691 690910697
2237.4 690910697 690762818 690616667 690381467 690169930 690054536 689897060 689657986 689449549 689252198 689023077
2257.8 689023077 688847303 688719809 688521504 688306451 688178480 688028038 687797964 687590659 687400401 687178016
2278.2 687178016 686986625 686789513 686459959 686080694 685804069 685572147 685300231 685053349 684821725 684502959
2298.6 684502959 684132874 683807135 683467150 683059216 682682931 682328343 681911230 681470990 681011915 680487812
2319 680487812 679989398 679636240 679307640 678856313 678396225 678029776 677668512 677279174 676901698 676536500
2339.4 676536500 676256478 676298618 676567316 676431000 675799012 675043941 674306393 673561990 672960401 672591627
2359.8 672591627 672441185 672482252 672562301 672604740 672770083 673070729 673284411 673377752 673451662 673444748 673296213
2382.2 673296213 673131645 673006833 672785342 672451973 672137022 671809316 671417296 671074867 670796692 670461476
2402.6 670461476 670063555 669678926 669292569 668885887 668522060 668172777 667753100 667332947 666956782 666525900
2423 666525900 666064680 665688872 665316403 664842725 664381981 663963735 663477898 662982225 662553966 662111998
2443.4 662111998 661633670 661190152 660737813 660206854 659687996 659235835 658744097 658198178 657675683 657125056
2463.8 657125056 656503677 655908406 655353248 654731274 654052854 653396547 652702808 651926577 651188731 650509357
2484.2 650509357 649762392 648973644 648228049 647456467 646643937 645900130 645188093 644437134 643740833 643097043
2504.6 643097043 642381728 641625702 640948832 640310884 639613986 638926268 638294458 637646973 637024701 636490643
2525 636490643 635982752 635500252 635107517 634725988 634275734 633849025 633488894 633113563 632721722 632334888
2545.4 632334888 631903470 631453395 631091654 630793154 630416453 629985094 629570305 629074275 628517449 628060997
2565.8 628060997 627653360 627186537 626708269 626215219 625666142 625107050 624576807 624044716 623485744 622924626
2586.2 622924626 622362673 621789396 621234179 620697320 620134890 619552970 618976474 618374109 617740035 617137909
2606.6 617137909 616582215 616006434 615415692 614879489 614349365 613743722 613124073 612531960 611932039 611348271
2626.9 611348271 610764444 610126793 609487057 608907878 608332872 607700527 607057571 606424749 605748951 605055690
2647.3 605055690 604418874 603810072 603171706 602498412 601788819 601049066 600351214 599756479 599172115 598501444
2667.7 598501444 597790182 597091258 596402287 595727980 595083356 594432473 593738139 593040645 592342913 591594517
2688.1 591594517 590853930 590182662 589527845 588879824 588241875 587545574 586807609 586134493 585531712 584902704
2708.5 584902704 584223032 583552063 582904279 582269669 581673503 581104517 580515444 579928279 579349399 578738689
2728.9 578738689 578148484 577608645 577083707 576578856 576089740 575597644 575114608 574656248 574198067 573722541
2749.3 573722541 573250234 572769880 572231412 571642220 571064234 570489764 569912374 569365501 568800330 568181276
2769.7 568181276 567577243 567008495 566385508 565693974 565019906 564343929 563610256 562879324 562198937 561495304
2790.1 561495304 560721457 559930563 559136152 558306813 557428479 556520998 555628657 554764211 553893983 552957177
2810.5 552957177 551950395 550945759 549957454 548949599 547902286 546785116 545603991 544389427
2826.8 544389427 543115616 541757941 540331006 538791895 537045658 535033345 532712519 530044198
2843.1 530044198 527046978 523967206 521273553 519348860 518280566 517843544 517694354 517569125 517314017
2861.5 517314017 516852081 516149521 515263915 514360726 513573706 512873054 512191892 511522591 510809481 510004818
2881.9 510004818 509090483 508005321 506780028 505532742 504301906 503081501 501910567 500796616
2898.2 500796616 499690026 498575181 497424901 496148765 494687170 493033886 491154194 489086717
2914.5 489086717 487066984 485334396 483983934 483089507 482687175 482676864 482914299 483313143 483866096
2932.9 483866096 484516084 485155135 485806793 486486316 487082630 487533629 487804025 487826914 487634629 487302154
2953.3 487302154 486846805 486386061 486126781 486091942 486152351 486292243 486562163 486912698 487303108 487753630
2973.7 487753630 488209277 488637924 489097655 489524037 489808917 490015209 490216970 490349710 490329593 490177602
2994.1 490177602 489937454 489541650 488992840 488424152 487831205 487162948 486516088 485943526 485363156 484750986
3014.5 484750986 484135687 483459920 482689917 481903106 481113344 480244011 479374230 478615642 477856576 476983845
3034.9 476983845 476062924 475205868 474384278 473493457 472508699 471459895 470476598 469596475 468656093
3053.2 468656093 467665851 466731817 465799481 464853078 463995218 463240594 462422609 461474597 460555017 459727287
3073.6 459727287 458954483 458243489 457479447 456564695 455625087 454739422 453867078 452992082 452079773 451121032
3094 451121032 450202584 449412644 448657244 447758257 446796566 445956796 445155323 444255620 443375498 442616284
3114.4 442616284 441837490 440942794 439945132 438821703 437685668 436703652 435787141 434764057 433692157
3132.8 433692157 432715833 431811899 430877358 429862112 428784847 427701890 426665366 425709844 424777508
3151.1 424777508 423750073 422626674 421472549 420308292 419181079 418087810 416983962 415907323
3167.4 415907323 414841831 413702607 412513435 411380857 410291821 409180671 408096910 407040685
3183.7 407040685 405934036 404814243 403749704 402675927 401527464 400386482 399302244 398181468
3200.1 398181468 397014320 395891279 394805461 393694848 392575413 391469181 390365183 389291137
3216.4 389291137 388232321 387135357 386035353 384976476 383918375 382863134 381880641 380944610 379939228
3234.7 379939228 378882617 377890795 376935661 375995487 375140876 374300241 373372614 372409463 371493250
3253.1 371493250 370621234 369714200 368746996 367802799 366926521 366092026 365315378 364608526 363859683 362989396
3273.5 362989396 362056077 361112148 360187858 359306276 358462274 357642263 356836319 356068939 355333507 354555786
3293.9 354555786 353695422 352774024 351849705 350996524 350232899 349460363 348529339 347404718 346216172
3312.2 346216172 345113635 344089240 343041658 341973186 340923011 339830279 338624805 337347031
3328.6 337347031 336074948 334829092 333640069 332521021 331368536 330118895 328813404 327501714
3344.9 327501714 326286972 325205594 324080944 322827965 321617603 320562273 319598138 318597734
3361.2 318597734 317560524 316648960 315829456 314835131 313588381 312379718 311419308 310525507 309527755
3379.5 309527755 308488309 307521850 306652695 305873662 305244803 304639757 303809315 302900255 302235574
3397.9 302235574 301712811 300946772 299934745 299074471 298471183 297921240 297320187 296629846 295892984
3416.3 295892984 295289457 294837952 294411123 294047564 293822378 293675870 293490022 293278158 293122649 292886227
3436.6 292886227 292435020 291972935 291697741 291606665 291620404 291588843 291522443 291534454 291614562 291736543 291942656
3459.1 291942656 292167217 292375743 292785943 293365300 293703139 293712348 293760419 294037640 294439822 294844538
3479.5 294844538 295152158 295458764 295935065 296455890 296873838 297298640 297853529 298493385 299024999 299488455
3499.9 299488455 300144494 300777465 301101208 301465005 302164465 303021133 303752869 304301649 304785877 305383980
3520.3 305383980 306250811 307126403 307769895 308445722 309280485 310160279 311114430 312066406 312830895 313532233
3540.7 313532233 314416170 315524817 316539496 317290217 318166912 319248289 320243835 321213007 322277099
3559 322277099 323162317 323630601 324384362 326224774 328222811 329518080 330582261 331748337 333022505
3577.4 333022505 334418923 335659713 336530864 337658018 339503437 341148794 342260778 343581676
3593.7 343581676 345219016 346852213 348519713 350092381 351206958 352208495 353729367 355433702
3610 355433702 356894344 357977718 358658165 360006541 362274349 364007473 364796549 365971029 369456053
3628.4 369456053 373540014 375937074 378037155 380183637 382068753 383795857 384956717 385342777
3644.7 385342777 386306375 389753133 393715322 395410657 396997422 399897456 402450353 404187888
3661 404187888 405526757 406161606 406600654 408282280 410093367 411130160 413939029 417127550 418436646
3679.4 418436646 419044912 418985724 418312550 418406367 419514328 419773579 419065803 418390870 418083012 418756008
3699.8 418756008 420900255 422959775 423746467 424302489 426229358 429543704 431625634 432002485 432080775
3718.1 432080775 432411641 432957083 433776647 434612095 434482694 433545142 433199137 434442133 436395824
3736.5 436395824 436514139 434503913 433224767 434320360 434496701 433760852 435118109 436750144 436427563
3754.8 436427563 435711741 436007798 436394989 435972154 435509443 435407549 435886770 436527222 436341137 435594022
3775.2 435594022 435227752 435597181 435751408 435477555 435463816 435511380 435308397 434702873 433819115 433182687
3795.6 433182687 432417899 431998819 432794005 432981193 433020711 433869839 433590531 432011485 430830479
3814 430830479 430678487 430219948 430411011 431726605 431749493 431000590 430311412 429628223 429027349 428290784
3834.4 428290784 428126603 428909004 429429621 429581434 429525793 428424507 426000297 423761636 425066352
3852.7 425066352 428446651 428492814 426829547 425572127 425237566 425083637 424276412 424099326 424765527
3871.1 424765527 425004125 424654126 423623651 422954053 422927260 422806919 423151046 422952682 422111392 422232479
3891.5 422232479 422241688 420944452 419521868 418964386 419285417 420261174 420948654 420664430 419984102 419250965
3911.9 419250965 418439269 417986184 418032676 417904615 417446434 417205215 417002589 416411102 415993214 416122496
3932.3 416122496 416141659 415691763 415038794 414506972 414265215 413976073 413582772 413422972 413295239 413002700
3952.7 413002700 412677616 412322611 411925405 411626995 411398619 411077291 410726041 410414338 410078853 409739941
3973.1 409739941 409473091 409240812 408989221 408765674 408567011 408252984 407840997 407505631 407222331 406933248
3993.4 406933248 406643689 406273395
3997.5 406273395
##END=$$ End of the data block
