##TITLE=$$ Begin of the data block
##JCAMP-DX=5.00 $$ ACD/SpecManager v 10.08
##SPECTROMETER/DATA SYSTEM=Alpha
##DATE=13 Jun 2014 08:26:00
##DATA TYPE=INFRARED SPECTRUM
##DATA CLASS=XYDATA
##ORIGIN=
##OWNER=
##NPOINTS=1765
##FIRSTX=399.75695801
##LASTX=3997.56933594
##MAXX=3997.56933594
##MINX=399.75695801
##MAXY=0.72820908
##MINY=0.29560620
##XFACTOR=1.0000000000
##YFACTOR=1.000000000000000e-9
##FIRSTY=0.60099804
##DELTAX=2.03957629
##XUNITS=1/CM
##YUNITS=ARBITRARY UNITS
##XYDATA=(X++(Y..Y))
399.8F00998044J609325n89847k07961O14465o56546p50422K15709q75354j821696
$$ 600998044 602607369 602017522 601809561 602424026 601767480 601017058 601232767 600357413 598535717
418.1E98535717k32578j82450p70866M37498K20716r03309K90334J165987K11775O61969
$$ 598535717 598303139 598120689 597349823 597787321 598008037 597104728 597395062 598561049 598772824 599434793
438.5E99434793J504958K58326m59909N52237K24054q86083n96642q96216k304494
$$ 599434793 600939751 601198077 600738168 601290405 601514459 600628376 600031734 599135518 596831024
456.9E96831024j863420r51410k029836k588689j614809r64403k74361J496494K335549
$$ 596831024 594967604 594016194 591986358 589397669 587782860 586818457 586544096 588040590 590376139
475.2E90376139J950979K469301K647519J351774J074970J733601Q34167j20640N22494
$$ 590376139 592327118 594796419 597443938 598795712 599870682 601604283 602438450 602317810 602840304
493.6F02840304N56887k49803o0201J36196m32014l00705N4359o38485r82463n09799
$$ 602840304 603397191 603147388 603087187 603223383 602791369 602490664 602545023 601906538 600924075 600414276
514F00414276j010239j755834j004636n37991j425744j634180j061261j333296j436830
$$ 600414276 599404037 597648203 596643567 596105576 594679832 593045652 591984391 590651095 589214265
532.3E89214265p04109n87046q12471j36853M26174K19106N67377J134276O39975K28107
$$ 589214265 588510156 587923110 587110639 586973786 587399960 587619066 588186443 589320719 589960694 590188801
552.7E90188801N91994M87387J97053O56307R79959P95067R96113J169324N82158K35558
$$ 590188801 590780795 591268182 591465235 592121542 593101501 593896568 594892681 596062005 596644163 596879721
573.1E96879721N38706M67420J80900M78268N67734K13146N26965Q41439L50356K54333
$$ 596879721 597418427 597885847 598066747 598545015 599112749 599325895 599852860 600694299 601044655 601298988
593.5F01298988O69360M11868m3630J62124J14083m36008l77357j01983m10736m49180
$$ 601298988 601968348 602380216 602336586 602498710 602612793 602176785 601799428 601697445 601286709 600837529
613.9F00837529O3896K51651M65333J166046J263201P48456R61542J335203R14455
$$ 600837529 600901425 601153076 601618409 602784455 604047656 604796112 605757654 607092857 608007312
632.3F08007312Q44836J451731J258969O64830Q81076R36449M56929O51836J001597
$$ 608007312 608852148 610303879 611562848 612227678 613108754 614045203 614502132 615153968 616155565
650.6F16155565L78370o6936J98007j99974o80089Q2612O57678k23935o04272P57158
$$ 616155565 616533935 616466999 616665006 616465032 615784943 615867555 616525233 616301298 615697026 616454184
671F16454184P84397M97043R91345R08673M05132Q50439J064599K86400K53856Q21531
$$ 616454184 617238581 617735624 618726969 619635642 620040774 620891213 621955812 622242212 622496068 623317599
691.4F23317599L11137k06590L33249N31674K48849P16567J020551J37866l63529K18928
$$ 623317599 623628736 623422146 623755395 624287069 624535918 625252485 626273036 626410902 626047373 626266301
711.8F26266301M82857N59747J288772J518070J182437J946986K810061K229571J830996
$$ 626266301 626749158 627308905 628597677 630115747 631298184 633245170 636055231 638284802 640115798
730.2F40115798K254664J629830O14226R42588J132905L29435M89890J224638P31945
$$ 640115798 642370462 644000292 644614518 645557106 646690011 647019446 647509336 648733974 649465919
748.5F49465919M60505J292169J195848M88520J133084J703203Q49545O24180J284837
$$ 649465919 649926424 651218593 652414441 652902961 654036045 655739248 656588793 657212973 658497810
766.9F58497810P85590J67191Q20756Q54671K3067L61740R51708K66611J05858J000941
$$ 658497810 659283400 659450591 660271347 661126018 661149085 661510825 662462533 662729144 662835002 663835943
787.3F63835943P60317J7285O07729Q66353N7221L45468J061619K93374k39670L90827
$$ 663835943 664596260 664613545 665221274 666087627 666144848 666490316 667551935 667845309 667605639 667996466
807.7F67996466L9518q06689j31130M55260j85192J72019J342058J146853R46582K025068
$$ 667996466 668035984 667229295 667098165 667553425 667368233 667540252 668882310 670029163 670975745 673000813
828.1F73000813K144932J211345J546205J990318R18150L69906Q38161J53601q78930
$$ 673000813 675145745 676357090 677903295 679893613 680811763 681181669 682019830 682173431 681294501
846.4F81294501m73082o62387k098918j273691J410842K179265J669824J271784p39038
$$ 681294501 680821419 680159032 678060114 676786423 678197265 680376530 682046354 683318138 682579100
864.8F82579100m316032p788002j0618747j0944366p044494n33104O139874J1130393
$$ 682579100 678263068 670475066 659856319 648911953 641867459 641334355 647474229 658604622
881.1F58604622J2449264R732843N893648L771901K320408K42353p30813n05626j341224
$$ 658604622 671053886 680786729 686680377 690452278 692772686 693015039 692284226 691778600 690437376
899.4F90437376k410054j855910j259386j515210r75728j41263l94821l53754M88163
$$ 690437376 688027322 686171412 684912026 683396816 682421088 682279825 681885004 681531250 682019413
917.8F82019413K12013p78198p26998p86841j784146j939833j304328j522958j703918
$$ 682019413 682231426 681453228 680726230 679939389 678155243 676215410 674911082 673388124 671684206
936.2F71684206r14634p89344j448572j118004m30167n94556n02229l5703o68407j711606
$$ 671684206 670769572 669980228 668531656 667413652 666983485 666388929 665886700 665850997 665182590 663470984
956.6F63470984j861632k199114l140270l221631k873064l369391l666520l292739
$$ 663470984 661609352 659410238 656269968 653048337 650175273 646805882 643139362 639846623
972.9F39846623l600001m329980m339814m410744n065918n097747m605948m740298
$$ 639846623 636246622 631916642 627576828 623166084 618100166 613002419 608396471 603656173
989.2F03656173m870177m340648m174948m415095m036367l629982l847540l616571
$$ 603656173 598785996 594445348 590270400 585855305 581818938 578188956 574341416 570724845
1005.5E70724845k679467k097547j712561r77457q19921j596212k213061k576709l263712
$$ 570724845 568045378 565947831 564235270 563257813 562437892 560841680 558628619 556051910 552788198
1023.9E52788198l700018l491044l213525k680480j243055N15759J762509K575934
$$ 552788198 549088180 545597136 542383611 539703131 538460076 538975835 540738344 543314278
1040.2E43314278K800107K089203J180529P08819J94072l86476m62890k31862R2328
$$ 543314278 546114385 548203588 549384117 550092936 550287008 549900532 549437642 549205780 549298108
1058.5E49298108J026809K261638K681435K359748K039492J584768Q75473M66526L47793
$$ 549298108 550324917 552586555 555267990 557627738 559667230 561251998 562127471 562593997 562941790
1076.9E62941790L9279j29402K68281O20901O23107Q63016J186848J119554J034856
$$ 562941790 562981069 562851667 563119948 563740849 564363956 565226972 566413820 567533374 568568230
1095.2E68568230J133799J032055Q43703R03368Q35658M37617K31743M41670R08375
$$ 568568230 569702029 570734084 571577787 572481155 573316813 573754430 573986173 574427843 575336218
1113.6E75336218J559555K067209K043724J808166J926363K177238K288103K655089
$$ 575336218 576895773 578962982 581006706 582814872 584741235 586918473 589206576 591861665
1129.9E91861665L110945L052414K791107K713859K377927J673639J160264Q42810
$$ 591861665 594972610 598025024 600816131 603529990 605907917 607581556 608741820 609584630
1146.2F09584630L13639j84297l65675o04510r95398j141369r95755n84960L96192
$$ 609584630 609898269 609713972 609348297 608743787 607748389 606607020 605611265 605026305 605422497
1164.6F05422497J694083K515316K885282L252864L357351L070891K899050K808750
$$ 605422497 607116580 609631896 612517178 615770042 619127393 622198284 625097334 627906084
1180.9F27906084K404451J967013J669348J098573L83377J5616k86221q29637j141548
$$ 627906084 630310535 632277548 633946896 635045469 635428846 635444462 635158241 634328604 633187056
1199.3F33187056j084686j157462j224637q45552m55797m70757m79639l92615n44131
$$ 633187056 632102370 630944908 629720271 628874719 628418922 627948165 627468526 627075911 626531780
1217.6F26531780o44624m53830m68910p47979p50899o85632r02534q68678m66823l92378
$$ 626531780 625887156 625433326 624964416 624216437 623465538 622779906 621877372 621008694 620541871 620149493
1238F20149493n83470m63128l69370o06000n89848k37941j93477l36170j91212j18673
$$ 620149493 619566023 619102895 618733525 618127525 617537677 617299736 617106259 616770089 616578877 616460204
1258.4F16460204k52783o7651K55703J92225J78278N20766O05106L65734L79563M27007
$$ 616460204 616207421 616139770 616395473 616587698 616765976 617286742 617891848 618257582 618637145 619064152
1278.8F19064152K33948M52638R85325R20712N04673M67122L98159J1623q8931l6001
$$ 619064152 619298100 619750738 620736063 621656775 622161448 622628570 623026729 623038352 622949421 622913420
1299.2F22913420m62889q57234p56324r31442j435041j465261j233816j267970r79364
$$ 622913420 622450531 621593297 620836973 619905531 618470490 617005229 615771413 614503443 613524079
1317.6F13524079j63138J29164j44303j57654l21269j029730j375616j264453j428664
$$ 613524079 613360941 613490105 613345802 613188148 612866879 611837149 610461533 609197080 607768416
1335.9F07768416j411676n12123J91331l2902k01702l01719r19401j414180j331210
$$ 607768416 606356740 605844617 606035948 606003046 605801344 605499625 604580224 603166044 601834834
1354.3F01834834j414299j783789j893401j777231j640976j547992j620948j959205
$$ 601834834 600420535 598636746 596743345 594966114 593325138 591777146 590156198 588196993
1370.6E88196993k232671j843870j368820j675070k029776k194643k465725k406836
$$ 588196993 585964322 584120452 582751632 581076562 579046786 576852143 574386418 571979582
1386.9E71979582j988411k337157l641129m434109m362404m735172m795968m654885
$$ 571979582 569991171 567654014 564012885 559578776 555216372 550481200 545685232 541030347
1403.2E41030347n308151n407214m924715m966497n195200m989684m801035m410684
$$ 541030347 535722196 530314982 525390267 520423770 515228570 510238886 505437851 501027167
1419.5E01027167k611697r55611k09660J43260Q07583J513482J355081J375914K257168
$$ 501027167 498415470 497459859 497250199 497393459 498201042 499714524 501069605 502445519 504702687
1437.9E04702687K178014J497268J231611R85384O92904Q92043R84848L08096r6321
$$ 504702687 506880701 508377969 509609580 510594964 511287868 512179911 513164759 513472855 513376534
1456.2E13376534J414239K284587J386583R56118J270294R58681M33445R51469J825750
$$ 513376534 514790773 517075360 518461943 519418061 520688355 521647036 522080481 523031950 524857700
1474.6E24857700J845538J700342J378894Q35657M96507L70145L88622J057506J546084
$$ 524857700 526703238 528403580 529782474 530618131 531114638 531484783 531873405 532930911 534476995
1493E34476995J046896O73116J461446J915693R57966k74539L75629J990437J612425
$$ 534476995 535523891 536197007 537658453 539574146 540532112 540257573 540633202 542623639 544236064
1511.3E44236064Q26716K83599Q2553L75628J055539J470029J364947J588702J416504
$$ 544236064 545062780 545346379 545428932 545804560 546860099 548330128 549695075 551283777 552700281
1529.7E52700281N33164M17232Q48711P9870m97103J435161K749443K487242K083302
$$ 552700281 553233445 553650677 554499388 554579258 554082155 555517316 558266759 560754001 562837303
1548E62837303J782596J308262Q00312K74777J9610J780152K503693J238287r1434
$$ 562837303 564619899 565928161 566728473 567003250 567022860 568803012 571306705 572544992 572453558
1566.4E72453558p58051o62983p24912j567602k013385j261890j192987j635671j883447
$$ 572453558 571695507 571032524 570307612 568740010 566726625 565464735 564271748 562636077 560752630
1584.7E60752630k339780k608657k532959k701163k910853k636850k495408k792000
$$ 560752630 558412850 555804193 553271234 550570071 547659218 545022368 542526960 539734960
1601.1E39734960k771140k483367k584577k684057k300024k200425k885401l013789
$$ 539734960 536963820 534480453 531895876 529211819 526911795 524711370 521825969 518812180
1617.4E18812180j730442j583279k075314j522362j040101q77738n68271p69079r01639
$$ 518812180 517081738 515498459 513423145 511900783 510860682 509982944 509414673 508645594 507743955
1635.7E07743955O17921J643121J324952O72877N91457J492083J683354J299858K567768
$$ 507743955 508361876 510004997 511329949 512002826 512594283 514086366 515769720 517069578 519637346
1654.1E19637346L547430K991438K546728K620458K976895K760708K590180L079474
$$ 519637346 523184776 526176214 528722942 531343400 534320295 537081003 539671183 542750657
1670.4E42750657L349661L598571L916145L471791K783895K623081M064083N063415
$$ 542750657 546100318 549698889 553615034 557086825 559870720 562493801 566557884 571621299
1686.7E71621299M664719M385590L639341L422499L825783M292071N569697N201518
$$ 571621299 576286018 580671608 584310949 587733448 591559231 595851302 601420999 606622517
1703F06622517M353404M415333M065097L235042K232611J691341K517462L542960L137648
$$ 606622517 610975921 615391254 619456351 622691393 624924004 626615345 629132807 632675767 635813415
1721.4F35813415K555609K222955J719356J266419J016558J489520K523780K506435
$$ 635813415 638369024 640591979 642311335 643577754 644594312 646083832 648607612 651114047
1737.7F51114047K355039K558589K744734K741933K634585L223955M095734L616213
$$ 651114047 653469086 656027675 658772409 661514342 664148927 667372882 671468616 675084829
1754F75084829K810061K582789K369582K342523K278983J796961J210928Q23617J334250
$$ 675084829 677894890 680477679 682847261 685189784 687468767 689265728 690476656 691300273 692634523
1772.4F92634523K105594J725792J077593R61065R41634P56860P29978M22299l6180
$$ 692634523 694740117 696465909 697543502 698504567 699446201 700203061 700933039 701355338 701319158
1790.7G01319158N27740J273393R10104M65273Q37744J339554J188696R34541R10044
$$ 701319158 701846898 703120291 704030395 704495668 705333412 706672966 707861662 708796203 709706247
1809.1G09706247R81212J132011J217365J042247P93457O44326M60863L10362L22520
$$ 709706247 710687459 711819470 713036835 714079082 714872539 715516865 715977728 716288090 716610610
1827.4G16610610O49572J087427R74059P31170O52612K77340j74701l2664N90444Q68321
$$ 716610610 717260182 718347609 719321668 720052838 720705450 720982790 720808089 720775425 721365869 722234190
1847.8G22234190Q77141O30260K22802K34664L99053K55525J73688J71304k55049l77178
$$ 722234190 723111331 723741591 723964393 724199057 724598110 724853635 725027323 725198627 724943578 724566400
1868.2G24566400N25653R41873M24683J73330L19004J70053l6061J20997Q6486j99198
$$ 724566400 725092053 726033926 726458609 726631939 726950943 727120996 727084935 727205932 727292418 727093220
1888.6G27093220N4359L56734R8228L8982K86698J83404p6592K146M5835j37567J1206
$$ 727093220 727147579 727504313 727602541 727641523 727928221 728111625 728035033 728037179 728083014 727945447 727956653
1911.1G27956653K52425j01387m24922n1856R7752j04249J06275K72394m3869j98543
$$ 727956653 728209078 728107691 727682769 727630913 727728665 727624416 727730691 728003085 727959216 727760673
1931.5G27760673N7399L8266k72751l22938k05636j17421O5029J86383m0829k69890
$$ 727760673 727818072 727856338 727583587 727260649 727055013 726937592 727002621 727189004 727148175 726878285
1951.9G26878285j12891k6643k35796k10166n2631k59340l79443l0875Q0287j63197
$$ 726878285 726765394 726738751 726502955 726292789 726240158 725980818 725601375 725570500 725650787 725487590
1972.3G25487590j27852l6121k30729k78771r3579j55568l39449k77162k48134k97486
$$ 725487590 725359738 725323617 725092888 724814117 724720538 724564970 724225521 723948359 723700225 723402739
1992.6G23402739j17779j19j87576k96414j77264k12551l83317k98381j81019l37422
$$ 723402739 723284960 723284841 723097265 722800851 722623587 722411036 722027719 721729338 721548319 721210897
2013G21210897m08769k21193k08437l57687k60294j79410l28660l28898k04683l06666
$$ 721210897 720802128 720580935 720372498 720014811 719754517 719575107 719246447 718917549 718712866 718406200
2033.4G18406200m16398k92539k67387l69966k75671j79291l03686l27825j86861k07364
$$ 718406200 717989802 717697263 717429876 717059910 716784239 716604948 716301262 715973437 715786576 715579212
2053.8G15579212l08693k49386k13384l37005l38256j82748j91808k57194j64151j62542
$$ 715579212 715270519 715021133 714807749 714470744 714132488 713949740 713757932 713500738 713336587 713174045
2074.2G13174045k87414k65955j93060k80678l34501k42651k65717l49760k77460k23518
$$ 713174045 712886631 712620676 712427616 712146938 711812437 711569786 711304069 710954309 710676849 710453331
2094.6G10453331l15547l31759k33710k75731l71814k94745k53081l63171l59714k31445
$$ 710453331 710137784 709806025 709572315 709296584 708924770 708630025 708376944 708013773 707654059 707422614
2115G07422614k30551l08990k79248k42948k72155k39015k11954l01421l29613k34843
$$ 707422614 707192063 706883073 706603825 706360877 706088722 705849707 705637753 705336332 705006719 704771876
2135.4G04771876k09868k27093j62363j40250k29001k32101j25467j28687j98424j61886
$$ 704771876 704562008 704334915 704172552 704032302 703803301 703571200 703445733 703317046 703118622 702956736
2155.8G02956736j28686j76907j51277r1254j52290k00033j22369r7632j52349j31488
$$ 702956736 702828050 702651143 702499866 702408612 702256322 702056289 701933920 701836288 701683939 701552451
2176.2G01552451r3043j19567j22070q5414j25289j73867j11937o0916j18852j53124
$$ 701552451 701459408 701339841 701217771 701132357 701007068 700833201 700721264 700660348 700541496 700388372
2196.6G00388372j14501j49607k00331j26899o0081j02163j30891j34766k14458k53797
$$ 700388372 700273871 700124264 699923933 699797034 699736953 699634790 699503899 699369133 699154675 698900878
2217F98900878j67965j37628j94847j77443j61171k53797k67803j53125j38581k02000
$$ 698900878 698732913 698595285 698400438 698222995 698061824 697808027 697540224 697387099 697248518 697046518
2237.4F97046518j76787j64866k08915j68562j02162j63376k39730j99497j73748k06112
$$ 697046518 696869731 696704865 696495950 696327388 696225226 696061850 695822120 695622623 695448875 695242763
2257.8F95242763j68980j15990j74642k17199j36793j22905k01583j91688j72317k10464
$$ 695242763 695073783 694957793 694783151 694565952 694429159 694306254 694104671 693912983 693740666 693530202
2278.2F93530202j77741j55032k60174l36886k84493k57372k96235k50161k04086l02256
$$ 693530202 693352461 693197429 692937255 692600369 692315876 692058504 691762269 691512108 691308022 691005766
2298.6F91005766l70442l11733l18706l85523l44693k99812l69012m34458m47810m60803
$$ 691005766 690635324 690323591 690004885 689619362 689274669 688974857 688605845 688171387 687723577 687262774
2319F87262774m24862l61562m07159m83752m00662k87056l56555m22955l45766k83122
$$ 687262774 686837912 686476350 686069191 685585439 685184777 684897721 684541166 684118211 683772445 683489323
2339.4F83489323k42174K2233K47955j07765n74470p36058p22408o45459n37455m16279
$$ 683489323 683247149 683269382 683517337 683409572 682835102 682099044 681376636 680731177 680193722 679777443
2359.8F79777443j96874J3590L3856O4909K38955K94924J64926Q3685Q9168Q524j43349
$$ 679777443 679580569 679594159 679628015 679692924 679931879 680226803 680391729 680475414 680564582 680573106 680429757
2382.2F80429757j88291j56224k20537k95997k65598l04640m01199l52144k81453l48747
$$ 680429757 680241466 680085242 679864705 679568708 679303110 678998470 678597271 678245127 677963674 677614927
2402.6F77614927m02212l52859l43502l81589l44932l21627m04238m36008l95835m46856
$$ 677614927 677212715 676859856 676516354 676134765 675789833 675468206 675063968 674627960 674232125 673785269
2423F73785269m81665l66032l27528m26709m17650l75509m59194n00501m34577m32849
$$ 673785269 673303604 672937572 672610044 672183335 671765685 671390176 670930982 670430481 669995904 669563055
2443.4F69563055m81844m61042m67121n42224n29110m54009m68373m93348m73738n33461
$$ 669563055 669081211 668620169 668153048 667610824 667081714 666627705 666159332 665665984 665192246 664658785
2463.8F64658785o24180n96046n45562o02185o47307o28114o83486p73609p28547o68526
$$ 664658785 664034605 663438559 662892997 662290812 661643505 661015391 660331905 659558296 658829749 658161223
2484.2F58161223p36177p71165p50363p96914q12352p26044o87241p26998o98805o68168
$$ 658161223 657425046 656653881 655903518 655106604 654294252 653568208 652880967 652153969 651455164 650786996
2504.6F50786996p44045p56144o48857o18338o86169o82056o26981o35386o06775n14924
$$ 650786996 650042951 649286807 648637950 648019612 647333443 646651387 646024406 645389020 644782245 644267321
2525F44267321m78506m63009m04060l81112m11868l77536l15845l74258m39346l84211
$$ 644267321 643788815 643325806 642921746 642540634 642128766 641751230 641435385 641061127 640621781 640237570
2545.4F40237570l63767m17412l76165l01122l53039m10437m10497m93110n53965m52221
$$ 640237570 639873803 639456391 639080226 638779104 638426065 638015628 637605131 637112021 636558056 636105835
2565.8F36105835l82840m54664m99487m86791n18680n60045n40972n18680n42223n49734
$$ 636105835 635722995 635268331 634768844 634282053 633763373 633203328 632662356 632143676 631601453 631051719
2586.2F31051719n48243n79477n60283n15640n49913n71012n38051n70953o43313o24657
$$ 631051719 630503476 629923999 629363716 628848076 628298163 627727151 627189100 626618147 625974834 625350177
2606.6F25350177n61058n74529n82934n19037n35429o25252o05464n37932n39065n50747
$$ 625350177 624789119 624214590 623631656 623112619 622577190 621951938 621346474 620808542 620269477 619718730
2626.9F19718730n72204o44505o91474o12259n12838n44071o22571o63101o93918o93082
$$ 619718730 619146526 618502021 617810547 617198288 616685450 616141379 615518808 614855707 614161789 613468707
2647.3F13468707o31035n89192o19590o54936o78956p14124o96539o11484n90027o53982
$$ 613468707 612837672 612248480 611628890 610973954 610294998 609580874 608884335 608272851 607682824 607028842
2667.7F07028842o86169o91473p20442p15851o64532o54638o94394p02024o78837o80745
$$ 607028842 606342673 605651200 604930758 604214907 603550375 602895737 602201343 601499319 600820482 600139737
2688.1F00139737o73711o59168o77228o65069o30676o54459p01130o94036o52254o31630
$$ 600139737 599466026 598806858 598129630 597464561 596833885 596179426 595478296 594784260 594132006 593500376
2708.5E93500376o19471o13034o39916o50465o07371n74708n57006n22077n42879o16372
$$ 593500376 592880905 592267871 591627955 590977490 590370119 589795411 589238405 588716328 588173449 587557077
2728.9E87557077o14106n48721n11169m87387m80771m93467m86374m58300m48287m79400
$$ 587557077 586942971 586394250 585883081 585395694 584914923 584421456 583935082 583476782 583028495 582549095
2749.3E82549095m86791m78089n22077n64694n73278n86748n76556n20348m97461n53071
$$ 582549095 582062304 581584215 581062138 580497444 579924166 579337418 578760862 578240514 577743053 577189982
2769.7E77189982o02126n94139o34253p12335o95527o65247p16508p32660o87838p20978
$$ 577189982 576587856 575993717 575359464 574647129 573951602 573286355 572569847 571837187 571149349 570428371
2790.1E70428371p77006p50363p46607q08239q81851r14812q93712q61049q54492r27925
$$ 570428371 569651365 568901002 568154395 567346156 566464305 565549493 564655781 563794732 562940240 562012315
2810.5E62012315j014114j017332j014352j034796j030147j064658j157582j229405
$$ 562012315 560998201 559980869 558966517 557931721 556901574 555836916 554679334 553449929
2826.8E53449929j297474j383543j443684j536906j743794k027988k344668k677858
$$ 553449929 552152455 550768912 549325228 547788322 546044528 544016540 541671872 538994014
2843.1E38994014k998769l103852k716959j920283j085639m75406j48893r2685k27868
$$ 538994014 535995245 532891393 530174434 528254151 527168512 526693106 526544213 526451528 526223660
2861.5E26223660m51983p02500q95679r33230q10981o85274o62625o86884p30514q05080
$$ 526223660 525771677 525069177 524173498 523240268 522429287 521744013 521081388 520394504 519663990 518858910
2881.9E18858910r00329j040697j214563j291812j243889j211047j209498j160860
$$ 518858910 517958581 516917884 515703321 514411509 513167620 511956573 510747075 509586215
2898.2E09586215j103938j086950j136780j276135j464486j665473j871854k039194
$$ 509586215 508482277 507395327 506258547 504982412 503517926 501852453 499980599 497941405
2914.5D97941405k019585j745790j370191r56804m65542j818K96801M58330N80013
$$ 497941405 495921820 494176030 492805839 491849035 491383493 491381675 491678476 492136806 492716819
2932.9D92716819O42836O57082P07298P18862O06090M58807K79069O348k32280l59177
$$ 492716819 493359655 494016737 494724035 495442897 496048987 496507794 496786863 496793211 496560931 496201754
2953.3D96201754m36664m19945k36660Q553J46032J97679K71171L30001L77476M60893
$$ 496201754 495765090 495345145 495108485 495117038 495263070 495460749 495731920 496061921 496439397 496900290
2973.7D96900290M73917M24206M37200M19498L25560K79218K68072J84685J1325j44899
$$ 496900290 497374207 497798413 498235613 498655111 498980671 499259889 499527961 499712646 499723971 499579072
2994.1D99579072k43008l84867n27442n66810o05941o85126o56634n75274n92471o17563
$$ 499579072 499336064 498951197 498423755 497856945 497251004 496565878 495909244 495333970 494741499 494123936
3014.5D94123936o06090o74963p70629p61926p60913q66770q97020p94679p74056q98034
$$ 494123936 493517846 492842883 492072254 491310328 490549415 489682645 488785625 487990946 487216890 486318856
3034.9D86318856r70363q98838q34316q59738r36389j027524j016527r35138r54061
$$ 486318856 485348493 484449655 483615339 482755601 481819212 480791688 479775161 478840023 477885962
3053.2D77885962r83686r29057r06378r23932q62062p59661q00908r22590r28730q87275
$$ 477885962 476902276 475973219 475066841 474142909 473280847 472521186 471720278 470797688 469868958 468981683
3073.6D68981683q42184p41690p52538r00865r50336q88050q53688q66353r13322r55820
$$ 468981683 468139499 467397809 466645271 465744406 464794070 463906020 463052332 462185979 461272657 460316837
3094D60316837r18985q11696p77453r17405j012474q85606q09461r10699r11087p98851
$$ 460316837 459397852 458586156 457808703 456891298 455878824 454993218 454183757 453273058 452361971 451563120
3114.4D51563120q12829r09805j006007j116336j107394r73493r52631j067251j087278
$$ 451563120 450750291 449840486 448834479 447718143 446610749 445637256 444684625 443617374 442530096
3132.8D42530096r75103q94308r40680j066566j155942j146257j037002r20892r31382
$$ 442530096 441554993 440660685 439720005 438653439 437497497 436351240 435314238 434393346 433461964
3151.1D33461964j056999j155644j187861j193196j140893j080632j094699j137405
$$ 433461964 432404965 431249321 430061460 428868264 427727371 426646739 425552040 424414635
3167.4D24414635j143843j143247j154542j140833j141340j170516j153081j098782
$$ 424414635 423270792 422127545 420973003 419832170 418690830 417520314 416367233 415268451
3183.7D15268451j117498j162082j116931j090050j154274j194685j175791j155526
$$ 415268451 414150953 412988871 411871940 410781890 409627616 408432931 407257140 406101614
3200.1D06101614j104146j064152j138925j219571j178652j100749j085519j103074
$$ 406101614 404997468 403933316 402794391 401574820 400396168 399295419 398209900 397106826
3216.4C97106826j111209j107454j103491j104563j122684j109421r95457r30756j041532
$$ 397106826 395995617 394888163 393784672 392680109 391557425 390448004 389452547 388521791 387480259
3234.7C87480259j108944j026452r85831r78857q90375q68350r90093j022934r14246
$$ 387480259 386371315 385344863 384359032 383380175 382489800 381621450 380631357 379608423 378694177
3253.1C78694177q99196r75281r72897r24974q97050q39293p62105p51108q31068r02593
$$ 378694177 377794981 376819700 375846803 374921829 374024779 373185486 372423381 371672273 370841205 369938612
3273.5C69938612r21518r32067r08584q74221q47876q31932q69959q53330p60526p85202
$$ 369938612 369017094 368085027 367176443 366302222 365454346 364622414 363752455 362899125 362138599 361353397
3293.9C61353397r39101j059651j011461q14289o95944p82579r72807j159460j237422
$$ 361353397 360414296 359354645 358343184 357528895 356832951 356050372 355077565 353918105 352680683
3312.2C52680683j149326j074970j100838j119644j109540j127005j235783j341671
$$ 352680683 351531357 350456387 349355549 348235905 347126365 345999360 344763577 343421906
3328.6C43421906j366555j353562j236916j096964j162559j321017j380205j385570
$$ 343421906 342055351 340701789 339464873 338367909 337205350 335884333 334504128 333118558
3344.9C33118558j279980j086563j113027j327545j353562j193344j042426r94116
$$ 333118558 331838578 330752015 329638988 328311443 326957881 325764537 324722111 323727995
3361.2C23727995j012951r24736q68589j051694j310527j334131j110077r40383r44048
$$ 323727995 322715044 321790308 320921719 319870025 318559498 317225367 316115290 315174907 314230859
3379.5C14230859j030862j042843r00477p20829o06358o74665r52631j022577o92606
$$ 314230859 313199997 312157154 311256677 310535848 309929490 309254825 308302194 307279617 306587011
3397.9C06587011m98653p69079j029580q82119o42568n73129o03079p07835p57188
$$ 306587011 306088358 305319279 304289699 303407580 302765012 302191883 301588804 300880969 300123781
3416.3C00123781o09845m55350m45306m04656k70963k02119k26289j58459o2823k43366
$$ 300123781 299513936 299058586 298613280 298208624 297937661 297735542 297509253 297350794 297287971 297044605
3436.6B97044605n34266n13077l01123q9943Q4281J6481p6116M1485J62900K23785
$$ 297044605 296510339 295997262 295696139 295606196 295690477 295706958 295630842 295672327 295835227 296059012
3457B96059012K62917J85549J64389M33267O24954L61443M798M7535K92509M47363
$$ 296059012 296321929 296507478 296671867 297105134 297730088 298091531 298096329 298143864 298436373 298883736
3477.4B98883736M99696L73631K91407M69029N76407M77463M42922N56529O87390O40393
$$ 298883736 299383432 299757063 300048470 300517499 301093906 301571369 302014291 302570820 303258210 303898603
3497.8C03898603N48422O61105O33150L98249M73290P81656R13471P74264N79059N34564
$$ 303898603 304447025 305108130 305741280 306139529 306612819 307394475 308307946 309082210 309661269 310195833
3518.2C10195833O58334Q89212R03397P24733P66337Q97646R09269J014710J080721
$$ 310195833 310854167 311743379 312646776 313371509 314137846 315035492 315944761 316959471 318040192
3536.6C18040192Q63880P60675R41425J147240J078338Q54224R89228J219482J123577
$$ 318040192 318904072 319664747 320606172 321753412 322831750 323685974 324675202 325894684 327018261
3554.9C27018261J012176J065910R22918N34594Q30353J921505K068787J366139J160145
$$ 327018261 328030437 329096347 330019265 330553859 331384212 333305717 335374504 336740643 337900788
3573.3C37900788J284867J393974J509100J352668R78887J206756J903057J761287
$$ 337900788 339185655 340579629 342088729 343441397 344420284 345627040 347530097 349291384
3589.6C49291384J259178J392990J649678J699001J839489J738071J169771J051188
$$ 349291384 350550562 351943552 353593230 355292231 357131720 358869791 360039562 361090750
3605.9C61090750J659601J837701J551777J196951P78973J408994K377212J898170
$$ 361090750 362750351 364588052 366139829 367336780 368115753 369524747 371901959 373800129
3622.2C73800129R13232J278907L616423M177510K477706K194315K246052K042026
$$ 373800129 374713361 375992268 379608691 383786201 386263907 388458222 390704274 392746300
3638.6C92746300J903325J262784M49031J053513L551989M068554J831740J740605
$$ 392746300 394649625 395912409 396361440 397414953 400966942 405035496 406867236 408607841
3654.9D08607841L024995K665400J861543J425177O76185N10364J810700J893014J021176
$$ 408607841 411632836 414298236 416159779 417584956 418261141 418771505 420582205 422475219 423496395
3673.2D23496395K793342L269941J418829O66976j9521o28710J20908J081318J98454
$$ 423496395 426289737 429559678 430978507 431645483 431625962 430997252 431118160 432199478 432397932
3691.6D32397932p39902o82712k74062P74503K274245K181857R03935O46621J958876
$$ 432397932 431658030 430975318 430701256 431475759 433750004 435931861 436835796 437482417 439441293
3709.9D39441293L322542K132356M69596J70528M11123N95630P95692P73430j44959
$$ 439441293 442763835 444896191 445365787 445536315 445947438 446543068 447338760 448112190 447967231
3728.3D47967231q89331l07292J230658J953363J59293j946389j237929J027822J17839
$$ 447967231 447077900 446770608 448001266 449954629 450113922 448167533 446929604 447957426 448075265
3746.7D48075265o67334J415581J620978k90305o29693L26037L33399m62085m52787
$$ 448075265 447407931 448823512 450444490 450154185 449524492 449850529 450183928 449721843 449269056
3765D49269056p8052M89801O55085j59830o86496l12329L12895O6578k72303M7653
$$ 449269056 449191004 449680805 450335890 450176060 449489564 449177235 449490130 449556708 449284405 449332058
3785.4D49332058R4057k11955o13600q36849o34104q39948m22001Q43167J73479j0848
$$ 449332058 449426115 449214160 448600560 447763711 447129607 446289659 445867658 446710825 446884304 446873456
3805.8D46873456Q03173k70993j530111j114130q1956m42475J54614J286775P0274
$$ 446873456 447676629 447405636 445875525 444761395 444679439 444236964 444391578 445678353 445748627
3824.2D45748627o37591o09904p21306p22229p94709j13338Q10891M83483J60456K4021
$$ 445748627 445111036 444501132 443779826 443057597 442262888 442149550 442960441 443443924 443604380 443628401
3844.6D43628401j037419k397150k212882J294792L333330N1498j636833j276374l67343
$$ 443628401 442590982 440193832 437980950 439275742 442609072 442660570 441023737 439747363 439380020
3862.9D39380020j26809p58380j62065O56754K76983k76446j001269o81192j06454
$$ 439380020 439253211 438494831 438332766 438989520 439266503 438990057 437988788 437307596 437201142
3881.3D37201142k11596L84509j02222q15063Q3446j7613j249015j355171n42850K70248
$$ 437201142 436989546 437374055 437271833 436456770 436540216 436522603 435273588 433918417 433375567 433645815
3901.7D33645815Q89927O18070l08186o53803p14362q55833m78804J17838l7938m46886
$$ 433645815 434535742 435153812 434845626 434191823 433477461 432621628 432142824 432260662 432222724 431775838
3922.1D31775838k74777k03282n53131l26425K24054J8954n18828p39009n54382j38075
$$ 431775838 431501061 431297779 430744648 430418223 430642277 430661231 430142403 429403394 428849012 428710937
3942.5D28710937k11477m73976k39432j01536k89738l42161l11881l61413l04013k14488
$$ 428710937 428499460 428025484 427786052 427684516 427394778 427052617 426740736 426379323 426075310 425860822
3962.9D25860822k91198l58880l48538l76046l65674k30164j74284k63154k73496j84059
$$ 425860822 425569624 425210744 424862206 424486160 424120486 423890322 423716038 423452884 423179388 422995329
3983.2D22995329k16276l49462l60250l20464l51400l64720l37184
$$ 422995329 422779053 422429591 422069341 421748877 421397477 421032757 420695573
3997.5D20695573
$$ 420695573
##END=$$ End of the data block
