##TITLE=$$ Begin of the data block
##JCAMP-DX=5.00 $$ ACD/SpecManager v 10.08
##SPECTROMETER/DATA SYSTEM=Alpha
##DATE=13 Jun 2014 08:26:00
##DATA TYPE=INFRARED SPECTRUM
##DATA CLASS=XYDATA
##ORIGIN=
##OWNER=
##NPOINTS=1765
##FIRSTX=399.75695801
##LASTX=3997.56933594
##MAXX=3997.56933594
##MINX=399.75695801
##MAXY=0.73379612
##MINY=0.30137900
##XFACTOR=1.0000000000
##YFACTOR=1.000000000000000e-9
##FIRSTY=0.59922200
##DELTAX=2.03957629
##XUNITS=1/CM
##YUNITS=ARBITRARY UNITS
##XYDATA=(X++(Y..Y))
399.8 599222004 600152731 599610388 599795878 600597739 599949658 599712491 600428641 599119067 596490502
418.1 596490502 596292377 596716702 596070290 596158266 596163571 595095515 595056236 596188784 596749306 597500861
438.5 597500861 598904431 599306583 598924279 599326730 599528432 598797083 598422825 597782195 595612705
456.9 595612705 593492329 592057347 589844048 587500751 586277425 585530043 585179031 586456358 588653386
475.2 588653386 590415418 592519104 594992757 596454740 597613275 599417448 600492358 600771368 601558924
493.6 601558924 601971865 601408660 601299763 601613164 601197422 600663364 600562453 600016534 599210382 598787010
514 598787010 597738624 595938504 594826519 594031036 592496097 591042876 590098143 588607848 586970627
532.3 586970627 586183071 585643888 585177362 585548043 586196542 586314142 586712301 587727666 588323951 588536382
552.7 588536382 589059472 589470267 589669585 590402901 591369390 591958702 592765272 593883574 594523191 594950676
573.1 594950676 595683336 596193969 596333265 596776247 597341776 597535849 597947776 598725259 599206269 599575222
593.5 599575222 600215316 600581944 600550652 600811899 601036787 600601077 600144386 599988282 599593520 599219382
613.9 599219382 599343359 599501848 599784553 600915074 602304161 603173554 604156971 605440319 606285036
632.3 606285036 607086658 608546019 609819949 610482097 611455381 612612069 613155842 613646269 614499986
650.6 614499986 614809632 614665866 614901185 614849389 614224613 614211500 614776671 614652038 614301920 615123808
671 615123808 615837038 616276026 617291152 618288875 618759334 619608819 620648623 620907009 621123254 621954620
691.4 621954620 622341335 622168064 622430921 622878313 623129725 623922408 624980390 625059545 624617696 624794006
711.8 624794006 625311613 626012802 627481043 629139364 630338490 632216752 635017931 637266934 639063120
730.2 639063120 641279817 642915785 643569827 644576132 645770967 646162212 646684825 647857785 648487687
748.5 648487687 648837388 650072515 651339054 651984870 653213501 654890537 655692458 656335115 657690644
766.9 657690644 658522129 658694446 659564137 660503507 660519123 660819292 661781192 662089586 662245631 663302422
787.3 663302422 664048851 664023340 664642930 665540516 665585041 665881991 666935146 667259395 667012572 667398751
807.7 667398751 667520523 666806161 666669071 667094469 666935623 667176783 668627143 669841707 670783937
826 670783937 672830522 675032079 676268101 677805960 679824471 680790246 681135714 681919098 682055414
844.4 682055414 681181669 680745244 680178404 678142250 676801383 678122878 680286586 681961596 683256745
862.7 683256745 682576656 678267479 670439243 659837246 648920238 641875923 641387403 647586703
879.1 647586703 658749044 671254277 681043506 686933815 690671146 692979574 693258047 692549586
895.4 692549586 692012787 690670729 688307941 686490715 685259700 683739185 682708204 682514727 682091534
913.7 682091534 681749284 682305634 682578683 681781590 681004763 680231154 678490102 676557004 675252676
932.1 675252676 673780024 672145963 671256483 670472085 669028878 667892635 667439699 666821241 666268706
950.4 666268706 666193604 665494204 663716733 661811173 659664750 656629205 653459907 650610924 647262871
968.8 647262871 643547297 640196502 636604607 632287800 627937853 623540461 618484497 613347232
985.1 613347232 608736634 604061186 599242687 594930410 590795040 586376607 582254946 578574896
1001.4 578574896 574775159 571215749 568560481 566469252 564763308 563803852 563006222 561443925 559289694
1019.8 559289694 556768417 553507149 549771845 546252251 543020010 540320277 539084792 539657176
1036.1 539657176 541450739 543970168 546700180 548761547 549920380 550652027 550948560 550631344 550171912
1054.5 550171912 549963713 550086975 551107466 553356886 556026101 558359504 560388863 561987698 562876463
1072.8 562876463 563332498 563651264 563668728 563537657 563829243 564482152 565128028 566014051 567215860 568306923
1093.2 568306923 569304645 570457458 571526587 572345197 573195398 574036181 574515760 574795902 575287580
1111.6 575287580 576191664 577716470 579809546 581925511 583775222 585706472 587893009 590186119
1127.9 590186119 592819691 595909655 598963201 601752400 604450047 606835783 608547032 609723747
1144.2 609723747 610559762 610881269 610699356 610320747 609730959 608771086 607665181 606694400 606099725
1162.6 606099725 606470942 608158708 610693097 613588512 616807938 620135486 623229563 626190364
1178.9 626190364 629065514 631489754 633398831 634994209 636078358 636479080 636489630 636201322 635395348
1197.2 635395348 634275973 633230031 632133663 630915999 630026877 629551053 629070282 628574252 628188312
1215.6 628188312 627667904 627042651 626611888 626182258 625470221 624741375 624088109 623207331 622319043 621846497
1236 621846497 621482193 620896876 620412767 620051861 619464159 618889809 618675172 618502021 618166387 617958128
1256.4 617958128 617820621 617550254 617483795 617788613 618044138 618229270 618718505 619315505 619675279 620036960
1276.8 620036960 620476544 620746374 621199310 622139752 623025358 623526752 624011397 624437928 624465764 624376953
1297.2 624376953 624355972 623940527 623121202 622367322 621429145 619961083 618437111 617192745 615971804
1315.5 615971804 615029216 614879370 615029573 614899814 614735544 614417315 613398850 612007439 610747635
1333.9 610747635 609375417 607971907 607412755 607606590 607596576 607377827 607057035 606146812 604745686
1352.2 604745686 603423059 601999521 600187004 598285854 596525908 594896913 593358994 591773450
1368.5 591773450 589843988 587568700 585657120 584293008 582633853 580575883 578396261 575964093
1384.9 575964093 573526204 571550906 569307506 565704823 561209619 556798756 552079678 547285795
1401.2 547285795 542589068 537260175 531872988 526968539 522014081 516813576 511817455 507039309
1417.5 507039309 502642095 500007033 499040395 498844087 498998642 499824226 501383722 502778232 504140615
1435.9 504140615 506371319 508563221 510076940 511319280 512332618 513034463 513897240 514878929 515226603
1454.2 515226603 515163779 516572952 518845975 520208359 521133184 522449911 523514688 523998559 524922848
1472.6 524922848 526750445 528635681 530350447 531727850 532545447 532995939 533348083 533781409 534871101
1490.9 534871101 536413968 537455738 538132608 539623320 541579843 542570829 542301416 542638302 544621527
1509.3 544621527 546268404 547127664 547429979 547523677 547907770 548996866 550532460 551914454 553491056
1527.6 553491056 554962456 555563807 555966616 556774497 556835949 556315720 557770193 560560107 563049674
1546 563049674 565140605 566985667 568369269 569183588 569428802 569425762 571181357 573682010 574945807
1564.3 574945807 574851394 574049771 573378980 572668493 571055055 568950772 567655981 566469789 564820766
1582.7 564820766 562913716 560562730 557938874 555378079 552630305 549631417 546904385 544370294
1599 544370294 541547775 538690865 536093712 533417940 530663073 528300941 526027679 523031771 519896924
1617.4 519896924 518091202 516438663 514257967 512641549 511571467 510703087 510137379 509371221 508511841
1635.7 508511841 509178817 510847270 512195885 512882233 513487518 515048087 516825259 518199682 520870447
1654.1 520870447 524551809 527659833 530306041 533023477 536091745 538925171 541608810 544827282
1670.4 544827282 548282921 551946819 555963039 559537172 562356174 565007567 569197357 574387848
1686.7 574387848 579119027 583571017 587277591 590733051 594580293 598931849 604579151 609840274
1703 609840274 614248335 618717313 622841001 626170814 628506303 630245805 632785141 636384904 639571607
1721.4 639571607 642159522 644430697 646181583 647432208 648420453 649895430 652449369 655034304
1737.7 655034304 657479763 660091460 662846744 665618598 668308198 671558738 675692558 679388106
1754 679388106 682237804 684808612 687199414 689593315 691901684 693714976 694933891 695755780 697105050
1772.4 697105050 699255049 701012671 702096939 703070879 704041839 704819858 705572426 706056833 706067383
1790.7 706067383 706564605 707833767 708789110 709251821 710060835 711430371 712660253 713594317 714518011
1809.1 714518011 715557635 716730952 717956483 719002843 719787776 720436454 720955133 721318781 721642256
1827.4 721642256 722293019 723407328 724395752 725118995 725776911 726072848 725916028 725926995 726570845 727464795
1847.8 727464795 728363574 729024827 729254961 729466796 729861915 730124593 730276823 730444074 730213463 729840755
1868.2 729840755 730386257 731398642 731871724 732026875 732326686 732509434 732475579 732607186 732737601 732565343
1888.6 732565343 732633948 733036637 733176112 733221054 733519256 733734369 733660579 733645916 733714521 733606935
1909 733606935 733589292 733796120 733696759 733295858 733275533 733412623 733317256 733423412 733730495 733735085 733551323
1931.5 733551323 733595431 733650625 733408689 733068645 732841253 732746124 732835889 733053982 733055115 732777357 732633114
1953.9 732633114 732622564 732421339 732212722 732160211 731926143 731567442 731548071 731639266 731477320 731353879
1974.3 731353879 731350899 731152534 730870068 730783105 730665505 730354786 730089724 729857385 729564071 729428351
1994.7 729428351 729435027 729275584 728988111 728838563 728689492 728336036 728018403 727837265 727528214 727126479
2015.1 727126479 726904929 726728678 726392865 726103842 725896955 725581586 725303948 725165725 724889278 724459171
2035.5 724459171 724140763 723870933 723533630 723286569 723121345 722835004 722511947 722327232 722142816 721855998
2055.9 721855998 721629560 721457899 721144080 720801175 720632255 720468640 720204592 720010340 719853461 719579399
2076.3 719579399 719289184 719103038 718893051 718609869 718375027 718130469 717810452 717534661 717310965 717025518
2096.7 717025518 716730773 716518164 716262460 715908229 715625346 715404451 715089560 714759290 714522898 714271069
2117.1 714271069 713961005 713721693 713525891 713257551 712991357 712776303 712508440 712215304 712021291 711844265
2137.5 711844265 711610615 711447597 711344659 711157978 710929513 710773945 710647106 710487485 710357070 710254192
2157.9 710254192 710103989 709974766 709919512 709811866 709620655 709480584 709398687 709282458 709161937 709073782
2178.2 709073782 708964646 708859801 708820224 708758831 708617151 708492756 708412290 708292544 708165824 708087206
2198.6 708087206 707960963 707788289 707706749 707674325 707558036 707412541 707293034 707108200 706892669 706757188
2219 706757188 706616819 706409931 706256449 706141412 705927193 705677152 705517709 705383241 705219388 705100119
2239.4 705100119 704979420 704761446 704552889 704435825 704281926 704084694 703968525 703855097 703645527 703449249
2259.8 703449249 703323841 703162014 702976465 702868581 702759266 702570021 702403665 702274978 702098012 701918900
2280.2 701918900 701752841 701494277 701173425 700933933 700729012 700452924 700203061 700013041 699745297 699423313
2300.6 699423313 699172854 698890626 698485851 698109567 697811961 697448969 696996927 696561038 696157932 695797324
2321 695797324 695483387 695085526 694564581 694146276 693911314 693604231 693189502 692828357 692520559 692308426
2341.4 692308426 692410290 692658544 692490220 691918135 691243112 690524936 689789712 689247012 688958824 688849628
2361.8 688849628 688921571 689065695 689144492 689246953 689466298 689675808 689772248 689847708 689901292 689814031 689646602
2384.2 689646602 689496696 689281285 688975632 688704193 688444436 688089371 687738121 687472224 687175512 686826169
2404.6 686826169 686494768 686137080 685738027 685396254 685102940 684728920 684314430 683964908 683587849 683138132
2425 683138132 682744741 682391644 681971908 681564927 681191444 680717885 680211425 679817498 679439604 679003537
2445.4 679003537 678590834 678160846 677634776 677112818 676652551 676161647 675659716 675204933 674699962 674087346
2465.8 674087346 673475862 672919869 672336578 671714723 671089113 670404077 669654787 668955624 668303192 667563915
2486.2 667563915 666766584 666011631 665249169 664466321 663762450 663113475 662425458 661741912 661083400 660354674
2506.6 660354674 659608543 658969343 658338010 657632411 656982124 656393528 655756295 655154467 654678702 654233038
2527 654233038 653768778 653355181 652978539 652579606 652203381 651890934 651564419 651166618 650773406 650411367
2547.4 650411367 650015593 649641514 649341941 649012744 648623407 648218811 647751927 647249103 646822929 646417260
2567.8 646417260 645937860 645456493 645020366 644557416 644021094 643463671 642927468 642406881 641915023 641416252
2588.2 641416252 640856266 640286624 639759481 639214456 638635218 638090014 637558222 636965632 636357903 635805070
2608.6 635805070 635244548 634661436 634127736 633605659 633031487 632457495 631928325 631394327 630830824 630251050
2629 630251050 629630029 628983438 628401101 627878487 627317905 626714468 626092792 625430524 624754369 624121130
2649.4 624121130 623514950 622874498 622201324 621537507 620876253 620220006 619621575 619036674 618358910 617645919
2669.8 617645919 616996944 616365135 615714490 615070462 614394009 613670886 612981319 612330437 611641765 610939443
2690.2 610939443 610269070 609596789 608934283 608322501 607695639 607004762 606338620 605729043 605110049 604471624
2710.6 604471624 603839993 603202522 602548778 601943552 601393223 600828707 600284874 599770784 599194825 598597825
2731 598597825 598083496 597605705 597099245 596601069 596139550 595682979 595228434 594794750 594363451 593922257
2751.4 593922257 593454778 592938066 592387497 591825783 591250420 590669751 590115190 589580894 589014292 588415384
2771.8 588415384 587836564 587230146 586549699 585870981 585199296 584475517 583762825 583124101 582458913 581705689
2792.2 581705689 580938876 580183804 579378963 578498542 577602029 576725900 575849533 574963331 574043810 573067904
2812.5 573067904 572070897 571068108 570026636 568943143 567817509 566632807 565407276 564153314
2828.9 564153314 562811494 561353207 559786379 558026791 555982292 553615272 550901294 547865331
2845.2 547865331 544732332 541977942 540011227 538912833 538473189 538371086 538311601 538095355 537659526
2863.5 537659526 536988676 536117673 535187602 534349382 533622921 532950282 532321632 531641424 530805528 529853821
2883.9 529853821 528797865 527594805 526299894 525026500 523794293 522603869 521474838 520372093
2900.2 520372093 519266307 518130958 516865611 515381813 513693094 511801422 509714842 507644236
2916.6 507644236 505881488 504529834 503606141 503172457 503201485 503502250 503918588 504486501 505192280
2934.9 505192280 505913258 506645679 507397473 508063555 508583069 508911371 508955181 508728802 508345008 507898927
2955.3 507898927 507510543 507315040 507307112 507418096 507654965 507992685 508348346 508727551 509203136 509706140
2975.7 509706140 510165453 510652006 511128604 511488736 511765718 512004554 512161374 512201130 512111843 511886895
2996.1 511886895 511511862 511009574 510467589 509887815 509220183 508549035 507965267 507389843 506761253 506123602
3016.5 506123602 505445600 504679143 503903627 503129303 502250254 501340628 500528216 499744862 498887599 497952878
3036.9 497952878 497028530 496169090 495311856 494369417 493328184 492314756 491394162 490443408 489462733
3055.3 489462733 488532484 487586409 486603439 485688478 484871745 484033704 483119637 482218534 481362790 480553716
3075.6 480553716 479815930 479041278 478137821 477194995 476288915 475405037 474481672 473487884 472490251 471562564
3096 471562564 470756441 470000863 469094813 468083948 467213124 466422200 465504676 464573026 463782698 462992817
3116.4 462992817 462069631 461022258 459861934 458693802 457665831 456709415 455662727 454590738 453613788
3134.8 453613788 452668726 451657832 450574160 449433148 448237598 447096258 446117848 445197642 444162428
3153.2 444162428 443002671 441805869 440577686 439348698 438191563 437059015 435908020 434764922
3169.5 434764922 433602422 432405680 431222588 430055201 428862065 427654117 426459610 425238758
3185.8 425238758 424020797 422891229 421761513 420541912 419326633 418161660 416962802 415748000
3202.1 415748000 414592057 413420439 412196487 411007822 409843236 408667386 407534480 406413376
3218.4 406413376 405240208 404080302 402963549 401828021 400706917 399703890 398777932 397733450
3234.7 397733450 396571189 395465106 394408047 393394917 392487943 391562223 390520781 389494270 388565898
3253.1 388565898 387630910 386626393 385613590 384620577 383671403 382831007 382076561 381318003 380466998
3271.4 380466998 379490763 378447056 377429038 376497388 375611365 374749005 373924434 373086065 372250378
3289.8 372250378 371442080 370584965 369625062 368563712 367506146 366590649 365785658 364941269 363930315
3308.2 363930315 362721086 361436337 360247046 359138370 357986987 356815428 355691582 354518175
3324.5 354518175 353177279 351747632 350349963 349000096 347728640 346529245 345231414 343771100
3340.8 343771100 342293233 340860426 339537501 338396102 337237656 335896254 334530085 333286673
3357.1 333286673 332128316 330996424 329908282 328921199 327952504 326820105 325476319 324110627 322964519
3375.5 322964519 321968436 320920408 319817364 318760276 317811877 316983074 316268682 315521866 314562291
3393.8 314562291 313564420 312846273 312291086 311486810 310444981 309539437 308846176 308197945 307517618
3412.2 307517618 306798041 306070328 305446953 304961264 304497123 304030955 303670853 303446859 303244412 303075880
3432.6 303075880 303015679 302816093 302322596 301822662 301505953 301378995 301447779 301528454 301519722 301553696 301675707
3455 301675707 301854134 302107126 302371591 302643955 303117305 303743660 304140747 304206818 304309011 304662585
3475.4 304662585 305132717 305610836 306032598 306436002 306987643 307599276 308119625 308657944 309307158 310027808
3495.8 310027808 310693055 311314315 312056303 312740177 313189745 313723236 314535648 315476418 316325575 317010373
3516.2 317010373 317667723 318464875 319463700 320405453 321172714 322046757 323046178 324058056 325187355
3534.5 325187355 326340914 327297509 328186721 329224765 330454439 331638247 332594424 333640903 334914714
3552.9 334914714 336138189 337280780 338506788 339622051 340329498 341233313 343161434 345308542 346825302
3571.3 346825302 348122656 349524021 351024449 352621824 354097068 355240136 356601119 358669937
3587.6 358669937 360577613 361920029 363408834 365208179 367084563 369092464 370995283 372381926
3603.9 372381926 373643816 375395596 377288878 378973454 380346864 381312072 382894248 385404825
3620.2 385404825 387433559 388514280 389963269 393733680 398086995 400739640 403074652 405469954
3636.5 405469954 407674164 409681916 411032319 411604375 412798494 416541278 420814693 422790498
3652.8 422790498 424641192 427776456 430542678 432504803 434064537 434873372 435483009 437375128 439376682
3671.2 439376682 440569729 443468511 446748227 448289305 449138343 449217409 448627353 448758215 449857116
3689.6 449857116 450140446 449446887 448783487 448588699 449428082 451716274 453922540 454868883 455559134
3707.9 455559134 457579881 461010754 463231683 463720053 463902295 464362502 465016007 465868831 466704994
3726.3 466704994 466610491 465755612 465454310 466642588 468609095 468882084 467027932 465835243 466896921
3744.6 466896921 467011333 466310859 467694879 469304830 469021022 468411505 468797714 469236970 468878150
3763 468878150 468466043 468373805 468871742 469575286 469469965 468799829 468453616 468746334 468852013 468628466
3783.4 468628466 468663782 468718737 468532622 467956901 467090338 466419756 465584785 465166509 465985298 466161966
3803.8 466161966 466235340 467144698 466914505 465391874 464297593 464205056 463748068 463925362 465202540
3822.1 465202540 465275049 464668781 464050144 463342041 462717682 461971849 461764395 462460160 462950617 463197052
3842.5 463197052 463280827 462268442 459900498 457738429 459014893 462253213 462317944 460712492 459411800
3860.9 459411800 459035575 458927482 458171099 458007634 458691269 458982050 458687782 457706302 457060724 456981927
3881.3 456981927 456823975 457196057 457029283 456240773 456433207 456496507 455263883 453909785 453384489
3899.6 453384489 453685254 454578787 455208331 454992026 454400182 453636557 452756733 452311754 452393085 452281028
3920 452281028 451833278 451593101 451421916 450879544 450446963 450560749 450637907 450234622 449559331 449005038
3940.4 449005038 448811859 448569059 448153764 447991550 447900802 447597712 447244257 446920395 446599901 446336567
3960.8 446336567 446083337 445756733 445429444 445126653 444777310 444450855 444253504 444068074 443820238 443616867
3981.2 443616867 443412155 443029404 442537040 442189008 441979527 441723108 441414028 441115826
3997.5 441115826
##END=$$ End of the data block
