##TITLE=$$ Begin of the data block
##JCAMP-DX=5.00 $$ ACD/SpecManager v 10.08
##SPECTROMETER/DATA SYSTEM=Alpha
##DATE=13 Jun 2014 08:26:00
##DATA TYPE=INFRARED SPECTRUM
##DATA CLASS=XYDATA
##ORIGIN=
##OWNER=
##NPOINTS=1765
##FIRSTX=399.75695801
##LASTX=3997.56933594
##MAXX=3997.56933594
##MINX=399.75695801
##MAXY=0.74172062
##MINY=0.30997083
##XFACTOR=1.0000000000
##YFACTOR=1.000000000000000e-9
##FIRSTY=0.59570467
##DELTAX=2.03957629
##XUNITS=1/CM
##YUNITS=ARBITRARY UNITS
##XYDATA=(X++(Y..Y))
399.8E95704675J587033m42982J78695J098394m62055o60479L26157q73447j774370
418.1E94681621n2452j00792j121819J8477K46048j049339k11954J225411O94573O49691
438.5E94979465J268089M05073j24156N17249j67072j186073n82337n84245j966298
456.9E92559695j726269j023055k234816k730191j569927q44419k85864J351536K274096
475.2E85770786J944542K251565K376378J364827J117468J704097J111745L17097P03395
493.6E98661900N50508l26216k36452K1816m78089m22836R9302m47810r69589n23448
514E95929086r21488j732587j124323p46310j536488j451790p76172j317740j612663
532.3E84709525q23021o37114p22229J07526O36101L53754N80549R34839L98577J27732
$$ y = [595704675, 597291708, 596848726, 597027421, 598125815, 597663760, 597003281, 597329438, 596455991, 594681621, 594629169, 594528377, 593406558, 593425035, 593671083, 592621744, 592409790, 593635201, 594329774, 594979465, 596247554, 596652627, 596528471, 597045720, 596878648, 595692575, 595110238, 594525993, 592559695, 590833426, 589810371, 587575555, 584845364, 583275437, 582431018, 582145154, 583496690, 585770786, 587715328, 589966893, 592343271, 593708098, 594825566, 596529663, 597641408, 597958505, 598661900, 599212408, 598886192, 598649740, 598671556, 598193467, 597770631, 597869933, 597422123, 596452534, 595929086, 595007598, 593275011, 592150688, 591404378, 589867890, 588416100, 587639928, 586322188, 584709525, 583886504, 583249390, 582527161, 582634687, 583270788, 583624542, 584205091, 585139930, 585538507, 585666239]
552.7E85666239O17504M97401J25766P28249J203299P24495O43551J053452O99044
571.1E91959000K83122O29365O54161K87891N27322O05404J40965L42369P96497M91202
591.5E96717298L08871O70076M13239j35303J52409K17080l65376k30432Q9527m01676
611.9E97435713n39363P8142K86579L78907J127839J387596Q65758J006603J370251
630.2F03398025R37343P64548J258493J138329P05898J047552J174033N64038N60701
648.6F11548960R42409M02451r6798K26259l8803o18755O199N79834k34962m42982
669F12273812Q68380P38681M55498J085222J063705M32908P97987J103223L10957J19865
689.4F19250238P08640L71575p8678M25339N97894K97665P55370J088560J83820m02152
$$ y = [585666239, 586283743, 586781144, 586906910, 587635159, 588838458, 589562953, 590206504, 591259956, 591959000, 592242122, 592871487, 593525648, 593813539, 594340861, 594946265, 595087230, 595429599, 596226096, 596717298, 597026169, 597696245, 598109484, 597974181, 598126590, 598343670, 597978294, 597747862, 597837389, 597435713, 596896350, 596974492, 597261071, 597639978, 598767817, 600155413, 601021171, 602027774, 603398025, 604335368, 605099916, 606358409, 607496738, 608202636, 609250188, 610424221, 610988259, 611548960, 612491369, 612893820, 612797022, 613023281, 612984478, 612365723, 612371922, 612951756, 612716794, 612273812, 613142192, 613880873, 614336371, 615421593, 616485298, 616918206, 617716193, 618819416, 619130373, 619250238, 619958878, 620330453, 620251775, 620677114, 621275008, 621572673, 622328043, 623416603, 623600423, 623198271]
709.8F23198271J62184N13434O79374J437247J671970J261413J976609K889395K210200
728.1F36000097J658737K170027J717448P10905R71436J146197L64185N60462J301646
746.5F46601140P31528L57390J247346J334727O58989J201034J736521Q68261O33478
764.8F55370414J391113R13501J49608P82489R27270M3809L01659R97842M15086K40028
785.2F61532819J043916P25150q225O08444Q98659P7844L02195J065195L88503j63317
805.6F66471183M80116J99377p39097k12729M39465p4327K60114J414657J254380R98080
826F70491219K027154K210497J291812J551926K007127R72152L46064P97689K44796
844.4F81940436p63774m29570n85020k074003j400054J359761K277434J683116J200557
$$ y = [623198271, 623360455, 623873889, 624553263, 625990510, 627662480, 628923893, 630900502, 633789897, 636000097, 637658834, 639828861, 641546309, 642257214, 643228650, 644374847, 644739032, 645299494, 646601140, 647332668, 647690058, 648937404, 650272131, 650931120, 652132154, 653868675, 654736936, 655370414, 656761527, 657675028, 657824636, 658607125, 659534395, 659578204, 659879863, 660877705, 661292791, 661532819, 662576735, 663301885, 663293660, 663902104, 664800763, 664878607, 665180802, 666245997, 666634500, 666471183, 666951299, 667150676, 666411579, 666198850, 666638315, 666563988, 666824102, 668238759, 669493139, 670491219, 672518373, 674728870, 676020682, 677572608, 679579735, 680551887, 680897951, 681695640, 681940436, 681176662, 680747092, 680162072, 678088069, 676688015, 678047776, 680325210, 682008326, 683208883]
862.7F83208883p09176m249752p771492j0549724j0853171p029772m81904O275714
879.1F47839606J1190474J2424409R759486N950987L810644K400935L16978p90000
895.4F92903519o23525j352131k376497j856088j196266j430153j004398k09987m11451
913.7F82443023l62635N03600K69830p81894p83384p59422j732707j954258j258135
932.1F75584018j396000j643896r14634p31587j385212j131832m38512n98788n97358
950.4F66746199j40309p09295j768947j908839k161205l077030l205776k857387l306270
968.8F47611141l639161l293813l557205m322350m379332m375398m996598n097329
985.1F13949955m585982m656195m823149m340887m162371m447758m138470l658831
$$ y = [683208883, 682499707, 678249955, 670478463, 659928739, 649075568, 642045796, 641563892, 647839606, 659030080, 671454489, 681213975, 687164962, 690975606, 693376541, 693693519, 692903519, 692279994, 690927863, 688551366, 686695278, 685499012, 684068859, 683064461, 682854474, 682443023, 682080388, 682583988, 682853818, 682071924, 681288540, 680529118, 678796411, 676842153, 675584018, 674188018, 672544122, 671629488, 670897901, 669512689, 668380857, 667942345, 667343557, 666746199, 666605890, 665896595, 664127648, 662218809, 660057604, 656980574, 653774798, 650917411, 647611141, 643971980, 640678167, 637120962, 632798612, 628419280, 624043882, 619047284, 613949955, 609363973, 604707778, 599884629, 595543742, 591381371, 586933613, 582795143, 579136312]
1001.4E79136312l789186l581524k637685k009034j667738j008570q21888j531721
1017.7E62088966k145886k521336l221512l685951l466249l166377k679527j281619
1034.1E39920509N39005J804232K524853K745271K102732J161397O65784K41577k97725
1052.4E51407635m07457j48535J96993J056552K220512K644837K331972K004206J588106
1070.8E62894821R03905M48525L31044P7545j01924K83957O70552O45459Q43823J190662
1091.2E68188369J116693J007200J152157J073897Q16524Q63016Q76665N05805K85924
1109.5E75886250N00321R41634J574218K129674K148867J869440J926601K208412K360403
1127.9E91545820K647460L016710L016889K834499K762854K435625J712322J143217
$$ y = [579136312, 575347126, 571765602, 569127917, 567118883, 565451145, 564442575, 563620687, 562088966, 559943080, 557421744, 554200232, 550514281, 547048032, 543881655, 541202128, 539920509, 540459514, 542263746, 544788599, 547533870, 549636602, 550797999, 551463783, 551705360, 551407635, 551000178, 550851643, 551048636, 552105188, 554325700, 556970537, 559302509, 561306715, 562894821, 563798726, 564247251, 564578295, 564655840, 564553916, 564837873, 565508425, 566153884, 566997707, 568188369, 569305062, 570312262, 571464419, 572538316, 573354840, 574217856, 575094521, 575600326, 575886250, 576386571, 577328205, 578902423, 581032097, 583180964, 585050404, 586977005, 589185417, 591545820, 594193280, 597209990, 600226879, 603061378, 605824232, 608259857, 609972179, 611115396]
1144.2F11115396Q05438K82526k14518l56972n19275r14991j105011r54211n57780
1162.6F07580602M02272J707435K511859K834618L195583L381312L151596K939761
1178.9F27705038K841353K432644J899243J584291J108229M00603j3649k68519p65622
1197.2F36923611j126230j089751j129151j215517q63493m42326m37915m66764l63648
1215.6F29788816m95136o37352m49479m03583o85155p23780o15656q33571q97288m96865
1236F23550951l34978n33938m82202l70025n76735n86748k07186j21891l19719k22087
1256.4F19795442j25170k53260n4360L21150K52962J66893M86493O18816L77416L51072
1276.8F21937454M33266K78175M41789R45986R35316N30779M78268M41611M0650j14500
$$ y = [611115396, 611920834, 612203360, 611988842, 611631870, 611112595, 610197604, 609092593, 608138382, 607580602, 607982874, 609690309, 612202168, 615036786, 618232369, 621613681, 624765277, 627705038, 630546391, 632979035, 634878278, 636462569, 637570798, 637971401, 637957752, 637689233, 636923611, 635797381, 634707630, 633578479, 632362962, 631499469, 631057143, 630619228, 630152464, 629788816, 629293680, 628656328, 628206849, 627803266, 627118111, 626394331, 625778675, 624945104, 624047816, 623550951, 623215973, 622682035, 622199833, 621829808, 621253073, 620666325, 620459139, 620337248, 620017529, 619795442, 619670272, 619417012, 619362652, 619683802, 619936764, 620103657, 620590150, 621208966, 621586382, 621937454, 622370720, 622648895, 623090684, 624036670, 624971986, 625502765, 625981033, 626422644, 626463294, 626348794]
1297.2F26348794j9014l75867q19266p76529r09985j414477j487732j211763j220464
1315.5F18113697r84014j81078J29878j60456j80840k91944r85145j384735j257480
1333.9F12817883j386225j436054n58913K31981j1206k74479l16322q47876j404464
1352.2F06814325j344562j365304j764476j936674j775265j587808j544595j629591
1368.5E93866050j929998k265990j914442j338660j635552k078056k223372k444685
1384.9E78035295k431273j982630k259254l656149m548252m376471m651367m763782
1401.2E49366117m662693n287945n412460m955351m927576n140304n013526m840493
1417.5E09125769m393816k589822r28104j29520J94549P76470J512587J394152J362920
$$ y = [626348794, 626329780, 625953913, 625134647, 624358118, 623448133, 622033656, 620545924, 619334161, 618113697, 617129683, 616948605, 617078483, 616918027, 616737187, 616445243, 615460098, 614075363, 612817883, 611431658, 609995604, 609436691, 609668672, 609657466, 609382987, 609066665, 608218789, 606814325, 605469763, 604104459, 602339983, 600403309, 598628044, 597040236, 595495641, 593866050, 591936052, 589670062, 587755620, 586416960, 584781408, 582703352, 580479980, 578035295, 575604022, 573621392, 571362138, 567705989, 563157737, 558781266, 554129899, 549366117, 544703424, 539415479, 534003019, 529047668, 524120092, 518979788, 513966262, 509125769, 504731953, 502142131, 501214027, 501084507, 501279056, 502055526, 503568113, 504962265, 506325185]
1435.9E06325185K259791K256155J562059J252890J008630P08997Q63075R77218L60787
1454.2E17574787n7220J426041K342880J435399R68635J328230J048445M63069R40859
1472.6E27471125J851499J869440J701594J401245Q56221M59909L15726L87907J104892
1490.9E37419558J601457J092315O81043J458227J976192J033426k97964L37720K109647
1509.3E47411621J709282Q47340L13699J29342L81947J100122J608015J443982J619637
1527.6E56564987J521587O21021L79443Q16226R0301n57005J425743K888560K587676
1546E66338539K088726J810550J385868Q15570K15352n5611J744926K547145J323044
1564.3E78214109m9651q41379p60555p47085j653552k153098j263440j173616j722872
$$ y = [506325185, 508584976, 510841131, 512403190, 513656080, 514664710, 515373707, 516236782, 517214000, 517574787, 517517567, 518943608, 521286488, 522721887, 523690522, 525018752, 526067197, 526530266, 527471125, 529322624, 531192064, 532893658, 534294903, 535151124, 535611033, 535926759, 536314666, 537419558, 539021015, 540113330, 540794373, 542252600, 544228792, 545262218, 544964254, 545301974, 547411621, 549120903, 549968243, 550281942, 550411284, 550793231, 551893353, 553501368, 554945350, 556564987, 558086574, 558707595, 559087038, 559903264, 559993565, 559436560, 560862303, 563750863, 566338539, 568427265, 570237815, 571623683, 572439253, 572654605, 572598994, 574343920, 576891065, 578214109, 578164458, 577323079, 576562524, 575815439, 574161887, 572008789, 570745349, 569571733, 567848861]
1582.7E67848861j969099k380669k697110k636314k763271l027379k817214k627373
1599E46930432k931654l005743k706707k726495k844632k521038k409815l123045l311277
1617.4E21350026j900315j683831k266765j702666j112879r19640o28829q20219q70347
1635.7E09444535P24435J751661J448929P87616O75142J651525J899302J469553K792835
1654.1E22645533L848672L229260K722145K843976L253281K965152K766669L335118
1670.4E47609806L606796L810644M162968L684401K873957K717913M338562N338013
1686.7E78143060M846633M576862L808915L522933L919005M423678N715907N364239
1703F14321232M538297M600466M211783L372908K362907J737237K563417L740549L314018
$$ y = [567848861, 565879762, 563499093, 560801983, 558165669, 555402398, 552375019, 549557805, 546930432, 543998778, 540993035, 538286328, 535559833, 532715201, 530194163, 527784348, 524661303, 521350026, 519449711, 517765880, 515499115, 513796449, 512683570, 511763930, 511135101, 510314882, 509444535, 510168970, 511920631, 513369560, 514157176, 514832318, 516483843, 518383145, 519852698, 522645533, 526494205, 529723465, 532445610, 535289586, 538542867, 541508019, 544274688, 547609806, 551216602, 555027246, 559190214, 562874615, 565748572, 568466485, 572805047, 578143060, 582989693, 587566555, 591375470, 594898403, 598817408, 603241086, 608956993, 614321232, 618859529, 623459995, 627671778, 631044686, 633407593, 635144830, 637708247, 641448796, 644762814]
1721.4F44762814K639651K322913J819312J290321J009584J508057K586901K608300
1737.7F60547853K494215K668262K772450K792776K745807L309012M192888L756404
1754F85279667K879918K586007K428711K452075K355039J833081J246393Q45552J357019
1772.4G03263462K216875J842559J106739R70661R98140P99000P53581M85838o974
1790.7G12429881M99845J362681J067936N00679Q16644J403987J233399R13620R46283
1809.1G21174955J076460J187742J269102J120329Q35240O80506N56052L87490L12268
1827.4G28600144O39499J140475J013756P39693O97136L32654j38581N1796O96183
1845.8G33772755Q93652Q92103P07269K67624K06530M00484K87473J62423J85966j87039
$$ y = [644762814, 647402465, 649725378, 651544690, 652835011, 653844595, 655352652, 657939553, 660547853, 663042068, 665710330, 668482780, 671275556, 674021363, 677330375, 681523263, 685279667, 688159585, 690745592, 693174303, 695626378, 697981417, 699814498, 701060891, 701906443, 703263462, 705480337, 707322896, 708429635, 709400296, 710398436, 711197436, 711951017, 712436855, 712429881, 712929726, 714292407, 715360343, 715861022, 716677666, 718081653, 719315052, 720228672, 721174955, 722251415, 723439157, 724708259, 725828588, 726663828, 727344334, 727900386, 728287876, 728600144, 729239643, 730380118, 731393874, 732133567, 732830703, 733163357, 733024776, 733076572, 733772755, 734666407, 735558510, 736265779, 736533403, 736739933, 737140417, 737427890, 737590313, 737776279, 737589240]
1866.2G37589240l65913N30481J047671N21660J74046L24607K29656k3603J01149J39892
1886.6G40268886j28031R3162M29869J49965N424K82526K72870q881J2875Q1539j08421
1909G41351783j2815K49923m4942l88205k9385J77621m6372J06215L19660L7134j80185
1931.5G41540432N3406P9930k33472l28183k01821o6579J15633K42055L9220k58327
1951.9G40982294j64926k384j63853j90080k2351j91212l66211n3525J25527j04486
1972.3G39848793j28568l576j52528k57612p9691r9599l20494k82884j98603k36988
1992.6G38088250j10566K7060j26600k95937j80304j35184l26454k97547j30355k65658
2013G36246705m18544k46942j43647k92003k74897j52766k41340k86638j71781k54571
$$ y = [737589240, 737223327, 737753808, 738801479, 739323139, 739497185, 739821792, 740051448, 740027845, 740128994, 740268886, 740140855, 740234017, 740663886, 740813851, 740819275, 741101801, 741374671, 741365790, 741378665, 741460204, 741351783, 741338968, 741588891, 741543949, 741155744, 741126359, 741303980, 741257608, 741363823, 741683483, 741720617, 741540432, 741593838, 741673768, 741440296, 741112113, 740910292, 740843713, 740959346, 741201401, 741240621, 740982294, 740817368, 740814984, 740651131, 740461051, 740438700, 740247488, 739881277, 739827752, 739953279, 739848793, 739720225, 739716649, 739564121, 739306509, 739226818, 739127219, 738806725, 738523841, 738325238, 738088250, 737977684, 738004744, 737878144, 737582207, 737401903, 737266719, 736940265, 736642718, 736512363, 736246705, 735828161, 735581219, 735437572, 735145569, 734870672, 734717906, 734476566, 734189928, 734018147, 733763576]
2033.4G33763576m04120k92838k11238l04640k60889j42336k37405l20554j81914j46150
2053.8G31261492k70605k35260j51455k62141l09766j54912j39654k54869j97173j27911
2074.2G29157746k20955k49087j52350j67668k49326k20418k44319l35873k71916j66893
2094.6G26878941k33293k83360j93894k15232l28839k83003k13742k94686l17633k16126
2115G24299133k19643k94507k40564j76788k19702k17617j77681k39194k77698j64211
2135.4G22071528r7155j60098j64986j28865j92583k21014j01089m8161j45852j60635
2155.8G20651090q6486j08719j09851k1279m7803j47939j11580m7088j01625j22250
2176.2G19746470o7889q5593r9837j7524q166j01328r8765l5762q1540j21176n9724
$$ y = [733763576, 733359456, 733066618, 732855380, 732550740, 732289851, 732147515, 731910110, 731589556, 731407642, 731261492, 730990887, 730755627, 730604172, 730342031, 730032265, 729877353, 729737699, 729482830, 729285657, 729157746, 728936791, 728687704, 728535354, 728367686, 728118360, 727897942, 727653623, 727317750, 727045834, 726878941, 726645648, 726362288, 726168394, 725953162, 725624323, 725341320, 725127578, 724832892, 724515259, 724299133, 724079490, 723784983, 723544419, 723367631, 723147929, 722930312, 722752631, 722513437, 722235739, 722071528, 721974373, 721814275, 721649289, 721520424, 721327841, 721106827, 721005738, 720957577, 720811725, 720651090, 720564604, 720455885, 720346034, 720324755, 720276952, 720129013, 720017433, 719970345, 719868720, 719746470, 719678581, 719592988, 719493151, 719475627, 719467461, 719366133, 719267368, 719231606, 719150066, 719028890, 718969166]
2198.6G18969166q1658j51873q5175k8550j02520j26899q3625j31011j65999r3937
2219G17917919r9182j80542j51694j10626j84417k10643j28567j09911j50264j11699
2239.4G16480374r5606j77323j65701o4910r6380j85252j50799j26481j89841j67847
2259.8G15060234p8857j12653j84357j09911n8949j43528j49607j13607j71542j70648
2280.2G13766575j27196k08378k83063k04563j61469k44498k21789j50383k54392l45528
2300.6G11565316k55525k24710l40462l68535l30269l75391l95298l36885l62456m32014
2321G08143771l68715l43859m23133l65555k21491k30193l38316l70861l43680k70784
2341.4G04867184K3782K82944o140m19497o04928o97553o98030n58436l56078r4354
$$ y = [718969166, 718887508, 718735635, 718650460, 718621910, 718519390, 718392491, 718308866, 718177855, 718011856, 717917919, 717818737, 717638195, 717486501, 717375875, 717191458, 716980815, 716852248, 716742337, 716592073, 716480374, 716384768, 716207445, 716041744, 715976834, 715880454, 715695202, 715544403, 715417922, 715228081, 715060234, 714981377, 714868724, 714684367, 714574456, 714515507, 714371979, 714222372, 714108765, 713937223, 713766575, 713639379, 713431001, 713147938, 712943375, 712781906, 712537408, 712315619, 712165236, 711910844, 711565316, 711309791, 711085081, 710744619, 710376084, 710045815, 709670424, 709275126, 708938241, 708575785, 708143771, 707775056, 707431197, 707008064, 706642509, 706421018, 706190825, 705852509, 705481648, 705137968, 704867184, 704890966, 705173910, 705167770, 704748273, 704143345, 703445792, 702747762, 702189326, 701833248, 701738894]
2361.8G01738894J13189J59085J02639R8944K04921K45392J86503J47998N8890r6858
2382.2G02959597j35243p7903j60337l01659k78175k52187l15249k90870k44797k96831
2402.6G00606346l40938l23058l28600l59416l24965k90572l46661l56197l01659l55423
2423F97278857m37021l87728l49224m02450l86954l49939m36902m85181l78728l46601
2443.4F93318129m31359m42624m34697m93765m85718l93450m00722m69447m79042n25355
2463.8F88761950o01471n80251n24283n52177o05226o11484o58869p54297p31170o55115
2484.2F82487607o90579p43211p47025p60972p50125o74128o40393o87241o79672o44743
2504.6F75469518p09832p41482o36995n89847o53804o40988n71072n88477n80787m77612
$$ y = [701738894, 701852083, 702011168, 702113807, 702212751, 702417672, 702663064, 702849567, 702997565, 703056455, 702959597, 702824354, 702746451, 702586114, 702284455, 702006280, 701754093, 701438844, 701147974, 700903177, 700606346, 700265408, 699942350, 699613750, 699254334, 698929369, 698638797, 698292136, 697935939, 697634280, 697278857, 696841836, 696454108, 696104884, 695702434, 695315480, 694965541, 694528639, 694043458, 693664730, 693318129, 692886770, 692444146, 692009449, 691515684, 691029966, 690636516, 690235794, 689766347, 689287305, 688761950, 688160479, 687580228, 687055945, 686503768, 685898542, 685287058, 684628189, 683873892, 683142722, 682487607, 681797028, 681053817, 680306792, 679545820, 678795695, 678121567, 677481174, 676793933, 676114261, 675469518, 674759686, 674018204, 673381209, 672791362, 672137558, 671496570, 670925498, 670337021, 669756234, 669278622]
2525F69278622m32730m40240l72887l22938l74078l79265l04460k98679l76642l93331
2545.4F65583372l45826l43680l13342k58982l32654m24623m02034m02510m61101m35472
2565.8F61863148l71098m09961m63426m51684m74155n28753n10335m62472m89652n22435
2586.2F57179177n17249n39422n28396m74214m98772n64158n62608n51343n87046n76079
2606.6F51779890m98235n02050n73695n62548n30899n51701n48541n20706n21958n33939
2626.9F46435618n36680n67972o20783n94377n22614n35548n76019n89251o38903o87778
2647.3F40565693o51598n85079n86092o24776o39916o51717o57439o10888n75960o22332
2667.7F34359896o56307o39319o58452o75083o18159n98550o67930o94990o74546o93977
$$ y = [669278622, 668845892, 668405652, 668032765, 667709827, 667335749, 666956484, 666652024, 666353345, 665976703, 665583372, 665237546, 664893866, 664580524, 664321542, 663988888, 663564265, 663162231, 662759721, 662298620, 661863148, 661492050, 661082089, 660618663, 660166979, 659692824, 659164071, 658653736, 658191264, 657701612, 657179177, 656661928, 656122506, 655594110, 655119896, 654621124, 654056966, 653494358, 652943015, 652355969, 651779890, 651281655, 650779605, 650205910, 649643362, 649112463, 648560762, 648012221, 647491515, 646969557, 646435618, 645898938, 645330966, 644710183, 644115806, 643593192, 643057644, 642481625, 641892374, 641253471, 640565693, 639914095, 639329016, 638742924, 638118148, 637478232, 636826515, 636169076, 635558188, 634982228, 634359896, 633703589, 633064270, 632405818, 631730735, 631112576, 630514026, 629846096, 629151106, 628476560, 627782583]
2688.1F27782583o77705o13808o08683o32524o21975o41882p00653o81221n98193n72860
2708.5F21433079n97894o06179o11007o24240n85317n25892n36919n58436n47409n75781
2728.9F15664005n79655n04196m54187m47214m35829m33564m58360m75168m42266m14074
2749.3F11019492m31180m48525m81546n31435n46813n52475n50509n21660n09858n40197
2769.7F05905294n66065n53012o02364o93739o74367o36935o79672o82294o25789o60301
2790.1E99530756p59601p80881p62164q02279q78215q97228q59916q29578q43048r23753
2810.5E91194093j015961j023769r93908j022577j065493j089453j145244j236200
2826.8E82601488j321376j390338j464784j581788j778066k059519k397597k745927
$$ y = [627782583, 627104878, 626491070, 625882387, 625249863, 624627888, 623986006, 623285353, 622604132, 622005939, 621433079, 620835185, 620229006, 619617999, 618993759, 618408442, 617882550, 617345631, 616787195, 616239786, 615664005, 615084350, 614580154, 614125967, 613678753, 613242924, 612809360, 612351000, 611875832, 611433566, 611019492, 610588312, 610139787, 609658241, 609126806, 608579993, 608027518, 607477009, 606955349, 606445491, 605905294, 605339229, 604786217, 604183853, 603490114, 602815747, 602178812, 601499140, 600816846, 600191057, 599530756, 598771155, 597990274, 597228110, 596425831, 595547616, 594650388, 593790472, 592960894, 592117846, 591194093, 590178132, 589154363, 588160455, 587137878, 586072385, 584982932, 583837688, 582601488, 581280112, 579889774, 578424990, 576843202, 575065136, 573005617, 570608020, 567862093]
2843.1E67862093l061354l166854k806306k008080j107395m30703r7871p1168k02894
2861.5E54909468l87013o48260q86143r39726q31783o94335o21021o25789p05719q21531
2881.9E47748148r49263j099646j210332j243949j243532j251578j233876j160860
2898.2E38355112j096129j094163j157582j287520j497209j727759j924873k083003
2914.5E26486874k067268j787067j392185r66847m70043K7597L71814N13971O05404
2932.9E21322250P07925P51435P93219Q27134P49111N49376K76804K1934j42574k75075
2953.3E25581539m08829l97801j76907N1856J39416K07782L42011M40657M88103N43892
2973.7E26811719N42939M89175M96089M93288M07935L31998K91705K25365O9380j11580
$$ y = [567862093, 564800739, 561633885, 558827579, 556819499, 555712104, 555281401, 555183530, 555112362, 554909468, 554522455, 553874195, 552988052, 552048326, 551216543, 550522208, 549901187, 549275398, 548569679, 547748148, 546798885, 545699239, 544488907, 543244958, 542001426, 540749848, 539515972, 538355112, 537258983, 536164820, 535007238, 533719718, 532222509, 530494750, 528569877, 526486874, 524419606, 522632539, 521240354, 520273507, 519803464, 519831061, 520202875, 520716846, 521322250, 522030175, 522781610, 523574829, 524401963, 525151074, 525700450, 525977254, 525999188, 525856614, 525581539, 525172710, 524774909, 524598002, 524649858, 524789274, 524997056, 525339067, 525779724, 526267827, 526811719, 527354658, 527843833, 528339922, 528833210, 529241145, 529573143, 529864848, 530090213, 530159593, 530048013]
2994.1E30048013k04504l29137n21660n95331n89549o30081o23524n67913n92470o25491
3014.5E24768353o01411o53327p65025p84398p92086q93771q92759p66217p57993q69691
3034.9E16991675r41277r18984r11236r40144r59277j020312j021922r56416r75728
3053.2E08346379r92656r48548r51946r75847r12071q00788q18849r44614r60231q99434
3073.6D99141395q39144p32809p42227q96007r68903r36121q89122r11862r98318j019001
3094D90207881r43095q15183p61747q89123j011878r32187q41289r32187r65953q44032
3114.4D81271207q47429r76354j070082j177877j211196j062483r43631j033783j149088
3132.8D71799284j095176r93251r91762j067847j145393j177281j152575j076072j019657
$$ y = [530048013, 529843509, 529514372, 528992712, 528397381, 527807832, 527177751, 526554227, 525986314, 525393844, 524768353, 524166942, 523513615, 522748590, 521964192, 521172106, 520278335, 519385576, 518619359, 517861366, 516991675, 516050398, 515131414, 514220178, 513280034, 512320757, 511300445, 510278523, 509322107, 508346379, 507353723, 506405175, 505453229, 504477382, 503565311, 502764523, 501945674, 501001060, 500040829, 499141395, 498302251, 497569442, 496827215, 495931208, 494962305, 494026184, 493137062, 492225200, 491226882, 490207881, 489264786, 488449603, 487687856, 486798733, 485786855, 484854668, 484013379, 483081192, 482115239, 481271207, 480423778, 479447424, 478377342, 477199465, 475988269, 474925786, 473982155, 472948372, 471799284, 470704108, 469710857, 468719095, 467651248, 466505855, 465328574, 464175999, 463099927, 462080270]
3151.1D62080270j086295j209199j251549j226186j190692j190246j214385j211643
3167.4D52500075j194119j205415j265228j285791j231521j218945j229972j201540
3183.7D42667544j214951j241774j231968j268953j306415j249283j204014j250833
3200.1D32699353j271904j224697j203268j224041j215846j209229j260370j268923
3216.4D22821075j229704j250297j260757j177490j110196j119077j085788j033694
3232.7D13554072j146853j255989j161962j079649j047969r43273r22650j059294j104146
3251.1D03832287r98855r71794j023323j018315r90808r93610r84758r16302q39740
3269.4C95094782q72284r51856r89229j006603r68576r58830r85831r31829q82357
$$ y = [462080270, 460993975, 459784776, 458533227, 457307041, 456116349, 454926103, 453711718, 452500075, 451305956, 450100541, 448835313, 447549522, 446318001, 445099056, 443869084, 442667544, 441452593, 440210819, 438978851, 437709898, 436403483, 435154200, 433950186, 432699353, 431427449, 430202752, 428999484, 427775443, 426559597, 425350368, 424089998, 422821075, 421591371, 420341074, 419080317, 417902827, 416792631, 415673554, 414587766, 413554072, 412407219, 411151230, 409989268, 408909619, 407861650, 406918377, 405995727, 404936433, 403832287, 402833432, 401861638, 400838315, 399820000, 398829192, 397835582, 396850824, 395934522, 395094782, 394222498, 393270642, 392281413, 391274810, 390306234, 389347404, 388361573, 387429744, 386547387]
3287.8C86547387q56430q27104q96900j045257j130462j059920r08494q44270r21964
3306.1C78056586j095981j270562j324892j268059j248807j259833j227886j212686
3322.4C68147880j264900j384884j483172j495213j483500j415103j300306j364260
3338.8C56956542j552999j596511j529962j404166j231909j274109j503229j506954
3355.1C45356703j296938j207202j280248j287878j104176r84281j167715j459837
3371.4C35568428j477510j211613j039326j096875j205265j179725j038373q96901
3387.7C26422840p40200p42763j024485j129895q26657o01560q16047j102209j013547
3406.1C18425477p77305o90162o81668p25568p80075o78093n02526m62890m56870l48061
$$ y = [386547387, 385690957, 384863853, 383966953, 382921696, 381791234, 380731314, 379822820, 378978550, 378056586, 376960605, 375690043, 374365151, 373097092, 371848285, 370588452, 369360566, 368147880, 366882980, 365498096, 364014924, 362519711, 361036211, 359621108, 358320802, 356956542, 355403543, 353807032, 352277070, 350872904, 349640995, 348366886, 346863657, 345356703, 344059765, 342852563, 341572315, 340284437, 339180261, 338195980, 337028265, 335568428, 334090918, 332879305, 331839979, 330743104, 329537839, 328358114, 327319741, 326422840, 325682640, 324939877, 323915392, 322785497, 321958840, 321357280, 320541233, 319439024, 318425477, 317648172, 316958010, 316276342, 315550774, 314770699, 314092606, 313590080, 313127190, 312670320, 312322259]
3426.5C12322259k40088k16692j64777j01328k36184m81516n01692l06547j02609K1249
3446.8C09992075L6806N1945J02938J49488K35140L36975K87980K56121N35935P32124
3467.2C12717527M55707R2984J22487L87013N70029O03914M87775M29869N92500P12424
3487.6C17172229O56545O19233O87629Q01832P51584O56724Q08537Q32975O11812O39081
3508C24238181R08554J075744R74626Q09759Q16702R45390J100272J006961Q21620
3526.4C32697809R76473J150220J118988J224011J327187J148671J042277J189083
3542.7C41874719J409202J364261J110107J197279J410752J334667J273781J387418
3559C52362186J242697Q23706J103670K183735K367884J697570J481116J602858J699269
$$ y = [312322259, 312082171, 311865479, 311700702, 311599374, 311363190, 310881674, 310379982, 310073435, 309970826, 309992075, 310028881, 310080826, 310183764, 310333252, 310568392, 310905367, 311193347, 311449468, 311985403, 312717527, 313173234, 313266218, 313388705, 313775718, 314345747, 314949661, 315437436, 315867305, 316459805, 317172229, 317828774, 318448007, 319135636, 319937468, 320689052, 321345776, 322154313, 322987288, 323599100, 324238181, 325146735, 326222479, 327197105, 328006864, 328823566, 329768956, 330869228, 331876189, 332697809, 333674282, 334824502, 335943490, 337167501, 338494688, 339643359, 340685636, 341874719, 343283921, 344648182, 345758289, 346955568, 348366320, 349700987, 350974768, 352362186, 353604883, 354428589, 355532259, 357715994, 360083878, 361781448, 363262564, 364865422, 366564691]
3577.4C66564691J784891J672655J358211J536340K160221K014160J565427J768649
3593.7C80425245K037286K090901K237410K100110J547038J447410J977384K122909
3610C95985693J900047J549274J088351J709461K741426K390951J458049J713931L908485
3628.4D14445668M531712K936184K612859K652794K478034K316653J665026Q19207
3644.7D34458137J323014L781706M411638K233237K115816L399789L022224K147376
3661D56892937J676500R54092Q02845K088695K164483J305819K992004L430545J709909
3679.4D74017829R46760J24991n72354J53214J105279K38746o23256m79013q7529Q87036
3699.8D75711703K418012K435863J203269Q27759J986235L403694K371013P20561L34650
$$ y = [366564691, 368349582, 370022237, 371380448, 372916788, 375077009, 377091169, 378656596, 380425245, 382462531, 384553432, 386790842, 388890952, 390437990, 391885400, 393862784, 395985693, 397885740, 399435014, 400523365, 402232826, 404974252, 407365203, 408823252, 410537183, 414445668, 418977380, 421913564, 424526423, 427179217, 429657251, 431973904, 433638930, 434458137, 435781151, 439562857, 443974495, 446207732, 448323548, 451723337, 454745561, 456892937, 458569437, 459523529, 460326374, 462415069, 464579552, 465885371, 468877375, 472307920, 474017829, 474964589, 475089580, 474517226, 474670440, 475775719, 476014465, 475391209, 474912196, 474824667, 475711703, 478129715, 480565578, 481768847, 482596606, 484582841, 487986535, 490357548, 491078109, 491412759]
3718.1D91412759M85956O53655R54062R64641k1398q15183l27587J130700J945496
3736.5D96383101K98708j758009j107573J000374O8456o13004J466036J704723j33544
3754.8D97309268n17339L72678L86924l89338l78430K8163O00040P10130j42127p24197
3775.2D97255772l36468M21137K12341k33918L099J09911q4400m89503q13663o65635
3795.6D95378673q58456m63426P56979J95891J31458R15289j79351j444041j058788
3814D93374228p6115m50849J52528J257390J47462n36770o35385p67112o63817o67751
3834.4D91133809p6383P09355M34249K54929J47283r77933k415299k251000J223654
3852.7D88182664L201157Q9824j455098j184315m31389j36584n80430K0445O84649
$$ y = [491412759, 491898715, 492552370, 493506432, 494471073, 494449675, 493634492, 493306905, 494437605, 496383101, 496681809, 494923800, 493816227, 494816601, 494885057, 494272053, 495738089, 497442812, 497309268, 496791929, 497164607, 497551531, 497162193, 496783763, 496811926, 497411966, 498122096, 497979969, 497255772, 496919304, 497340441, 497552782, 497318864, 497321963, 497431874, 497347474, 496857971, 496044308, 495378673, 494520217, 494056791, 494813770, 495009661, 495141119, 496056408, 495877057, 494433016, 493374228, 493298113, 492847264, 492999792, 494257182, 494404644, 493867874, 493232489, 492465377, 491801560, 491133809, 491057426, 491766781, 492201030, 492455959, 492603242, 491625309, 489210010, 486959010, 488182664, 491383821, 491473645, 490018547, 488834232, 488402843, 488266259, 487685829, 487706274, 488390923]
3871.1D88390923K62618k80351r52720n88030j07050k57790L06547j65105p31021J89006
3891.5D86067027l576j217813j285404n43087K39908R32128P18921j61082n29319o79940
3911.9D83537763q51601m76033Q5295o9320m41462k57194j85699n22613l33548J86771
3932.3D80672359N3972m00632o33955n51522k19643k56807m17769j43826Q345j92195
3952.7D77918327l47853l75986l70771k61098j43379k46256m00663m00692l56108k89112
3973.1D74726409j53184j45942k74688k70248j75684k25515l20732l06964k82615l04491
3993.4D72266346k89053k49147
3997.5D71728146
$$ y = [488390923, 488653541, 488373190, 487420470, 486832440, 486725390, 486467600, 486774147, 486609042, 485878021, 486067027, 486063451, 484845638, 483560234, 483017147, 483257055, 484189183, 484908104, 484747022, 484217703, 483537763, 482686162, 482210129, 482295424, 482226104, 481784642, 481527448, 481341749, 480819136, 480485588, 480672359, 480726331, 480325699, 479691744, 479140222, 478920579, 478663772, 478246003, 478102177, 478110522, 477918327, 477570474, 477194488, 476823717, 476562619, 476419240, 476172984, 475772321, 475371629, 475015521, 474726409, 474573225, 474427283, 474152595, 473882347, 473706663, 473481148, 473160416, 472853452, 472570837, 472266346, 471977293, 471728146]
##END=$$ End of the data block
