##TITLE=$$ Begin of the data block
##JCAMP-DX=5.00 $$ ACD/SpecManager v 10.08
##SPECTROMETER/DATA SYSTEM=Alpha
##DATE=13 Jun 2014 08:26:00
##DATA TYPE=INFRARED SPECTRUM
##DATA CLASS=XYDATA
##ORIGIN=
##OWNER=
##NPOINTS=1765
##FIRSTX=399.75695801
##LASTX=3997.56933594
##MAXX=3997.56933594
##MINX=399.75695801
##MAXY=0.75392956
##MINY=0.32367492
##XFACTOR=1.0000000000
##YFACTOR=1.000000000000000e-9
##FIRSTY=0.59740955
##DELTAX=2.03957629
##XUNITS=1/CM
##YUNITS=ARBITRARY UNITS
##XYDATA=(X++(Y..Y))
399.8E97409546R10223j058757o64175K66731q76725r08911K16603q95202j864552
$$ 597409546 598319769 597261012 596596837 596863568 595986843 595077932 595294535 594399333 592534781
418.1E92534781k5452J5259r11116J86145J80423j034021k83182Q29875N86093P47740
$$ 592534781 592509329 592524588 591613472 591799617 591980040 590946019 590662837 591492712 592078805 592826545
438.5E92826545J068235R8705l38256O32405K29835r39905m03166m49777k213239k154410
$$ 592826545 593894780 593993485 593655229 594287634 594517469 593577564 593174398 592724621 590511382 588356972
458.9E88356972j099110k068043k715945j686335q33988j26362J420916K057731J588821
$$ 588356972 587257862 585189819 582473874 580787539 579953551 579827189 581248105 583305836 584894657
477.3E84894657K202332K686203J469016R90450J700997J088501J49726N64516N19693
$$ 584894657 587096989 589783192 591252208 592242658 593943655 595032156 595181882 595746398 596266091
495.6E96266091l38853k16305J01447l43978l07560L338n37813r27925o03974r94205
$$ 596266091 595927238 595710933 595812380 595468402 595160842 595164180 594626367 593698442 593094468 592100263
516E92100263j640499j019776o86228j484633j526951j017034j529217j654029o64234
$$ 592100263 590459764 589439988 588753760 587269127 585742176 584725142 583195925 581541896 580877662
534.4E80877662m70221p17938P1466N56349J24574M74394J184165P43091K62797N42402
$$ 580877662 580407441 579689503 579760969 580317318 580441892 580916286 582100451 582843542 583106339 583648741
554.8E83648741M21882J68145O90162R58442O23465Q18968J228213P86126K46465M86493
$$ 583648741 584070623 584238768 584928930 585887372 586510837 587329805 588558018 589344144 589590609 590077102
575.2E90077102N72503K82883N07355O00338K16782M40836P53999M00364L83497P49230
$$ 590077102 590649605 590932488 591439843 592040181 592256963 592697799 593451798 593852162 594235659 594984889
595.6E94984889M73380J3828J53184O3956m84645l97980o5327l90530m37021J88410
$$ 594984889 595458269 595472097 595625281 595689237 595204592 594806612 594741285 594350755 593913734 594102144
616E94102144L70205M31657J122653J316726Q32796J045764J421749R57311Q31604
$$ 594102144 594472349 594904006 596026659 597343385 598176181 599221945 600643694 601601005 602432609
634.3F02432609J454770J322448P27416R79661J157582N52714M20749P60079L91721
$$ 602432609 603887379 605209827 605937243 606916904 608074486 608627200 609047949 609808028 610199749
652.7F10199749M7565L04639p2300o40810J8537O63400l7134l18169Q50916P32541
$$ 610199749 610247314 610551953 610479653 609838843 609857380 610520780 610483646 610165477 611016393 611748934
673.1F11748934L99649R95755J103997N54800Q42989J100659L39091J62482P61688
$$ 611748934 612148583 613144338 614248335 614803135 615646124 616746783 617085874 617248356 618010044
691.4F18010044M03285j62959L65734O46949L20494P71105J084090J46568l84868K22445
$$ 618010044 618413329 618250370 618616104 619263053 619583547 620354652 621438742 621585310 621200442 621422887
711.8F21422887N57422O63937J407384J707614J310050J961530K876341K303362J820087
$$ 621422887 621980309 622644246 624051630 625759244 627069294 629030824 631907165 634210527 636030614
730.2F36030614K268196J697957O34193R68874J250625M20689N17130J352429Q87931
$$ 636030614 638298810 639996767 640630960 641599834 642850459 643271148 643788278 645140707 646028638
748.5F46028638M14312J253247J384020O36399J092970J679659R20117P35283J476049
$$ 646028638 646442950 647696197 649080217 649716616 650809586 652489245 653409362 654144645 655620694
766.9F55620694R71258J67847P72357R67562R6261L05951J020133M20213J89245J098215
$$ 655620694 656591952 656759799 657532156 658499718 658595979 658901930 659922063 660342276 660531521 661629736
787.3F61629736Q95918P0631O08802R44972J13547L10302J110852M39763j55092M78089
$$ 661629736 662525654 662596285 663205087 664150059 664263606 664573908 665684760 666124523 665969431 666447520
807.7F66447520K42234o29008q4400N07354p6413K30074J431704J326143J045227K066613
$$ 666447520 666689754 666060746 665976346 666483700 666407287 666637361 668069065 669395208 670440435 672507048
828.1F72507048K287447J323700J474500J990616J101375M64737Q71539K81573p88570
$$ 672507048 674794495 676118195 677592695 679583311 680684686 681149423 682020962 682302535 681513965
846.4F81513965m62472n79954k039849j359225J415194K319216J671136J167714p36773
$$ 681513965 681051493 680471539 678431690 677072465 678487659 680806875 682478011 683645725 682908952
864.8F82908952m327059p860481j0519982j0767758o985843m37796O371141J1309802
$$ 682908952 678581893 670721412 660201430 649433672 642447829 642010033 648381174 659690976
881.1F59690976J2472034R762942N963028L767788K319336K93553p35879n45919j301229
$$ 659690976 672163010 681925952 687888980 691656768 693976104 694269657 693533778 692987859 691686630
899.4F91686630k351761j821935j163959j453936j091004k68280l74556l17037N02408
$$ 691686630 689334869 687512934 686348975 684895039 683804035 683535755 683161199 682844162 683346570
917.8F83346570K76923p53820p71344p64012j707018j904964j232982j375437j632928
$$ 683346570 683623493 682869673 682098329 681334317 679627299 677722335 676489353 675113916 673480988
936.2F73480988r30548p10368j355768j181721n07474o23048o21974j84834p24494
$$ 673480988 672550440 671840072 670484304 669302583 668795109 668172061 667550087 667365253 666640759
954.5F66640759j775802j948714k143860l005504l195763k867103l303170l680944
$$ 666640759 664864957 662916243 660772383 657766879 654571116 651704013 648400843 644719899
970.8F44719899l343702l547609m280924m360318m363359m958570n049467m530489
$$ 644719899 641376197 637828588 633547664 629187346 624823987 619865417 614815950 610285461
987.1F10285461m592776m820645m389942m158258m410506m138946l652394l729880
$$ 610285461 605692685 600872040 596482098 592323840 587913334 583774388 580121994 576392114
1003.5E76392114l530681k649844k032339j642287r58800p62940j474440k145350k525031
$$ 576392114 572861433 570211589 568179250 566536963 565578163 564815223 563340783 561195433 558670402
1021.8E58670402l150821l599942l417134l125251k652049j299977M88460J756668
$$ 558670402 555519581 551919639 548502505 545377254 542725205 541425228 541913688 543670356
1038.1E43670356K500296K713859K030313J096904O96957L43204k23458l71456j17123
$$ 543670356 546170652 548884511 550914824 552011728 552708685 553051889 552828431 552456975 552339852
1056.5E52339852K37524J061559K176225K647281K384901K031446J600980R24051M71592
$$ 552339852 552577376 553638935 555815160 558462441 560847342 562878788 564479768 565403819 565875411
1074.8E65875411L64959J16706q7440K64347O72221O77288Q31604J157045J125991
$$ 565875411 566240370 566357076 566269636 566533983 567206204 567883492 568715096 569872141 570998132
1093.2E70998132J015902J131177J082360Q67606R05335R11295N45919K87592M98951
$$ 570998132 572014034 573145211 574227571 575095177 576000512 576911807 577457726 577745318 578244269
1111.6E78244269J004815J649380K170384K180159J899183J947104K227247K352178
$$ 578244269 579249084 580898464 583068848 585249007 587148190 589095294 591322541 593674719
1127.9E93674719K606273L006697L019035K807915K746820K451241J739621J157165
$$ 593674719 596280992 599287689 602306724 605114639 607861459 610312700 612052321 613209486
1144.2F13209486Q46148L74794j48952l60668n28157q74042j062930r34660n41628
$$ 613209486 614055634 614430428 614281476 613920808 613392651 612518609 611455679 610521019 609979391
1162.6F09979391L57986J631796K507389K837538L157139L380120L177047K956926
$$ 609979391 610337377 611969173 614476562 617314100 620471239 623851359 627028406 629985332
1178.9F29985332K877057K474606J910746J581609J139999M28557o2048l22640p50780
$$ 629985332 632862389 635336995 637247741 638829350 639969349 640397906 640335858 640013218 639262438
1197.2F39262438j118183j110077j098275j154423q29935m16160m39107n07057l47614
$$ 639262438 638144255 637034178 635935903 634781480 633951545 633535385 633096278 632589221 632241607
1215.6F32241607m05371n69344m25518l73005o66380p53522o33180p99180q61048m48883
$$ 632241607 631836236 631266892 630841374 630468369 629801989 629048467 628415287 627616107 626755059 626306176
1236F26306176k50041m95673n00917l38912n14924n99266k64346j42336l14474k11060
$$ 626306176 626056135 625560462 625059545 624720633 624205709 623606443 623342097 623199761 622885287 622674227
1256.4F22674227q4639k11000p2003L02434K78592J57833M63546O48618M06861L56197
$$ 622674227 622589588 622378588 622306585 622609019 622887611 623045444 623508990 624157608 624564469 624920666
1276.8F24920666M66824L23713M39763R24706R25422M91977M35412M68909R0897j17540
$$ 624920666 625387490 625711203 626150966 627075672 628001094 628493071 628928483 629397392 629488289 629370749
1297.2F29370749j5497l22461p98762p98881r09448j416683j498699j174033j174331
$$ 629370749 629355252 629032791 628234029 627435148 626525700 625109017 623610318 622436285 621261954
1315.5F21261954j007616j98603K06053q9943j82867l02851j000822j416862j237333
$$ 621261954 620254338 620055735 620261788 620171845 619988978 619686127 618685305 617268443 616031110
1333.9F16031110j316130j413822n76556K44737p510k98977l23177q39591j403570
$$ 616031110 614714980 613301158 612724602 612969339 612961829 612662852 612339675 611500084 610096514
1352.2F10096514j346588j379490j801669j962006j753867j565635j562238j626432
$$ 610096514 608749926 607370436 605568767 603606761 601852894 600287259 598725021 597098589
1368.5E97098589j894832k288818j960933j305461j608789k115727k210915k382934
$$ 597098589 595203757 592914939 590954006 589648545 588039756 585924029 583713114 581330180
1384.9E81330180k431810k013802k247334l655314m581988m379809m648566m786313
$$ 581330180 578898370 576884568 574637234 570981920 566399932 562020123 557371557 552585244
1401.2E52585244m662812n230844n345106m933238m924774n147040n052209m876256
$$ 552585244 547922432 542691588 537346482 532413244 527488470 522341430 517289221 512412965
1417.5E12412965m357993k548099r38833j22547K23637P90119J545489J436174J354754
$$ 512412965 508054972 505506873 504568040 504445493 504669130 505459249 507004738 508440912 509795666
1435.9E09795666K276659K326190J552224J187385J010835P65383R09626J016558L67224
$$ 509795666 512072325 514398515 515950739 517138124 518148959 518914342 519823968 520840526 521207750
1454.2E21207750j37329J415252K487719J523197R56237J378775J160085M68195Q68559
$$ 521207750 521070421 522485673 524973392 526496589 527452826 528831601 529991686 530459881 531328440
1472.6E31328440J888573J962066J749754J449227R10759M46200K58684L77357J112104
$$ 531328440 533217013 535179079 536928833 538378060 539288819 539735019 539993703 540371060 541483164
1490.9E41483164J579583J070678P02977J536250K076626J107573l47793K40565K241313
$$ 541483164 543062747 544133425 544836402 546372652 548449278 549556851 549209058 549449623 551690936
1509.3E51690936J874209R06705L25621J33395L40581J044213J675606J567364J692832
$$ 551690936 553565145 554471850 554797471 554930866 555271447 556315660 557991266 559558630 561251462
1527.6E61251462J587390O90222M18902Q49127R0003o17861J460731L028631K691328
$$ 561251462 562838852 563529074 563947976 564797103 564887106 564269245 565729976 568758607 571449935
1546E71449935K120734J836121J411557P44283M2439k12550J789093K661049J377284
$$ 571449935 573570669 575406790 576818347 577562630 577605069 577392519 579181612 581842661 583219945
1564.3E83219945m5776r04500q08657p08937j686633k305686j336396j185358j783669
$$ 583219945 583174169 582269669 581461012 580752075 579065442 576759756 575423360 574238002 572454333
1582.7E72454333k049327k431452k759278k741813k889276l155351k932906k700507
$$ 572454333 570405006 567973554 565214276 562472463 559583187 556427836 553494930 550794423
1599E50794423k977848l116727k872467k879083l014267k711534k575994l314257l558755
$$ 550794423 547816575 544699848 541827381 538948298 535934031 533222497 530646503 527332246 523773491
1617.4E23773491k070486j792133k394617j820623j167357r36747o64175q64207q75831
$$ 523773491 521703005 519910872 517516255 515695632 514528275 513591528 512927353 512063146 511187315
1635.7E11187315P63178J829684J579105Q90971P27474J821459K118468J586974K994060
$$ 511187315 511950493 513780177 515359282 516250253 516977727 518799186 520917654 522504628 525498688
1654.1E25498688M160404L456593K893150L040016L479778L133536K898812L524184
$$ 525498688 529659092 533115685 536008835 539048851 542528629 545662165 548560977 552085161
1670.4E52085161L780365L937721M364789L919840L017783K775908M457950N555868
$$ 552085161 555865526 559803247 564168036 568087876 571105659 573881567 578339517 583895385
1686.7E83895385N059004M789233L948450L542424L954112M534364N859911N553604
$$ 583895385 588954389 593743622 597692072 601234496 605188608 609722972 615582883 621136487
1703F21136487M732728M752814M330635L510893K486765J765430K574265L891170L492773
$$ 621136487 625869215 630622029 634952664 638463557 640950322 642715752 645290017 649181187 652673960
1721.4F52673960K762079K432048J885116J271964R75489J552522K709806K702594
$$ 652673960 655436039 657868087 659753203 661025167 662000656 663553178 666262984 668965578
1737.7F68965578K570510K769709K857506K845824K780854L318012M255831L901899
$$ 668965578 671536088 674305797 677163303 680009127 682789981 686107993 690363824 694265723
1754F94265723K985060K627135K485931K532720K428115J894653J282811Q08596J311422
$$ 694265723 697250783 699877918 702363849 704896569 707324684 709219337 710502148 711310744 712622166
1772.4G12622166K322495K000928J169443R95099J068831Q54671P78079N34892J0073
$$ 712622166 714944661 716945589 718115032 719110131 720178962 721033633 721811712 722346604 722356677
1790.7G22356677M45068J358628J129985N42224Q55088J494825J323104R59575R84668
$$ 722356677 722801745 724160373 725290358 725832582 726687670 728182495 729505599 730465174 731449842
1809.1G31449842J128436J223683J301587J188874Q80897O66022N61118M38214L30805
$$ 731449842 732578278 733801961 735103548 736292422 737173319 737839341 738400459 738838673 739169478
1827.4G39169478O48141J243294J124024P72536P30216L67999j81853j8478P23422
$$ 739169478 739817619 741060913 742184937 742957473 743687689 744055688 743873835 743855357 744578779
1845.8G44578779R69171R46760P75755L37183K49327M68552L73721J84119J54435k14159
$$ 744578779 745547950 746494710 747270465 747607648 747856975 748325527 748699248 748883367 749037802 748823643
1866.2G48823643l80457N54681J135767O05285J97589L50356K95818J2338R7096J49966
$$ 748823643 748443186 748997867 750133634 750738919 750936508 751286864 751582682 751595020 751692116 751842082
1886.6G51842082j18852R7275M87804K49684N7578K95162L11911K802j1146J22606
$$ 751842082 751723230 751820505 752308309 752557993 752615571 752910733 753222644 753225446 753214300 753336906
1907G53336906l7431o497K50757j6213l97861m7028K24650K6464J38164L36170R2864
$$ 753336906 753299475 753292978 753543735 753527522 753129661 753082633 753307283 753333747 753471911 753808081 753900945
1929.4G53900945j44481M5537J27554j61707l23653k09928m9174J14382K66850J25885
$$ 753900945 753756464 753802001 753929555 753767848 753444195 753234267 753185093 753299475 753566325 753692210
1949.8G53692210k06650j64568L4869j08719j86980j3530j45197l74258o2048K11239
$$ 753692210 753485560 753320992 753355861 753247142 753060162 753046632 752901435 752527177 752465129 752676368
1970.2G52676368j9670j11699O557j24574k52843q4877p4565l00229k85029j77324
$$ 752676368 752656698 752544999 752551556 752426982 752174139 752089262 752014697 751714468 751429439 751252115
1990.6G51252115j98305p5936O0975r9003k73883j58429r1076k82705k93493j08362
$$ 751252115 751053810 750977874 751038849 750939846 750665963 750507534 750416458 750133753 749840260 749731898
2011G49731898j87456l63767k34724j08003k49684k72930j58906k11537k53975j44005
$$ 749731898 749544442 749180675 748945951 748837948 748588264 748315334 748156428 747944891 747690916 747546911
2031.4G47546911j90794l57747k90513j76967k53617k49327j27673j85012k83063j89543
$$ 747546911 747356117 746998370 746707857 746530890 746277273 746027946 745900273 745715261 745432198 745242655
2051.8G45242655j30892k16186j97827j13488k19702l07680j35123n2691j83642j75476
$$ 745242655 745111763 744895577 744697750 744584262 744364560 744056880 743921757 743869066 743685424 743509948
2072.2G43509948j04010j88291k41458j49489j38521k17795j63913j32620k43724k55108
$$ 743509948 743405938 743217647 742976189 742826700 742688179 742470384 742306471 742173851 741930127 741675019
2092.6G41675019j54793j92642k78533j98185j46985k55466k73585j80960k33710l24606
$$ 741675019 741520226 741327584 741049051 740850866 740703881 740448415 740174830 739993870 739760160 739435554
2113G39435554k32876j55687k20299k01881j22607j72793k02537j30057j55926k40326
$$ 739435554 739202678 739046991 738826692 738624811 738502204 738329411 738126874 737996817 737840891 737600565
2133.4G37600565j81675j02520j35958j16885n1737j17302j78396q4341j6093p8142
$$ 737600565 737418890 737316370 737180412 737063527 737011790 736894488 736716092 736631751 736615658 736537516
2153.8G36537516j02043n0783p4923q9348J0252l337j48833j17362K206n1141q2672
$$ 736537516 736435473 736384690 736309767 736220419 736230671 736227334 736078501 735961139 735963345 735912204 735829532
2176.2G35829532K2113K9386l9936l457K027r4295p5578K7656j0729q2254l1650l5405
$$ 735829532 735851645 735881031 735841095 735837638 735839665 735745370 735669792 735697448 735686719 735604465 735572815 735537410
2200.7G35537410j17243n2452N0545m3690j28210o8068r4831j53303p6950m5478j18792
$$ 735537410 735420167 735367715 735418260 735374570 735246360 735178292 735083461 734930158 734853208 734807730 734688938
2223.1G34688938r8527l9995j27375k02715j08004p0095j34408p4089k1696j28031
$$ 734688938 734590411 734550416 734423041 734220326 734112322 734042227 733907819 733833730 733812034 733684003
2243.5G33684003j41203k4736o4552j67489r3281m2975j37806j24514j4782n9426j30474
$$ 733684003 733542800 733518064 733453512 733286023 733192742 733149767 733011961 732887447 732872665 732813239 732682765
2265.9G32682765n3823l9101j39594j39713r6679j31905j05262n0008j43290k45810
$$ 732682765 732628942 732589841 732450247 732310534 732213855 732081950 731976688 731926680 731783390 731537580
2286.3G31537580j84118j26064j91510j78993j03712j92701k93255k24173k26915l39210
$$ 731537580 731353462 731227398 731035888 730856895 730753183 730560482 730267227 730043054 729816139 729476929
2306.7G29476929k97010k05875k82526l77237l63052l63231l69787l06726k97546l60191
$$ 729476929 729179919 728974044 728691518 728314281 727951229 727587998 727218211 726911485 726613939 726253748
2327.1G26253748l30150k36511k70188l53396l21031k50041j82867N9902K82228J1325
$$ 726253748 725923598 725687087 725416899 725063503 724742472 724492431 724309564 724369466 724651694 724663019
2347.5G24663019l91722n52356o02603o46233n37098k96890j17183K2888J85966K10941
$$ 724663019 724271297 723718941 723116338 722470105 721933007 721636117 721518934 721541822 721727788 721938729
2367.9G21938729J84179K75969K88129J86920J46389J01924k4974r6381p9036j32918
$$ 721938729 722122908 722398877 722687006 722873926 723020315 723122239 723097265 723000884 722921848 722788930
2388.3G22788930k25544j99616j85072k69950k71141k18273k66969l22223k82168k65777
$$ 722788930 722563386 722363770 722178698 721908748 721637607 721419334 721152365 720830142 720547974 720282197
2408.7G20282197l23832l13520k57850k98917l51847l34143l44754l75568l26813k89201
$$ 720282197 719958365 719644845 719386995 719088078 718736231 718402088 718057334 717681766 717354953 717065752
2429.1G17065752l35753l36588l14057l92735m46915l75867l59118m07756l73184l62695
$$ 717065752 716729999 716393411 716079354 715686619 715239704 714863837 714504719 714096963 713723779 713361084
2449.5G13361084m55796m78447l87251l76225m28736m20272m57466n57899n55694m99309
$$ 713361084 712905288 712426841 712039590 711663365 711234629 710814357 710356891 709798992 709243298 708743989
2469.9G08743989n65528o27458n72980n91397p03097p05838o43790o87360p23780o77466
$$ 708743989 708178461 707551003 706978023 706386626 705683529 704977691 704333901 703646541 702922761 702245295
2490.3G02245295p01547p43329o66022o15299o67095o56844o09576o74665p24137o34909
$$ 702245295 701543748 700800419 700134397 699519098 698852003 698195159 697585583 696910918 696186781 695551872
2510.7F95551872n80966o22094o03139n38886n40793n39422m58419l91960l81053l41713
$$ 695551872 694970906 694348812 693745673 693206787 692665994 692126572 691668153 691276193 690895140 690553427
2531.1F90553427l01242l33011l36767k60770k52426l31938l39925k92718l21627l24428
$$ 690553427 690252185 689919174 689582407 689321637 689069211 688737273 688397348 688104630 687783003 687458575
2551.5F87458575k49982k76089l55422l52562l76344m52578m27663l35932l37481l93570
$$ 687458575 687208593 686932504 686577082 686224520 685848176 685395598 684967935 684632003 684294522 683900952
2571.9F83900952m01079m24445n06759n04434m19855m22895m79579m98056n17905n23567
$$ 683900952 683499873 683075428 682568669 682064235 681644380 681221485 680741906 680243850 679725945 679202378
2592.3F79202378m68016m57346n27203n30541m92096n31435n61297n08011m86374n23448
$$ 679202378 678734362 678277016 677749813 677219272 676727176 676195741 675634444 675126433 674640059 674116611
2612.7F74116611m97341m54724n18202n73635n26190m83334m93169n04732n16057n46634
$$ 674116611 673619270 673164546 672646344 672072709 671546519 671063185 670570016 670065284 669549227 669002593
2633.1F69002593n50926n12004n04911n50330n92053o24358o47545o01649n51701n77867
$$ 669002593 668451667 667939663 667434752 666884422 666292369 665668011 665020466 664418817 663867116 663289249
2653.5F63289249o04272o11901o31631o18577n62608n49436o20603o62804o28233o19590
$$ 663289249 662684977 662073076 661441445 660822868 660260260 659710824 659090221 658427417 657799184 657179594
2673.9F57179594o28769n97954n89729o29007o46174o52492o90580o68347n82873n73934
$$ 657179594 656550825 655952871 655363142 654734135 654087961 653435469 652744889 652076542 651493669 650919735
2694.3F50919735o06179n80907n93006o65844o38664n41985n56826o29366o07013n52059
$$ 650919735 650313556 649732649 649139643 648473799 647835135 647293150 646736324 646106958 645499945 644947886
2714.6F44947886n64157n71192n35309n08309m93168n03064n39779n37217m90248m58002
$$ 644947886 644383729 643812537 643277228 642768919 642275751 641772687 641232908 640695691 640205443 639747441
2735F39747441m58539m38213l77357l64363l89338l90827m18067m35889m13239m35949
$$ 639747441 639288902 638850689 638473332 638108969 637719631 637328804 636910737 636474848 636061609 635625660
2755.4F35625660n06639n47528n30839m95732m66585m74572n47171n87702n50866n57900
$$ 635625660 635119021 634571493 634040654 633544922 633078337 632603765 632056594 631468892 630918026 630360126
2775.8F30360126o17206o34312o40154o65903o43254n84602o36577p63238p74443p42793
$$ 630360126 629742920 629108608 628468454 627802551 627159297 626574695 625938118 625174880 624400437 623657644
2796.2F23657644q16226q90076q69573q50796q52227q28803q61287r74178j048983
$$ 623657644 622841418 621951342 621081769 620230973 619378746 618549943 617688656 616714478 615665495
2814.6F15665495j035869j005947j012504j062453j155853j247645j292884j363576
$$ 615665495 614629626 613623679 612611175 611548722 610392869 609145224 607852340 606488764
2830.9F06488764j491308j624107j796961k081037k467930k842188l143489l250838
$$ 606488764 604997456 603373349 601576388 599495351 597027421 594185233 591041744 587790906
2847.2E87790906k882242k045929j125634m32610m6730R179j64330l85225o29306q68440
$$ 587790906 584908664 582862735 581737101 581304491 581257761 581266940 581102610 580717385 580088079 579219639
2867.6E79219639r38296q11040o94037o65605o35147o69003p92503q95381j015782
$$ 579219639 578281343 577470303 576776266 576110661 575475514 574806511 574014008 573118627 572102845
2886E72102845j197934j317263j290858j243889j227200j152337j104653j133740j166939
$$ 572102845 570904911 569587648 568296790 567052901 565825701 564673364 563568711 562434971 561268032
2904.3E61268032j269937j506925j781344k000809k141356k101302j824856j416266
$$ 561268032 559998095 558491170 556709826 554709017 552567661 550466359 548641503 547225237
2920.6E47225237r40502m01318R8169M04119N44549P00116Q36908Q49188Q63552R01103
$$ 547225237 546284735 545883417 545981586 546385705 546930254 547630370 548467278 549316466 550180018 551081121
2941E51081121Q17060O30260M01735J08481j67013l22341l84272l38733j37985J03951
$$ 551081121 551898181 552528441 552930176 553038657 552871644 552549303 552165031 551826298 551688313 551792264
2961.4E51792264K08437K38717L71277N01454N26905N74649O28709O07133O04928N97060
$$ 551792264 552000701 552239418 552610695 553112149 553639054 554213703 554842412 555449545 556054473 556651533
2981.8E56651533M73737L51549L29315L03745J46151o1095j70767l08692n00143n47886
$$ 556651533 557125270 557476819 557806134 558109879 558256030 558194935 558024168 557715476 557215333 556667447
3002.2E56667447n39899o32763o60717n51105n23150o05106o30140o52373p61867q23080
$$ 556667447 556127548 555494785 554834068 554282963 553759813 553154707 552524567 551872194 551110327 550287247
3022.6E50287247q02338q41380q70049p84158p74026r08256r56118q78274q59499r00865
$$ 550287247 549484909 548643529 547773480 546989322 546215296 545307040 544350922 543472648 542613149 541712284
3043E41712284r60767j088262j125812r99749r40800r77516r62436r36568r67741r61602
$$ 541712284 540751517 539663255 538537443 537537694 536596894 535619378 534656942 533720374 532752633 531791031
3063.4E31791031q58426q39948r58383r61066q62777q30710p93457p84039q94130r90927
$$ 531791031 530932605 530092657 529134274 528173208 527310431 526479721 525686264 524902225 524008095 523017168
3083.8E23017168r68933r15587r39250j010120j024604r70781q81433q30889r17673
$$ 523017168 522048235 521132648 520193398 519183278 518158674 517187893 516306460 515475571 514557898
3102.2E14557898j002669r11713q50201r88364j034379q71777q28147r74834j132131
$$ 514557898 513555229 512643516 511793315 510804951 509770572 508898795 508070648 507095814 505963683
3120.5E05963683j240432j232863j103341j024127j112819j201540j119673j005650
$$ 505963683 504723251 503490388 502387047 501362920 500250101 499048561 497928888 496923238
3136.8D96923238j024067j130641j217157j258015j207292j069516j049012j198709
$$ 496923238 495899171 494768530 493551373 492293358 491086066 490016550 488967538 487768829
3153.2D87768829j311988j317292j287163j228243j222312j311392j333177j265228
$$ 487768829 486456841 485139549 483852386 482624143 481401831 480090439 478757262 477492034
3169.5D77492034j260131j348108j394034j353114j304538j270324j284241j340062
$$ 477492034 476231903 474883795 473489761 472136647 470832109 469561785 468277544 466937482
3185.8D66937482j331120j273245j308411j409501j418829j344890j284450j255423
$$ 466937482 465606362 464333117 463024706 461615205 460196376 458851486 457567036 456311613
3202.1D56311613j279533j358330j390606j337409j299620j320898j323492j290857
$$ 456311613 455032080 453673750 452283144 450945735 449646115 448325217 447001725 445710868
3218.4D45710868j292736j309305j287431j264959j257390j193464j124441j211584
$$ 445710868 444418132 443108827 441821396 440556437 439299047 438105583 436981142 435769558
3234.7D35769558j305819j223892j161813j148820j047135j029491j142591j154721
$$ 435769558 434463739 433239847 432078034 430929214 429882079 428852588 427709997 426555276
3251.1D26555276j059115j040459j109928j106590j049459j050740j027316r32187
$$ 426555276 425496161 424455702 423345774 422239184 421189725 420138985 419111669 418179482
3267.4D18179482q86559r79573j082748j064301j010000r93669j018286j042336j010746
$$ 418179482 417292923 416313350 415230602 414166301 413156301 412162632 411144346 410102010 409091264
3285.7D09091264r71764r35018r23723j008690j112997j183242j166642j028388r46343
$$ 409091264 408119500 407184482 406260759 405252069 404139072 402955830 401789188 400760800 399814457
3304.1C99814457j019717j172989j343936j458764j428664j327485j323878j382858
$$ 399814457 398794740 397621751 396277815 394819051 393390387 392062902 390739024 389356166
3320.4C89356166j369566j379311j545965j693666j679302j621782j548976j465410
$$ 389356166 387986600 386607289 385061324 383367658 381688356 380066574 378517598 377052188
3336.7C77052188j527488j673222j718432j703381j602173j410872j403779j605093
$$ 377052188 375524700 373851478 372133046 370429665 368827492 367416620 366012841 364407748
3353C64407748j681060j541435j391679j369954j371592j262098j193792j337588j571864
$$ 364407748 362726688 361185253 359793574 358423620 357052028 355789930 354596138 353258550 351686686
3371.4C51686686j602381j379132j196743j233190j353413j312315j121283r60916
$$ 351686686 350084305 348705173 347508430 346275240 344921827 343609512 342488229 341527313
3387.7C41527313q55714q95828j111984j153380q59946o90162r82255j271337j103282
$$ 341527313 340671599 339775771 338663787 337510407 336650461 335960299 334978044 333706707 332603425
3406.1C32603425q05915p03334p31796q12859q40187p15494n80072n72861n23626l42131
$$ 332603425 331797510 331094176 330362380 329549521 328709334 327993840 327413768 326840907 326317281 325975150
3426.5C25975150k09928k28136k03252j06395k44557n00441m74453k71112o1959J07616
$$ 325975150 325765222 325537086 325333834 325227439 324982882 324482441 324007988 323736876 323674917 323782533
3446.8C23782533P9126J7076J13517K39551L04163L48776L36886L52740N87642P92087
$$ 323782533 323861659 323878735 323992252 324231803 324535966 324884742 325221628 325574368 326162010 326954097
3467.2C26954097N70416J93208K23935N23776P02262O88642N50687N44936P47502Q37028
$$ 326954097 327524513 327717721 327941656 328465432 329167694 329856336 330407023 330951959 331699461 332536489
3487.6C32536489P63505P80344R00746R90450R10908Q34853R65088R44197P52181Q30829
$$ 332536489 333299994 334080338 334981084 335971534 336882442 337717295 338682383 339626580 340378761 341209590
3508C41209590J098425J256376J151830R59218R54985J109302J320690J290530J061201
$$ 341209590 342308015 343564391 344716221 345675439 346630424 347739726 349060416 350350946 351412147
3526.4C51412147J095563J319349J453251J551956J543492J345873J280159J439780
$$ 351412147 352507710 353827059 355280310 356832266 358375758 359721631 361001790 362441570
3542.7C62441570J614511J537710J338571J475871J708597J654506J579225J650720
$$ 362441570 364056081 365593791 366932362 368408233 370116830 371771336 373350561 375001281
3559C75001281J512617J109004J342446K403796K644598K009511J807600J955063K026081
$$ 375001281 376513898 377622902 378965348 381369144 384013742 386023253 387830853 389785916 391811997
3577.4C91811997K086162J991809J662731J817971K445042K372474J998335K174079
$$ 391811997 393898159 395889968 397552699 399370670 401815712 404188186 406186521 408360600
3593.7D08360600K408088K445519K558797K474666J970410J799137K276867K433062
$$ 408360600 410768688 413214207 415773004 418247670 420218080 422017217 424294084 426727146
3610D26727146K214223J890630J476138K064497L056228K776950J877249K067864M238695
$$ 426727146 428941369 430831999 432308137 434372634 437428862 440205812 442083061 444150925 448389620
3628.4D48389620M986912L491491L152698L108114K824038K600789J991481J182049
$$ 448389620 453376532 456868023 460020721 463128835 465952873 468553662 470545143 471727192
3644.7D71727192J623899M078567M818648K707631K574384L752231L332168K549470
$$ 471727192 473351091 477429658 482248306 484955937 487530321 491282552 494614720 497164190
3661D97164190K089649J235158R69350K208590K332628J571894L229618L716111K109289
$$ 497164190 499253839 500488997 501458347 503666937 505999565 507571459 510801077 514517188 516626477
3679.4E16626477J264870L39091l99709J61410R50813K61247m54783l62694L9756J047909
$$ 516626477 517891347 518230438 517830729 517992139 518942952 519204199 518749416 518386722 518426478 519474387
3699.8E19474387K554596K614498J435220J052678K214312L634572K620995R74298
$$ 519474387 522028983 524643481 526078701 527131379 529345691 532980263 535601258 536575556
3716.1E36575556N16474O21736P71642R91702R89020J04129o86526k96295J141191
$$ 536575556 537092030 537713766 538485408 539477110 540466130 540570259 539883733 539587438 540728629
3734.4E40728629K038061M30465j655936j068592R49204N0068n95689J407087J752317
$$ 540728629 542766690 543197155 541541219 540472627 541421831 541471899 540876210 542283297 544035614
3752.8E44035614Q5830l23951M41968M56393k49684l44216l7790O06895Q08417L7134
$$ 544035614 544121444 543797493 544239461 544695854 544446170 544101954 544064164 544671059 545479476 545516610
3773.2E45516610n48661k94149L52443K16841r1075J34348J45793p7426m54903p83741
$$ 545516610 544967949 544673800 545026243 545243084 545152009 545286357 545432150 545354724 544899821 544116080
3793.6E44116080o86526q40366m00603P33256K13683K08437R46582o5923j282811j019121
$$ 544116080 543429554 542589188 542188585 542921841 543135524 543343961 544290543 544224620 542941809 541922688
3814E41922688j56402m72725J65880J180053J37448m28259m79221o12081o35027p67827
$$ 541922688 541766286 541293561 541459441 542639494 542776942 542348683 541869462 541257381 540622354 539854527
3834.4E39854527j72139O86407M91441L25560K45214p75576k214849k202451J083672
$$ 539854527 539682388 540368795 540860236 541185796 541431010 540655434 538440585 536238134 537321806
3852.7E37321806L077745K02656j313865j101255l04819p4088o76453j17839O05584
$$ 537321806 540399551 540602207 539288342 538187087 537882268 537808180 537131727 537013888 537619472
3871.1E37619472K85267j92344q47459n28037q6129j78397M25458o5684o79076J90020
$$ 537619472 537904739 537712395 536864936 536336899 536250770 536072373 536497831 536432147 535753071 535943091
3891.5E35943091L3915j160860j306117o18934K01106R77337Q38935j3232m22060o13451
$$ 535943091 535977006 534816146 533510029 532891095 533092201 534069538 534908473 534895241 534473181 533859730
3911.9E33859730p80523m49181J8001j27256l79264j50442j76251o05762l89398K33412
$$ 533859730 533079207 532630026 532648027 532520771 532141507 531991065 531814814 531209052 530819654 531053066
3932.3E31053066J62065l16620o07729n50389j85251j52826k94149j01984l7134k15292
$$ 531053066 531215131 530898511 530290782 529740393 529555142 529402316 529108167 529006183 528969049 528753757
3952.7E28753757k89320l12448l67582k85327j45078j77920k58565k75433l37899l36647
$$ 528753757 528464437 528151989 527784407 527499080 527354002 527176082 526917517 526642084 526304185 525967538
3973.1E25967538j80423j37150k07365j65224j34229k66314l92735l53098k48492j82390
$$ 525967538 525787115 525649965 525442600 525277376 525143147 524876833 524484098 524131000 523882508 523700118
3993.4E23700118j49786j96934
$$ 523700118 523550332 523353398
3997.5E23353398
$$ 523353398
##END=$$ End of the data block
