##TITLE=Revestimento acustico de piso lamindado $$ Begin of the data block
##JCAMP-DX=5.00 $$ ACD/SpecManager v 10.08
##SPECTROMETER/DATA SYSTEM=Alpha
##DATE=03 Mar 2015 09:20:24
##DATA TYPE=INFRARED SPECTRUM
##DATA CLASS=XYDATA
##ORIGIN=
##OWNER=
##NPOINTS=1667
##FIRSTX=599.57470703
##LASTX=3997.16503906
##MAXX=3997.16503906
##MINX=599.57470703
##MAXY=0.93505061
##MINY=0.68695617
##XFACTOR=1.0000000000
##YFACTOR=1.000000000000000e-9
##FIRSTY=0.81099135
##DELTAX=2.03937006
##XUNITS=1/CM
##YUNITS=ARBITRARY UNITS
##XYDATA=(X++(Y..Y))
599.6H10991347P82907J171946R52781K51114o99461q46922K00093P25329O43134J335561
620H15507829J727343J431703J277030P50899P8798J58190M57645J57416j75655j75000
640.4H21196198l87251o08206o11782p80701j023472j023054r13381p79510n01454
658.7H14567387k75016k59220j83523L5167J45197j8120L3676N0307l22700m68731
679.1H13304424l40402p86364j820266k869666m353523p492006j1381209j1708379
695.4G72552609n044341M882515J0940850J0828018O229818j174331q206666p913231
711.7G83095241j211584r9301k416492N252302J4996886J2304664K752602l497660
728.1H11176658J02460R583473J0959804M379690l41296j711428j714468r50635L29733
$$ y = [810991347, 811774254, 812946200, 813898981, 814150095, 813450634, 812603712, 812803805, 813529134, 814172268, 815507829, 817235172, 818666875, 819943905, 820694804, 820773602, 820931792, 821389437, 821546853, 821371198, 821196198, 820808947, 820200741, 819588959, 818808258, 817784786, 816761732, 815848351, 815068841, 814567387, 814292371, 814033151, 813849628, 813884795, 814029992, 814011872, 814045548, 814095855, 813773155, 813304424, 812964022, 812177658, 810357392, 807487726, 803134203, 795642197, 784260988, 772552609, 767508268, 772390783, 783331633, 794159651, 800389469, 799215138, 791008472, 783095241, 781883657, 781784356, 779367864, 784620166, 799617052, 811921716, 814674318, 811176658, 811279118, 820862591, 831822395, 836202085, 835860789, 834149361, 832434893, 831484258, 831813991]
746.4H31813991J610875K196670K099156J598716J191497J205385J319110J471758
762.7H44507158J588225J452208J224756J041949P21574J38938l81827k96533L21924
781.1H50318372Q44777J179814J434028J493216J373589J113653O76215M27365O00040
799.4H59461069N34773J46747J02400L00527J66833j16050j57475j55628j57416J26541
819.8H60252321M89056M96805K26199j38700j86503J92046L23415q6903o61016q33571
840.2H60073149p38263j131236j465261p23422k00808r68337j788795k216339k669215
858.6H48171473l227652m137456n676150q650840j3347447j6837120j4066219l057122
874.9G79171467J1233985J9631028J8515051J3899028J0866225P553100L129483J07705
$$ y = [831813991, 833424866, 835621536, 837720692, 839319408, 840510905, 841716290, 843035400, 844507158, 846095383, 847547591, 848772347, 849814296, 850535870, 850674808, 850292981, 849996448, 850318372, 851163149, 852342963, 853776991, 855270207, 856643796, 857757449, 858433664, 858861029, 859461069, 859995842, 860142589, 860244989, 860545516, 860712349, 860596299, 860438824, 860283196, 860125780, 860252321, 860741377, 861238182, 861464381, 861325681, 861139178, 861331224, 861654639, 861567736, 860906720, 860073149, 859334886, 858203650, 856738389, 856014967, 855814159, 854845822, 853057027, 850840688, 848171473, 844943821, 840806365, 835130215, 826479375, 813131928, 796294808, 782228589, 779171467, 790405452, 810036480, 828551531, 842450559, 853316784, 860869884, 863999367, 864107072]
891.2H64107072q53121q89718p49052p35998j061857j667619j868963j228392j48416
909.6H54903936R39429J671255J731396J381039J049876O30379J84238J22011k563
927.9H62610996n34594r07421r24647q45552p71224p48217q93474j056731j042485
946.3H54886651j009583j176894j683235k466083l263116l945172m255235l530323
962.6H33557010j567781R08792L037750M191161M078746L188788K315343J687705J134992
980.9H52532506N36323j11819p51734j304745j592398j470864j146376q46267n61535
999.3H45283091l10779k06291l18110n59092q12113r87947j023829j004875r59277
1017.6H39100778p76589o28292p01070q04782o76334j61588N08606R22203J069427
$$ y = [864107072, 863253951, 862364233, 861615181, 860879183, 859817326, 858149707, 856280744, 855052352, 854903936, 855843365, 857514620, 859246016, 860627055, 861676931, 862307310, 862491548, 862613559, 862610996, 862076402, 861168981, 860244334, 859398782, 858627558, 857879341, 856985867, 855929136, 854886651, 853877068, 852700174, 851016939, 848550856, 845287740, 841342568, 837087333, 833557010, 831989229, 832898021, 835935771, 840126932, 844205678, 847394466, 849709809, 851397514, 852532506, 853068829, 852957010, 852205276, 850900531, 849308133, 847837269, 846690893, 845844626, 845283091, 844972312, 844766021, 844447911, 843888819, 843076706, 842088759, 841064930, 840060055, 839100778, 838324189, 837695897, 836994827, 836190045, 835513711, 835352123, 835860729, 836782932, 837852359]
1036H37852359J086294R64880P94173P09712O30975M64380K74479J57714J28746O6579
1056.4H43130291m6790l58K38598L44395J33336o6757q3864j63317k56955k04146o2824
1078.8H42961609R1911J25944k7299k47120l95596m24624m39048m53889l90649l83258
1099.2H40417981m82738m88520l24726j49786l7849L0518J70707N78642R49204Q75771
1119.6H41539204O14882M98771N51462P33436Q40723Q10087P43687N69522L00408Q344
1140H47210526k70128m93109o39081o64711n00083q2612M76897Q68916Q89361O88613
1160.4H47484589N03659L86238M04716O27100Q30650Q02815O15835M22240L95834N46932
1180.8H53020608P42853Q04663O51181N14030N68986O91652O70314M76480K30729O0737
$$ y = [837852359, 838938653, 839903533, 840697706, 841407418, 842038393, 842502773, 842777252, 842934966, 843063712, 843130291, 843083501, 843083143, 843321741, 843666136, 843799472, 843732715, 843648851, 843485534, 843228579, 843024433, 842961609, 843053520, 843179464, 843152165, 842905045, 842509449, 842084825, 841645777, 841191888, 840801239, 840417981, 839935243, 839446723, 839121997, 838972211, 838934362, 838964880, 839135587, 839714229, 840663433, 841539204, 842154086, 842652857, 843204319, 843937755, 844778478, 845588565, 846332252, 846901774, 847202182, 847210526, 846940398, 846447289, 845808208, 845143497, 844643414, 844560802, 845037699, 845906615, 846795976, 847484589, 847988248, 848374486, 848779202, 849406302, 850236952, 851039767, 851655602, 852077842, 852473676, 853020608, 853763461, 854568124, 855219305, 855733335, 856302321, 856993973, 857664287, 858140767, 858371496, 858432233]
1201.2H58432233P2658J35899K2888j96338l49342m80652o46532p52866q45015r54092
1221.6H54438841r44376r80198j160145j182377r65953p54893p45714p85589o37948
1239.9H46281648m20571l14593l04282l30031l33011l46243m42922n59926o24776n82397
1260.3H42022896m27425k44200j04368r7871j64747n2393K40207M92871O31809P38561
1280.7H43035340Q19087P18654N76078O30141O53028M38929K03609N2154j54197l66688
1301.1H46606135m63843n08070n53310n07295m34816m62413m36544k00927K7537j7524
1321.5H43048930k52545n65827q52942r12786q27670r23395j189828j425564j456261
1339.9H34642112j328408j347960j434445j495957j613558j762271j939952k070963
$$ y = [858432233, 858504891, 858640790, 858663678, 858467340, 858117998, 857637346, 856990814, 856237948, 855392933, 854438841, 853494465, 852514267, 851354122, 850171745, 849205792, 848450899, 847705185, 846919596, 846281648, 845861077, 845546484, 845242202, 844912171, 844579160, 844232917, 843789995, 843230069, 842605293, 842022896, 841595471, 841351271, 841246903, 841149032, 840984285, 840931892, 841172099, 841664970, 842296779, 843035340, 843854427, 844573081, 845149159, 845779300, 846432328, 846871257, 847074866, 847127020, 846972823, 846606135, 846142292, 845634222, 845080912, 844573617, 844138801, 843676388, 843239844, 843038917, 843066454, 843048930, 842796385, 842230558, 841377616, 840464830, 839637160, 838713765, 837523937, 836098373, 834642112, 833313704, 831965744, 830531299, 829035342, 827421784, 825659513, 823719561, 821648598]
1356.2H21648598k047122j961469j831174j545370j387060j590192k033532k651631
1372.5H06601048l015757k244771j020193p16686j293778j640976j374125j118660
1388.8G94176102j400054k188325k937257k802432k295434k185345k724588l687560
1405.1G73955107m220724m366696m293502l670990k812982j973033r44376j66893L4869
1423.5G51540780K3425J2695L44337R27805J323224J934886K548038K034069J488924
1441.8G62178183J260995J172007J211226J175344J251995J624465K082765M75109
1458.2G72432089k102792L457N811929Q323670N157590L507793R569049J8848300J6390204
1476.5H37941289Q355200L784120K673984K213538J627385J310110J508713K008200
$$ y = [821648598, 819601476, 817640007, 815808833, 814263463, 812876403, 811286211, 809252679, 806601048, 803585291, 801340520, 800320327, 799603641, 798309863, 796668887, 795294762, 794176102, 792776048, 790587723, 787650466, 784848034, 782552600, 780367255, 777642667, 773955107, 769734383, 765367687, 761074185, 757403195, 754590213, 752617180, 751672804, 751505911, 751540780, 751564205, 751576900, 751921237, 752849042, 754172266, 756107152, 758655190, 760689259, 762178183, 763439178, 764611185, 765822411, 766997755, 768249750, 769874215, 771956980, 772432089, 770329297, 770332754, 776144683, 784468353, 789625943, 793133736, 802702785, 821551085, 837941289, 846296489, 850080609, 852754593, 854968131, 856595516, 857905626, 859414339, 861422539]
1492.8H61422539K822757L718256L267050K049685J194000O68645M68850O13689N98968
1511.2H76824439N86211Q80540J295149J245320Q96394N83768K95460J68085O9321
1529.5H82844687j30415m20094m91917m75168n54979j29760M59254O83129N92768N28753
1549.9H82906258N63085M65334K19166J8299K56419L08275k4140k49088l99291n92053
1570.3H83472264n07117n54084r41217p91550m11153l14593k22743k20418m04238o16908
1590.7H78488243q30651j116335j356959j246453o14345L31521J148224J592338J573563
1609.1H77969146J138150N40138R715l77834m91678m33266k28882J06036J75775m2916
1629.5H78364384k56002n27739r75073p33375j90854r8646k45035n17726n10513k46585
$$ y = [861422539, 864245296, 867963552, 871230602, 873280287, 874474287, 875142932, 875611782, 876225471, 876824439, 877410650, 878291190, 879586339, 880831659, 881728053, 882311821, 882607281, 882775366, 882844687, 882714272, 882294178, 881802261, 881327093, 880772114, 880642354, 881101608, 881784737, 882377505, 882906258, 883469343, 883934677, 884153843, 884172142, 884428561, 884736836, 884712696, 884463608, 884064317, 883472264, 882965147, 882411063, 881469846, 880678296, 880267143, 879952550, 879729807, 879509389, 879105151, 878488243, 877657592, 876541257, 875184298, 873937845, 873323500, 873655021, 874803245, 876395583, 877969146, 879107296, 879647434, 879657149, 879279315, 878787637, 878354371, 878125489, 878231525, 878407300, 878364384, 878108382, 877580643, 876605570, 875872195, 875681341, 875582695, 875337660, 874819934, 874309421, 874062836]
1649.9H74062836l98397n67556m0292J03235M6611K72631P37965R83775J035810R61422
1670.3H77198040N70715O139n38170r48012j342177j918972k831459k361953j251936
1688.6H66582215k59698R97425K680122M333198M693032N177736L920913K776980K768457
1707H93670380K310693J690090J181483Q59738R66727J178504R54806P30932O24001
1725.3I04167354L93450J50085Q0109K30729M39346N35786R36031J501143J796365
1743.7I10230398J825094J571417J407981J423359J095295O63698N43773M97818L64780
1762I19623613K34366O3121m7743l2127m3392n5015J4364K3902n4658j61886k96950
1784.5I19267595l73483m98116p10785n83351j17242J58429L21925N82099P37667M99188
$$ y = [874062836, 873664439, 873096883, 873056591, 873159826, 873206437, 873479068, 874217033, 875200808, 876236618, 877198040, 877768755, 877774894, 877236724, 876288712, 874946535, 873027563, 870196104, 867834151, 866582215, 866322517, 867319942, 870000064, 874333262, 879026294, 884204030, 888124943, 890901923, 893670380, 895981073, 897671163, 898852646, 899712384, 900679111, 901857615, 902812421, 903543353, 904167354, 904560804, 904710889, 904790998, 905021727, 905461073, 905996859, 906932890, 908434033, 910230398, 912055492, 913626909, 915034890, 916458249, 917553544, 918217242, 918761015, 919258833, 919623613, 919857979, 919921100, 919873357, 919841230, 919797838, 919742823, 919757187, 919781089, 919726431, 919564545, 919267595, 918894112, 918395996, 917685211, 917101860, 916984618, 917143047, 917464972, 918047071, 918784738, 919283926]
1804.9I19283926K04266J47640J29640O9619N304o8187n4658j3292o0975j33157j10805
1827.3I19399321k0444J01387Q6427l6061Q35M5478q2851j51932m1723K2709j0430
1849.7I19312716k8611p2002j20878o9976j8478n4896j06394j95920k38121k5928J54793
1872.2I18536305R1136J4126J4723J1444n6029j18494r8586r2447p1585j4066k5690
1894.6I18190837n5194l9577j6749j7524R477M0531M0472O4909N0545l2604p3135m3034
1919.1I18118954m7088o7770l6777J312L6061M5061k8730j36554j27614m5239m4823
1941.5I17666793k8432M0472Q4877J18136O8367J79m053l5406l3319K8074J7524l8445
1966I17884767k5511K5034K6465J967k0147k086M3690P451o0797o6161o9261j06513
$$ y = [919283926, 919488192, 919635832, 919765472, 919835091, 919840395, 919772208, 919717550, 919704258, 919643283, 919510126, 919399321, 919378877, 919480264, 919566691, 919530630, 919531465, 919576943, 919494092, 919342160, 919300437, 919323146, 919312716, 919284105, 919212103, 919091225, 919021249, 919002771, 918947875, 918841481, 918645561, 918407440, 918381512, 918536305, 918627441, 918641567, 918656290, 918667734, 918611705, 918493211, 918394625, 918302178, 918230593, 918216527, 918190837, 918135643, 918096066, 918079317, 918061793, 918071270, 918111801, 918152273, 918217182, 918267727, 918235123, 918161988, 918118954, 918071866, 918004096, 917967319, 917968631, 918004692, 918049753, 918021023, 917884469, 917756855, 917711616, 917666793, 917638361, 917678833, 917763710, 917881846, 917950213, 917950392, 917946339, 917910933, 917877614, 917905688, 917923212, 917884767, 917859256, 917884290, 917910755, 917912722, 917892575, 917890489, 917934179, 917941630, 917880833, 917814672, 917745411, 917638898]
1990.5I17638898p0214M5418P9573K7537j192P033n6326j54913j11162k1339m5180
2012.9I17338133q5712k6345P1585R0301L1948j1742J4782M3810o557o1631m4882P152
2037.4I17360842N6565O6519J8537m2319m2499q94j3589o2824n7101K1756O9797j252
2061.8I17373538j11818q2910O1452R8407L3975k9504r1136o6280K1338J6928l517
2084.3I17220473O0261Q0347l577r0837p8023l6060o6698j6034P7248J7643r1136r9182
2108.7I16974425M18M1782l4511l1352P2956Q7679n3942j56880n5969Q5235N5969o5685
2133.2I16920125n9843J252n2512m9710O4731O6817n6863q0168N0544Q6725l4332p3791
2157.7I16782975K8074O5446L517r537J8060N722j0729K9147J5616n8055o1690k8372
$$ y = [917638898, 917568684, 917614102, 917693675, 917721212, 917720020, 917727053, 917670727, 917515814, 917404652, 917383313, 917338133, 917252421, 917226076, 917297661, 917387962, 917419910, 917408168, 917422950, 917466760, 917460203, 917398572, 917353690, 917360842, 917417407, 917483926, 917502463, 917460144, 917417645, 917416751, 917403162, 917340338, 917283237, 917304993, 917374790, 917373538, 917261720, 917178810, 917240262, 917338669, 917372644, 917343140, 917252004, 917185724, 917207062, 917223990, 917220473, 917280734, 917361081, 917357504, 917266667, 917188644, 917152584, 917085886, 917069852, 917147100, 917164743, 917073607, 916974425, 916974843, 917016625, 916982114, 916950762, 917023718, 917111397, 917057455, 916900575, 916844606, 916929841, 916985810, 916920125, 916860282, 916861534, 916809022, 916759312, 916824043, 916890860, 916833997, 916753829, 916804373, 916891098, 916856766, 916782975, 916811049, 916876495, 916880012, 916870475, 916888535, 916894257, 916883528, 916912675, 916928291, 916870236, 916808546, 916780174]
2182.2I16780174k6286r1791j32859l2067Q0168N5015j4543r358M3750R1374P6532
2204.6I16820109Q523j6927j5915k5272o378r417l3081j5020R179P987k4259n6923
2229.1I16642606n8472m9353l7670k0444m77L0816J1384l3676j2041k0206m7028L934
2253.5I16409373K0564l2127l3677j013r000l9757o7412n3764q523O735k7060j9908
2278I16144431N0425K1637l7313k7954o5864q7201k0743P272l0458l1709k1220n5968
2302.5I15845335n6565m351J5616j5199m9055j08838j51217m3392J36137K05517J02937
2324.9I15876925m5478K0086K10762J66595k1636j66118j71125J07705K41757o2406
2345.3I16157067k35796r2745R8765K25067J65761O2167J37747J08599r3758k25305
$$ y = [916780174, 916753888, 916662097, 916529238, 916497171, 916577339, 916632354, 916617811, 916608453, 916652203, 916743577, 916820109, 916828632, 916811705, 916795790, 916770518, 916764140, 916754723, 916721642, 916706622, 916715801, 916723788, 916699529, 916642606, 916584134, 916534781, 916497111, 916476667, 916476190, 916507006, 916518390, 916484714, 916472673, 916452467, 916405439, 916409373, 916429937, 916397810, 916364133, 916363120, 916354120, 916314363, 916246951, 916193187, 916184664, 916191399, 916164339, 916144431, 916194856, 916216493, 916179180, 916151226, 916085362, 915998161, 915977418, 915984690, 915954232, 915922523, 915901303, 915845335, 915788770, 915784419, 915800035, 915784836, 915735781, 915626943, 915475726, 915432334, 915568471, 915773988, 915876925, 915831447, 915851533, 916062295, 916228890, 916207254, 916041136, 915870011, 915977716, 916219473, 916157067, 915921271, 915828526, 915927291, 916152358, 916318119, 916380286, 916518033, 916626632, 916532874, 916307569]
2365.7I16307569k75493k13385r1612j66953k72631r3758P0571l8743j05738J6212
2386.1I15136039O0618j3947n4419q2434p5340O437J7107l6299l8326n2273r1017j24633
2410.6I14651513j11401r775P8857P4327N543m3392k3067j7107m2855j8597J430p867
2435I14537609j8537m9115m1067j9789n8353j12712r7931j2994K5571j2040o0022o7413
2459.5I14013207k0623J0967n305p7903j72258j98423j75834j38283j01864o5804k4616
2481.9I13043261j0968m1902j21832j80959j57893j16468r8466r1017j17719j96099
2502.3I11909938k54393j61469k5630k3782j1861K2471n4002j05858n5075L0875J24991
2524.8I11396205R0778r656M1664Q6069N5790O8188N603j22190j16765j4365N4061
$$ y = [916307569, 916032076, 915818691, 915727079, 915560126, 915287495, 915193737, 915264308, 915225565, 915119827, 915136039, 915196657, 915182710, 915128291, 915045857, 914970517, 914976954, 914994061, 914957762, 914919436, 914867163, 914776146, 914651513, 914540112, 914530337, 914609194, 914683521, 914689064, 914645672, 914622605, 914605498, 914562643, 914544046, 914545476, 914537609, 914519072, 914469957, 914428890, 914409101, 914350748, 914238036, 914140105, 914127111, 914152682, 914140642, 914080620, 914013207, 913992584, 914003551, 913998246, 913920343, 913748085, 913549662, 913373828, 913235545, 913133681, 913067877, 913043261, 913032293, 912990391, 912868559, 912687600, 912529707, 912413239, 912314773, 912223756, 912106037, 911909938, 911655545, 911494076, 911468446, 911444664, 911432803, 911455274, 911401272, 911295414, 911240339, 911271214, 911396205, 911486983, 911477327, 911518991, 911605060, 911660850, 911729038, 911734641, 911612451, 911495686, 911481321, 911535382]
2547.2I11535382N0664l1173j04189p1168j252k2113r9838j51813j12295o56J1087
2569.6I11002636q3864j24275p2420l8564n4121l7670m9413j25348j27316q4698j10149
2592.1I10094798j70052j30952J490J014r7096q7083q9764j58132q7440q702p3731
2614.5I09194350q3327j02997j76191j27971p9751j34766j34230n4538O497R000m3214
2636.9I08272862o2406n8889r9838r5486k921J5616j10626j68502p9572J6152R1851
2659.3I07718241R5666n7757j35303J1564P5757l8803p4088k0087m291p2361j41203
2681.8I07357335l9935P4625L8028m6492j64270k30551j22607J9849J1384j38640k54214
2704.2I06504512k07067j24991j60157k29538j84536j14083j57654k51115k62975j43767
$$ y = [911535382, 911586046, 911554873, 911450684, 911379516, 911378264, 911356151, 911256313, 911104500, 910992205, 910991549, 911002636, 910918772, 910794497, 910722077, 910683513, 910629392, 910591722, 910542309, 910416961, 910289645, 910204947, 910094798, 909924746, 909793794, 909795284, 909796298, 909699202, 909612119, 909522355, 909364223, 909276783, 909268081, 909194350, 909111023, 909008026, 908831835, 908703864, 908624113, 908489347, 908355117, 908300579, 908307076, 908316076, 908272862, 908210456, 908151567, 908051729, 907956243, 907953322, 907968938, 907858312, 907689810, 907610238, 907626390, 907718241, 907813907, 907756150, 907620847, 907632411, 907708168, 907669365, 907595277, 907575190, 907570899, 907498538, 907357335, 907317400, 907392025, 907430053, 907383561, 907219291, 906988740, 906866133, 906885982, 906897366, 906758726, 906504512, 906297445, 906172454, 906012297, 905782759, 905598223, 905484140, 905326486, 905075371, 904812396, 904668629]
2724.6I04668629p6234j88470k55525k07842k24053k13206j02878n3108j05202k42710
2745I02999401l48329k97189k10703j74224j85132l15249m40359m03047l51846l95298
2765.4H99878025m50492m25815l93868m56452n52595o05941o10947o09279o07371o30141
2785.8H94535124o64413p01725q23856r46581r67085r52900r18925r07659j053214
2804.1H86598766j275242j444876j577556j684189j854002k104759k363980k644718
2820.5H71649444k996206l515184m243672n091250o076515p384538r185732j1768341
2836.8H21388006j5565276k0635307k5567889k5853157j4776528P448256K7641654
2851G54079759L3820570K8421104J9930124J2662351P353663L741920J257897l60727
$$ y = [904668629, 904592395, 904403925, 904148400, 903940558, 903716505, 903503299, 903400421, 903347313, 903242111, 902999401, 902651072, 902353883, 902143180, 901968956, 901783824, 901468575, 901028216, 900625169, 900273323, 899878025, 899427533, 899001718, 898607850, 898151398, 897598803, 896992862, 896381915, 895772636, 895165265, 894535124, 893870711, 893168986, 892345130, 891398549, 890431464, 889478564, 888559639, 887651980, 886598766, 885323524, 883878648, 882301092, 880616903, 878762901, 876658142, 874294162, 871649444, 868653238, 865138054, 860894382, 855803132, 849726617, 842342079, 833156347, 821388006, 805822730, 785187423, 759619534, 733766377, 718989849, 726438105, 754079759, 787900329, 816321433, 836251557, 848913908, 856267571, 860009491, 861267388, 860906661]
2867.4H60906661j311720k001047k520204l046214l866255m684270n141199n468547
2883.7H32867205n852461o075680o075919o094694o184339o211996o329716o872475
2900G83169925q078635j0050058j2896240j6422331j9315541j8551767j0899186K609551
2916.3F89565718J5727699K3058116K4464012K2632420J9770145J7047227J4862895
2930.6H27128232J3006329J1176169R431899P900595O497026N097985L711998K453208
2946.9H86403441J513601J047432J144529J503765J707018K023279K515912K807379
2963.2I00666356K864778K775312K541899K139509J740217J487434J229167R67801
2979.5I16412473Q41558P01964M72903L94285M55916L60190N3585k36809l30806k60532
$$ y = [860906661, 859594941, 857593894, 855073690, 852027476, 848161221, 843476951, 838335752, 832867205, 827014744, 820939064, 814863145, 808768451, 802584112, 796372116, 790042400, 783169925, 775091290, 765041232, 752144992, 735722661, 716407120, 697855353, 686956167, 689565718, 705293417, 728351533, 752815545, 775447965, 795218110, 812265337, 827128232, 840134561, 851310730, 860742629, 868643224, 875140250, 880238235, 883950233, 886403441, 887917042, 888964474, 890109003, 891612768, 893319786, 895343065, 897858977, 900666356, 903531134, 906306446, 908848345, 910987854, 912728071, 914215505, 915444672, 916412473, 917254031, 917955995, 918428898, 918823183, 919279099, 919639289, 919692874, 919456065, 919125259, 918864727]
2999.9I18864727j80483j30653l4750L4988j4424l6121L6538N7280M053j27732k59459
3022.3I18213964j68741J19447L33369K75433J23859J08540R3639K1100J6331K6226
3042.7I19163167k980L2842Q0705P331q6963j14858p4625k98q941k1875J04547K11060
3067.2I19289112J49608Q3744P0215o378o9738l5226J2159J1146K6823J15156J87635
3089.6I19834256J55866J15574N9545j29640k40505p2062J06275L8505q3924q9824
3110I19694066j00136j85370k26379j44601o5028n1797p3671j44124j19030k0981l2723
3132.5I18530226o1453j10328k30789l07679k74480j38938o8545j75417k87294k32160
3152.9I16643143j35780j89125k48790j16289l636p6293k05398k25961j30773j81258
$$ y = [918864727, 918684244, 918553591, 918518841, 918553829, 918539405, 918503284, 918539822, 918597102, 918601155, 918473423, 918213964, 918045223, 918164670, 918498039, 918773472, 918897331, 919005871, 919099510, 919120610, 919136941, 919163167, 919160187, 919193029, 919273734, 919281065, 919194102, 919079244, 919004619, 919004321, 918995380, 918973505, 919078052, 919289112, 919438720, 919522464, 919592679, 919586301, 919516563, 919481337, 919493496, 919504642, 919531465, 919646621, 919834256, 919990122, 920105696, 920165241, 920035601, 919795096, 919723034, 919829309, 919867814, 919783890, 919694066, 919593930, 919408560, 919182181, 919037580, 918972552, 918920755, 918847084, 918702960, 918583930, 918562949, 918530226, 918468773, 918358445, 918127656, 917819977, 917545497, 917406559, 917338014, 917162597, 916875303, 916643143, 916507363, 916318238, 916069448, 915953159, 915949523, 915873230, 915667832, 915441871, 915311098, 915129840]
3173.3I15129840k82943k42948k72215l92675l65556k00390j03116j43648l18646l48866
3193.6I12458837j58012j35124j85251p9214k8670p6235j28746j76251q6426Q0585
3214I11485493J46687R2268o974K2233J23799J04308J3590J8537J12235J28270P6472
3236.5I12316918J3471j24872k36273j74939m8876k7537p2182j06215j25170j2398
3256.9I11401927J01686q9705k95997j40071J5557q6069k40147l21686j51217P2419
3277.3I10266697j6927j34170j17362r3818L2425J30356J0490j29878j28210p9632
3297.7I09739971m5538K384M8459R7632J16647Q5056N3822P5281J10746O7472k8670
3320.1I10323262j40905r9540O9857O3836K7716P0394J5616l4988l2186o7831m3511
$$ y = [915129840, 914846897, 914603949, 914331734, 913939059, 913573503, 913373113, 913269997, 913126349, 912807703, 912458837, 912300825, 912165701, 911980450, 911901236, 911872566, 911796331, 911667585, 911491334, 911404908, 911485493, 911632180, 911724448, 911717474, 911739707, 911863506, 911967814, 911981404, 911999941, 912112176, 912240446, 912316918, 912330389, 912205517, 911969244, 911794305, 911745429, 911717892, 911645710, 911539495, 911414325, 911401927, 911503613, 911413908, 911117911, 910977840, 910993397, 910907328, 910667181, 910345495, 910194278, 910266697, 910249770, 910115600, 909998238, 909904420, 909936845, 910067201, 910077691, 909947813, 909819603, 909739971, 909694433, 909696817, 909745276, 909842908, 909959555, 910044611, 910098433, 910173714, 910284460, 910351932, 910323262, 910182357, 910082817, 910152674, 910216510, 910244226, 910314620, 910330236, 910295248, 910263062, 910195231, 910151720]
3342.5I10151720Q2254J01984j6093K8193J53005N6386j1742J21772J18136q3923j51813
3364.9I10549879o8068j073K8252M4048J41263K17617J02281o0379j24455l6418J80006
3387.4I10972953K46465J58787J20461J10864J88053K72870K30909J89960K81393M31299
3407.8I13204014M29035L44455K71082J68144J86384J97172R4056J29462K24113K30611
3428.2I15478528K87890L09527J40428N0068J46270K24412K15530J14977O8546K20835
3448.6I17257011L66569K95698K05696K69413K55227J20282J60754K36809R6321R5308
3469I19359088K43664J23441k5034J47521L05594K35259K11477K96116L39925K28882
3489.3I21465933O9201Q2791J79291K08139K09034K11298K12193K82764L37720K73466
$$ y = [910151720, 910233974, 910335958, 910319865, 910348058, 910501063, 910557449, 910545707, 910667479, 910785615, 910701692, 910549879, 910481811, 910480738, 910508990, 910553038, 910694301, 910911918, 911014199, 910953820, 910829365, 910792947, 910972953, 911219418, 911378205, 911498666, 911609530, 911797583, 912070453, 912301362, 912491322, 912772715, 913204014, 913633049, 913977504, 914248586, 914416730, 914603114, 914800286, 914894342, 915023804, 915247917, 915478528, 915766418, 916075945, 916216373, 916266441, 916412711, 916637123, 916852653, 916967630, 917036176, 917257011, 917623580, 917919278, 918124974, 918394387, 918649614, 918769896, 918930650, 919167459, 919263780, 919359088, 919602752, 919726193, 919701159, 919848680, 920154274, 920389533, 920601010, 920897126, 921237051, 921465933, 921535134, 921617925, 921797216, 922005355, 922214389, 922425687, 922637880, 922920644, 923258364, 923531830]
3509.7I23531830J57118J17660K40981L10421K09868J37449N9247k8730J14977L21091
3530.1I25171912K86758J85609J65879J51098J20163J10686J05381J23858J74284J88232
3550.5I26783860K18868K44141J57952R2924J49190j1027l88265k79486L16739N58675
3570.9I27843571M67002L34859J81079J22011J85608N2691k89857k08140M27842N63860
3591.3I29680526J97768L3677Q7619R1612J21653J35482j4723j36852K444J75297J51515
3613.7I30526018L1173l1352J84894M63068L21925O1929N4002J04666J04248K41161
3634.1I32061732L66866K37644n5134k00808j56582j26123j41561J32918M37439K18570
3654.5I32774961q8274N5074L03388K78354q882k97904k31742K13027L18944l3021
$$ y = [923531830, 923688948, 923806608, 924047589, 924358010, 924567878, 924705327, 924764574, 924735844, 924850821, 925171912, 925458670, 925644279, 925810158, 925961256, 926081419, 926192105, 926297486, 926421344, 926595628, 926783860, 927002728, 927246869, 927404821, 927497745, 927646935, 927635908, 927247643, 926968157, 927284896, 927843571, 928310573, 928645432, 928826511, 928948522, 929134130, 929186821, 928896964, 928688824, 929116666, 929680526, 929878294, 929911971, 929999590, 930091202, 930212855, 930348337, 930333614, 930196762, 930199206, 930374503, 930526018, 930557191, 930525839, 930710733, 931173801, 931495726, 931557655, 931611657, 931716323, 931820571, 932061732, 932428598, 932666242, 932611108, 932410300, 932253718, 932127595, 931986034, 932118952, 932556391, 932774961, 932686687, 932741761, 933045149, 933323503, 933314621, 933016717, 932784975, 932998002, 933316946, 933283925]
3674.9I33283925l1888J48415n2750j86324j50502k33829k28464J49428L69192K46882
3695.3I33314085J18971J24693Q7499O6996J79350J69754N1260M4287Q8870P1228o974
3717.7I34310019j00493j52052o7711J55151K25306J01983j41263m53472k70128K66254
3738.1I33873594K88546r5964k51710M3213L0697q4341J03951R2327n5790J4663K07484
3760.6I34166670J78993j7643l3617K6524n4479j5259P4268M5001k146Q822N8830N6922
3785I34492886O5208J43110R9778m1604j36673j33932l5047k1219l0876r834j02640
3807.5I34289157m4703R8824j6033j21057P748m7505j33872M2797Q2254N7816J91331
3829.9I34406757J55867p0155r4235Q047K5451l457n5373m9293j8239j72436l20733
$$ y = [933283925, 933252037, 933400452, 933347702, 933161378, 933010876, 932777047, 932548583, 932698011, 933067203, 933314085, 933433056, 933557749, 933645248, 933712244, 933891594, 934061348, 934112608, 934156895, 934245765, 934316993, 934310019, 934209526, 934057474, 933989763, 934144914, 934370220, 934472203, 934330940, 933877468, 933607340, 933873594, 934162140, 934066176, 933814466, 933857679, 933888376, 933804035, 933907986, 934000313, 933944523, 933959186, 934166670, 934345663, 934328020, 934294403, 934320927, 934266448, 934251189, 934325457, 934370458, 934368312, 934377134, 934435964, 934492886, 934558094, 934701204, 934800982, 934759378, 934622705, 934488773, 934453726, 934432507, 934401631, 934391797, 934289157, 934244454, 934343278, 934327245, 934206188, 934213936, 934166431, 934032559, 934075356, 934157610, 934215426, 934406757, 934562624, 934492469, 934398234, 934406281, 934431732, 934428275, 934372902, 934323609, 934305370, 934132934, 933812201]
3852.3I33812201m0948K09033K22027J73927M7147J0073K6524k9027r4354j06633R6917
3874.8I34326887J77145j00672q8930K13742J38998m2617j5855j4365K1160J788k16663
3897.2I34400618k82943j45257j03116n6326J21832K71439J36018j24156l9339K56538
3917.6I34435308K16067o7771k21371j44244O6579J78575J06752J4365P0214P4268
3938I34728742m0353k3365K5213r8824j57893L0398J82510J71125J29699O3360l4034
3960.4I34976578m5240L6836J1742J728M6730r6440k02716n4299P3552R8943J70112
3982.9I35017526L3081k03133l3677J68443o6042k33292J06275
3997.1I34789181
$$ y = [933812201, 933771253, 933980286, 934202313, 934376240, 934423387, 934433460, 934459984, 934430957, 934336603, 934229970, 934326887, 934504032, 934403360, 934314430, 934528172, 934667170, 934624553, 934608698, 934594333, 934615493, 934617281, 934400618, 934117675, 933972418, 933869302, 933812976, 933934808, 934206247, 934342265, 934218109, 934178770, 934435308, 934651375, 934583604, 934362233, 934217989, 934284568, 934463143, 934569895, 934584260, 934654474, 934728742, 934688389, 934665024, 934690237, 934591413, 934433520, 934463918, 934646428, 934817553, 934947252, 935010612, 934976578, 934931338, 934968174, 934979916, 934981644, 935028374, 934931934, 934729218, 934674919, 934748471, 934847414, 935017526, 935050607, 934847474, 934813797, 934982240, 934916198, 934682906, 934789181]
##END=$$ End of the data block
