##TITLE=Ref 13803 - Tecido 2 $$ Begin of the data block
##JCAMP-DX=5.00 $$ ACD/SpecManager v 10.08
##SPECTROMETER/DATA SYSTEM=Alpha
##DATE=21 Jul 2016 08:26:52
##DATA TYPE=INFRARED SPECTRUM
##DATA CLASS=XYDATA
##ORIGIN=
##OWNER=
##NPOINTS=1765
##FIRSTX=399.76428223
##LASTX=3997.64306641
##MAXX=3997.64306641
##MINX=399.76428223
##MAXY=0.84361869
##MINY=0.16097529
##XFACTOR=1.0000000000
##YFACTOR=1.000000000000000e-9
##FIRSTY=0.82069284
##DELTAX=2.03961372
##XUNITS=1/CM
##YUNITS=ARBITRARY UNITS
##XYDATA=(X++(Y..Y))
399.8H20692837j18553j063705j343846k063990k519905k039016j979291k758086l810942
$$ 820692837 820574284 819510579 818166733 816102743 813582838 811543822 809564531 806806445 802995503
418.1H02995503l470838j637817r07719j046657q31247m31001r56952j821161j071334
$$ 802995503 799524665 797886848 796979129 795932472 795101225 794670224 793713272 791892111 790820777
436.5G90820777J193464L205717M155040L802478K633393J626014P07746l7730k58505
$$ 790820777 792014241 795219958 799374998 803177476 805810869 807436883 808144629 808106899 807848394
454.8H07848394l69072m06742m68433p91729j199066j905859k559483k426445j872361
$$ 807848394 807479322 807072580 806604147 805812418 804613352 802707493 800148010 797721565 795849204
473.2G95849204j723170j844526j872360j868308j874924k080500k372086k649486
$$ 795849204 794126034 792281508 790409148 788540840 786665916 784585416 782213330 779563844
489.5G79563844l020525l581583m200280l829896k026320R8765J801431L601670N334318
$$ 779563844 776543319 772961736 768761456 764931560 762905240 763004005 764805436 768407106 773741424
507.9G73741424N421996L544808J378417M06026M95971P91728Q88109R23276J170099
$$ 773741424 779163420 782708228 784086645 784492671 784988642 785780370 786668479 787591755 788761854
526.2G88761854J538754J760780J766861J576364J462758J523792J492501J444816
$$ 788761854 790300608 792061388 793828249 795404613 796867371 798391163 799883664 801328480
542.5H01328480J435817J249432R05275P13885P99179R38177Q83997N96881M42803
$$ 801328480 802764297 804013729 804919004 805632889 806432068 807370245 808254242 808851123 809293926
560.9H09293926M84109L99351K31564j1563j84358j20461k3722O4254J668k24530k51472
$$ 809293926 809778035 810177386 810408950 810397387 810213029 810092568 810068846 810133100 810134768 809910238 809658766
583.3H09658766j40667k34604m25875l50893k20835l51608m21047l53515l80218l92139
$$ 809658766 809518099 809283495 808857620 808506727 808285892 807934284 807513237 807159722 806779504 806387365
603.7H06387365k98858l45170n91517p37190p25865o45221n27918m98295o11067q37743
$$ 806387365 806088507 805743337 805151820 804414630 803688765 803043544 802515626 802017331 801406264 800568521
624.1H00568521j570940l650546m986346j473248L690660M008472J325548j14083m28737
$$ 800568521 798997581 795347035 790360689 788887441 792578101 796586573 797912121 797798038 797369301
642.5G97369301o50286q49128q99077q87751p91311o32883o37531q12411q69513p97033
$$ 797369301 796719015 795869887 794970810 794083059 793291748 792658865 792021334 791208923 790339410 789542377
662.9G89542377j179755k554536k497196l76105p11441k360463l216327k457082o40571
$$ 789542377 788362622 785808086 783310890 782934785 782223344 779862881 776646554 774189472 773548901
681.2G73548901O54996O93798j1683q14557j692176k778113m347861o475389q243084
$$ 773548901 774203897 774897695 774886012 774071455 772379279 769601166 765253305 758777916 750534832
699.6G50534832q389174p270754o408870o201267o140590o952524j1320114k2501707
$$ 750534832 742145658 734874904 728466034 722264767 716124177 709171653 697851539 675349832
715.9F75349832m3914736p5917780j02965564r6177458n0780058K184957L5691231
$$ 675349832 631435096 555517316 452551752 356374294 305594236 307779193 343470424
730.2C43470424N3017974O7063749Q1335634Q8134229P7836156N3700328K9508352
$$ 343470424 396488398 463552147 544887781 633022010 710858166 764558494 794066846
744.5G94066846J3834894N742073J937151K27034n05984p47263r37641j237869j454592
$$ 794066846 807901740 813643813 815580964 815807998 815302014 814554751 813617110 812379241 810924649
762.8H10924649j510858j569689j775682j961529j988888k016782k192021k695799
$$ 810924649 809413791 807844102 806068420 804106891 802118003 800101221 797909200 795213401
779.1G95213401l716349n315125p476688r855926j1675834j0652543l850340O050408
$$ 795213401 791497052 786181927 778705239 768849313 757173479 746520936 742670596 748721004
795.4G48721004J0552763O965340J691043m02987k59042J50025K56658K18272L07500
$$ 748721004 759273767 766239107 767930150 767527163 767268121 767418146 767674804 767893076 768200576
813.8G68200576M54843M40896J97530l78311j151919j795531k399683l209889m008829
$$ 768200576 768655419 769096315 769293845 768915534 767763615 765968084 763568401 760358512 756349683
832.2G56349683m596293m855931m565179l947079l458500l031612k080023l26812J524567
$$ 756349683 751753390 746897459 742332280 738385201 734926701 731895089 729815066 729488254 731012821
850.5G31012821K507150K505243J810849L07798k390265o532908j2479901k0534039
$$ 731012821 733519971 736025214 737836063 738143861 735753596 729220688 716740787 696206748
866.8F96206748k8798162k8745473j3391137O957710J8134951K0243347J8303394J4534176
$$ 696206748 667408586 638663113 625271976 632229686 650364637 670607984 688911378 703445554
883.2G03445554J0461092O914377L952801J546204q5830n31972M48823K693892N722642
$$ 703445554 713906646 720821023 724773824 726320028 726234198 725702226 726151049 728844941 734567583
901.5G34567583Q627712J0474086J0786593R691239P793009N712271L903627K520204
$$ 734567583 743195295 753669381 764455974 774147213 781940222 787652493 791556120 794076324
917.8G94076324J509308P94888L09527Q285k25008l99053m68373n30541n85318o21795
$$ 794076324 795585632 796380520 796690047 796698332 796473324 796074271 795605898 795075357 794490039 793868244
938.2G93868244p39277q99255r90808j031935j146496j416862j781642k247810k870560
$$ 793868244 793128967 792229712 791238904 790206969 789060473 787643611 785861969 783614159 780743599
956.6G80743599l628373m618108n945385p424355q589625q588791o161570j241148
$$ 780743599 777115226 772497118 766551733 759127378 750537753 741948962 735787392 734546244
972.9G34546244L824771O522417O621360N367279L730059J978278N83172L86298Q62300
$$ 734546244 738371015 744893432 751514792 756882071 760612130 762590408 763173580 763559878 764422178
991.3G64422178N20706p22467j979948l033638m235744o232858r920120j6198933k7043760
$$ 764422178 764942884 764220417 762240469 759206831 754971087 748738229 738818109 722619176 695575416
1009.6F95575416m5990825o7338764o7715943l3404648J1610806L5905182M0857315
$$ 695575416 649584591 582245827 514529884 481125236 492736042 528641224 569498539
1023.9E69498539L9082229K8803408J3163388K382636k397954m707635n711138m968822
$$ 569498539 608580768 637384176 650547564 652930200 650532246 645824611 640113473 635144651
1040.2F35144651k200127K153397P011533J1137783J3726413J4439166J3265371J0375679
$$ 635144651 632944524 635097921 642109454 653247237 666973650 681412816 694678187 705053866
1056.5G05053866O383419K187312j591504m798472p570207j0387242j3983846j8964707
$$ 705053866 711437285 713624597 712033093 707234621 699664414 689277172 675293326 656328619
1072.8F56328619k5368095l2282591l7855744m0389180l9863140l7874758l6228239
$$ 656328619 630960524 598677933 560822189 520433009 480569869 442695111 406466872
1087.1D06466872l5230876l3601403k9971808k3906618j5868306o730348K404511J0406792
$$ 406466872 371235996 337634593 307662785 283756167 267887861 261157513 263562024 273968816
1103.4B73968816J6119689J7983436J4359385O378919j674593o672829p669836m529268
$$ 273968816 290088505 308071941 322431326 328810245 327135652 320462823 312792987 308263719
1119.8C08263719J159608O690205J0256946J1635422J2577832J5590638K1504790K8681427
$$ 308263719 309423327 316113532 326370478 338005900 350583732 366174370 387679160 416360587
1136.1D16360587L4422845L7414491L8444042L8436174L7125230L4146369K9927730
$$ 416360587 450783432 488197923 526641965 565078139 602203369 636349738 666277468
1150.3F66277468K5059104J9815982J4647722J0185540O681621L635048r5009n075932
$$ 666277468 691336572 711152554 725800276 735985816 742667437 746302485 746207476 741131544
1166.7G41131544r767771j1175334p896662j585841M841804R320915J1020601R986997
$$ 741131544 731363773 720188439 712291777 710705936 715547740 724868655 735889256 745876253
1183G45876253P154047L911078J131952j041591k783954m182578n119860n628884n950272
$$ 745876253 753030300 756941378 758073330 757031739 754247785 750065207 744945347 739316463 733366191
1201.3G33366191o208002o448627o798029p347762q120239r211421j0872424j3274014
$$ 733366191 727158189 720709562 713911533 706563771 698443532 689232111 678359687 665085673
1217.7F65085673j6060054j8665373k1335900k5332928l1923830m0943623n0119251
$$ 665085673 649025619 630360246 609024346 583691418 551767588 510823965 460704714
1231.9D60704714n5892199n5538446m8937797l8389087k7141437j7632380j0740921
$$ 460704714 404812515 349274069 300336272 261947185 234805748 217173368 206432447
1246.2B06432447o200567l524512k422020k613828l502845m017666l191963r14246
$$ 206432447 200231880 196707368 194285348 191671520 188168675 184151009 180959046 180044800
1262.5A80044800K067819N077467P683202R389237R618595Q474544O995722O229058
$$ 180044800 182112619 187190086 194873288 204262525 213881120 222355664 229351386 235580444
1278.8B35580444O550581P776647R573162J1607736J4076412J7509073K2220820K8042406
$$ 235580444 242131025 249907672 259480834 271088570 285164982 302674055 324894875 352937281
1295.2C52937281L4162939L8552403L8637400L4477055K9863715K7862311K7297377
$$ 352937281 387100220 425652623 464290023 498767078 528630793 556493104 583790481
1309.4E83790481K5841534K3227513K0605922J8799424J7747283J6846716J5205503
$$ 583790481 609632015 632859528 653465450 672264874 690012157 706858873 722064376
1323.7G22064376J1868596O216466k181291j3705194k7171850l8830042m3461979l4272253
$$ 722064376 733932972 740149438 737968147 724262953 697091103 658261061 614799082 580526829
1340E80526829p847607K5321304M7251225M8558414L6086202K1982312J1559605M268110
$$ 580526829 572679222 598000526 645251751 693810165 729896367 751878679 763438284 767706394
1356.4G67706394j912236r037316j7632961k3769677k3611724j7463267o897271L549755
$$ 767706394 765794158 756756842 739123881 715354204 691742480 674279213 667381942 670931697
1372.7F70931697J0702073J3551593J2749255R813249N840242K080083o85215k328277
$$ 670931697 681633770 695185363 707934618 717747867 723588109 725668192 724982977 722654700
1389G22654700m027307p381201j1548996j5022873k0111144k7027488l6731958m7603250
$$ 722654700 718627393 711246192 699697196 684674323 664563179 637535691 600803733 553200483
1405.3E53200483m3741762j5738756K7671546O3345611P1246088N8441281L9969563
$$ 553200483 509458721 493719965 521391511 584737122 655983210 714424491 754394054
1419.6G54394054K1563948R371876K334178l274083q552969j2038708j3352274j4912725
$$ 754394054 775958002 785329878 787664056 784389973 775837004 763798296 750446022 735533297
1435.9G35533297j3323426p602871m196763l067851l010452l821611l776371k192200
$$ 735533297 722209871 714607000 710410237 707342386 704331934 700510323 696733952 694541752
1452.2F94541752N88775N034804J1464417J4812827J4753521J3453007R447038M100442
$$ 694541752 695130527 700165331 711629748 726442575 741196096 754649103 764096141 768196583
1468.5G68196583K030253N336225R481430R531439P871329O419123N272209L914893
$$ 768196583 770226836 775563061 785044491 794575930 802447259 808866382 814138591 818053484
1484.9H18053484K303064Q07702k68697j745582n411267j2133301k0714342k7612269
$$ 818053484 820356548 821164250 820895553 819149971 813738704 801605403 780891061 753278792
1501.2G53278792k5604904q591711K1469474L1419277K0638883J0802865M419863J150489
$$ 753278792 727673888 719082177 740551651 771970928 792609811 803412676 807832539 808983028
1517.5H08983028m52101j344085q17597J13845Q26120J519561J462698J413345J591027
$$ 808983028 808530927 807186842 806369245 806483090 807309210 808828771 810291469 811704814 813295841
1535.8H13295841P25925p66456n51283L79026M28140j00911p28130r56536j087904
$$ 813295841 814021766 813255310 812704027 813083053 813511193 813410282 812682152 811725616 810637712
1554.2H10637712j380562k448798k074003n65886j390577l159046n580842q563400
$$ 810637712 809257150 806808352 804734349 804168463 802777886 799618840 794037998 785474598
1570.5G85474598j0207831j3214171j4077366k883434J0453045J6813457J5357256
$$ 785474598 775266767 762052596 747975230 745091796 755544841 772358298 787715554
1584.8G87715554R828389N057573K475679J184523K22802o94632j542330k267122k740443
$$ 787715554 797543943 802601516 805077195 806261718 806484520 805789888 804247558 801980436 799239993
1603.2G99239993l158152l989935m880309m585385k408088R99451M414678M811346
$$ 799239993 796081841 792091906 787211597 782626212 780218124 781217575 785632253 790443599
1619.5G90443599K605796N01096l54111o56962q32677p76291j404285k182544j249790
$$ 790443599 793049395 793550491 793196380 792539418 791706741 790930450 789526165 787343621 786093831
1637.8G86093831l55363o47187j329959k251148j822471p78616k419889l914654j943529
$$ 786093831 785738468 785091281 783761322 781510174 779687703 778909087 776489198 772574544 770631015
1656.2G70631015j955330l905594n832017o379604o004632p155359p955849o850660
$$ 770631015 768675685 764770091 758938074 752558470 746553838 739398479 731442630 724591970
1672.5G24591970p699608r112299q681714q443237q996546q645952n203187m452348
$$ 724591970 716892362 707780063 699098349 690655112 681658566 673012614 667809427 663357079
1688.8F63357079p036090r661794j5107095k0358503k6189089l6991536l9508820m6358406
$$ 663357079 656320989 646659195 631552100 611193597 585004508 548012972 508504152 462145746
1705.1D62145746n8859945o1657279n8899969n1087335l8581714k3563698q520514
$$ 462145746 403285801 341628522 282728553 231641218 193059504 169495806 160975292
1719.4A60975292Q5607L257677N344466P871240J0827571J4822916K3197740L3545092
$$ 160975292 161060899 164318576 169663042 177534282 188361853 203184769 226382509 259927601
1735.7B59927601M1667074N6930840P1359932P5169981P1504950O1386049M9473822
$$ 259927601 301594675 358525515 429885447 505055428 576560378 637946427 687420249
1750F87420249L7192583K5587618J8020869J3575494R957969P576585N955875M505217
$$ 687420249 724612832 750200450 768221319 781796813 791754782 799331367 805287242 809792459
1766.3H09792459L352165K588451K100468K077281K025783J521767J164495J002253
$$ 809792459 813144624 815733075 817833543 819910824 821936607 823458374 824622869 825625122
1782.6H25625122Q94725P90656N66422J2935o4493N08130N74291J42395n3823J95861
$$ 825625122 826519847 827310503 827876925 827889860 827825367 828333497 828907788 829050183 828996360 829192221
1803H29192221K23756o1870l33488l18169j39952j53303k94864k22683o5446o6280
$$ 829192221 829415977 829354107 829020619 828702450 828562498 828409195 828114331 827891648 827826202 827759922
1823.4H27759922J55985M97579O60778J024484J312137J168012J114369J123965Q33511
$$ 827759922 827915907 828413486 829074264 830098748 831410885 832578897 833693266 834817231 835650742
1841.8H35650742O41406J049041J382411J211464R74655P73848O34610M74811L36885
$$ 835650742 836292148 837341189 838723600 839935064 840909719 841683567 842318177 842792988 843129873
1860.2H43129873K78235J42395j22666k69294L1233K98023J30892j36793j98185k02775
$$ 843129873 843408108 843550503 843427837 843158543 843189776 843487799 843618691 843481898 843283713 843080938
1880.5H43080938k87533l68535m37081n34356m82261l92020m58538m43995m30465n15044
$$ 843080938 842793405 842424870 841987789 841453433 840971172 840579152 840120614 839676619 839246154 838731110
1900.9H38731110n46455n11349n80847o56903n50568m65393o03437q24094p87199o68108
$$ 838731110 838184655 837673306 837092459 836435556 835884988 835419595 834816158 833992064 833204865 832536757
1921.3H32536757o58870o08444o68585q82566j056254j147926j202047j282692j473665
$$ 832536757 831877887 831269443 830600858 829718292 828662038 827514112 826312065 825029373 823555708
1939.7H23555708j635253j414240r92060p37547n33879l13103r0600J08541K67803
$$ 823555708 821920455 820506215 819514155 818776608 818242729 817929626 817839026 817947567 818215370
1958.1H18215370N19991R44257J316666J436532J393080J245737J009881P54357N72860
$$ 818215370 818735361 819679618 820996284 822432816 823825896 825071633 826081514 826835871 827408731
1976.4H27408731M65929L65735L04818K88605K97666L58045M06087M66048N82278O12319
$$ 827408731 827874660 828240395 828545213 828833818 829131484 829489529 829895616 830361664 830943942 831556261
1996.8H31556261N66303N02467M08769L47972L19600K80678K61307K38121J62542J07407
$$ 831556261 832122564 832625031 833033800 833381772 833701372 833982050 834243357 834481478 834644020 834751427
2017.2H34751427J52946K36690K29954J70291J34110R2328P6055O0022k3305j07288
$$ 834751427 834904373 835141063 835371017 835541308 835675418 835767746 835843801 835903823 835880518 835773230
2037.6H35773230j21773j15037j49667j94788k01762j84118k19584l16560l56734l64065
$$ 835773230 835651457 835536420 835386753 835191965 834990203 834806085 834586501 834269941 833913207 833549142
2058H33549142l98338m23491m53830m50313m08053m45187n16177m71532l76940l51071
$$ 833549142 833150804 832727313 832273483 831823170 831415117 830969930 830453753 829982221 829605281 829254210
2078.4H29254210l58343l36468l49045l74973k99752k22504k55525k66969j75953j49787
$$ 829254210 828895867 828559399 828210354 827835381 827535629 827313125 827057600 826790631 826614678 826464891
2098.8H26464891k03847j72854p8201n8651r7215j08421j02222n3287M4763J19269
$$ 826464891 826261044 826088190 826009989 825951338 825854123 825745702 825643480 825590193 825634956 825754225
2119.2H25754225J30773Q8334O3002J02162J39177J22309R0122N9724M0591L9041O4194
$$ 825754225 825884998 825973332 826036334 826138496 826277673 826399982 826490104 826549828 826590419 826629460 826693654
2141.6H26693654J24633J15514P2658J68920L00944L03864K34425K27094K65419K59877
$$ 826693654 826818287 826933801 827006459 827175379 827476323 827780187 828014612 828241706 828507125 828767002
2162H28767002K47597K73943K59102J79708J58310J67727J04964N3823Q2850J10507
$$ 828767002 829014599 829288542 829547644 829727352 829885662 830053389 830158353 830212176 830295026 830405533
2182.4H30405533O9738J1742j669k6584p6472p3731p7546j46270j95503k12073k56658
$$ 830405533 830475271 830487013 830485344 830458760 830382288 830308557 830231011 830084741 829889238 829677165 829420507
2204.8H29420507k70367k23636j74463j36435r4414l4749l9578j14798j39773j30415
$$ 829420507 829150140 828926504 828752041 828615606 828521192 828486443 828446865 828332067 828192294 828061879
2225.2H28061879j68085k11299k11120k36570k67089k19464j76549k14040k52307k54035
$$ 828061879 827893794 827682495 827471375 827234805 826967716 826748252 826571703 826357663 826105356 825851321
2245.6H25851321k89559l68595l98279l58223l18408l14057l23534k81036j96159j47343
$$ 825851321 825561762 825193167 824794888 824436665 824118257 823804200 823480666 823199630 823003471 822856128
2266H22856128j42216j55628j51813j26839j33157j33753r4354m3034K3782J01447
$$ 822856128 822713912 822558284 822406471 822279632 822146475 822012722 821918368 821875334 821899116 822000563
2286.4H22000563K27630L68715L96967L58045L14414K27153J35959M9472m9353j67966
$$ 822000563 822228193 822596908 822993875 823351920 823666334 823893487 824029446 824078918 824029565 823861599
2306.8H23861599l41475m61757m42684m19021n31971p00235p17163n65529l89934l01063
$$ 823861599 823520124 823058367 822615683 822196662 821664691 820964456 820247293 819681764 819291830 818990767
2327.2H18990767k92897k14279r7871j81615l24607k72274j71065j13905K97249O79254
$$ 818990767 818697870 818483591 818385720 818204105 817879498 817607224 817436159 817322254 817619503 818298757
2347.6H18298757J08183j017750j707256j670718j328826q47578l79383n424L24487
$$ 818298757 818406940 817389190 815681934 814011216 812682390 811834812 811455429 811450005 811774492
2366H11774492N14329O41405P86662Q04007Q25406R46998R77993Q28922N89192L58105
$$ 811774492 812288821 812930226 813716888 814520895 815346301 816293299 817271292 818100214 818689406 819047511
2386.4H19047511K08020J30117O7532P7069J80602K25723J80184J49191J79410K63631
$$ 819047511 819255531 819385648 819453180 819530249 819710851 819936574 820116758 820265949 820445359 820708990
2406.8H20708990K76983J91271J85669K73645K83241K13683K20358K81095K78771K16186
$$ 820708990 820985973 821177244 821362913 821636558 821919799 822133482 822353840 822634935 822913706 823129892
2427.2H23129892K15054K80201K57969J81139J61588J63019J40309J12534P0452K8372
$$ 823129892 823344946 823625147 823883116 824064255 824225843 824388862 824529171 824641705 824712157 824740529
2447.6H24740529K6763J5616k7478l2246j9431m2975n4896p2896j00375r1970j00493
$$ 824740529 824767292 824782908 824755430 824723184 824703753 824660778 824605882 824532986 824432611 824340641 824240148
2470H24240148j38640j54555j46389j57833j87993k19107k76566l01182k32041j96278
$$ 824240148 824101508 823946953 823800564 823642731 823454738 823235631 822959065 822657883 822425842 822229564
2490.4H22229564k64942l07918k53797j92105j91510j74940r8169q6367j76966k25305
$$ 822229564 821964622 821656704 821402907 821210802 821019292 820844352 820746183 820659816 820482850 820257545
2510.8H20257545j69218j06275j03772j33693j53899j33991j05024p7665m4822m5717
$$ 820257545 820088327 819982052 819878280 819744587 819590688 819456697 819351673 819274008 819229186 819183469
2531.2H19183469o1274n2929r954J0908j5676q047J550k8253m4584n2035m0829j7404
$$ 819183469 819122195 819069266 819059312 819070220 819054544 819046497 819048047 819019794 818975210 818923175 818882346 818864942
2555.6H18864942k3842j610N0128O1691L5286J073j073J0907j0788j6093L1113N2095
$$ 818864942 818841100 818839490 818889618 818951309 818986595 818987668 818986595 818997502 818986714 818970621 819001734 819053829
2580.1H19053829M3571R8824J64271J89185K11477J76609J35123J74105J65880Q3208
$$ 819053829 819097400 819196224 819360495 819549680 819761157 819937766 820072889 820246994 820412874 820496082
2600.5H20496082K9385k2709o7353m2379L517j1027o2406j00971j28209j34945j29998
$$ 820496082 820525467 820502758 820435405 820393026 820396543 820385516 820323110 820222139 820093930 819958985 819828987
2623H19828987j14381o2704L695Q0228J82271K81930L41833L22938K14159J09196O9260
$$ 819828987 819714606 819651902 819655597 819735825 819918096 820200026 820541859 820864797 821078956 821188152 821257412
2645.4H21257412M3452J073k6345l58K6047j5437n4777k3722M947l5405p4327k7001
$$ 821257412 821300864 821301937 821275592 821275234 821301281 821285844 821231067 821207345 821212292 821176887 821102560 821075559
2669.9H21075559K1040k503k3663l8088o1452l3021J4424j549m3631n0664n0366r8050
$$ 821075559 821096599 821094096 821070433 821032345 820970893 820937872 820952296 820950747 820907116 820856452 820806086 820708036
2694.3H20708036j95205k44796j65403p5161r2745j38343j44958j28865j13964j25051
$$ 820708036 820512831 820268035 820102632 820027471 819934726 819796383 819651425 819522560 819408596 819283545
2714.7H19283545j38700j35660j55568j86444j91092j72198j82211k53439k57850k10285
$$ 819283545 819144845 819009185 818853617 818667173 818476081 818303883 818121672 817868233 817610383 817400098
2735.1H17400098k21193k15769j78158j56045j73152k14517j83820r4891q1420j35660
$$ 817400098 817178905 816963136 816784978 816628933 816455781 816241264 816057444 815962553 815881133 815745473
2755.5H15745473j55926j29580q0765l8564j6570j8299o2823j13964j04308p6771j02460
$$ 815745473 815589547 815459967 815379202 815340638 815324068 815305769 815242946 815128982 815024674 814947903 814845443
2778H14845443j43469j96755k37345k40624k65300k50459k15769k88665l53337l02374
$$ 814845443 814701974 814505219 814267874 814027250 813761950 813511491 813295722 813007057 812653720 812351346
2798.4H12351346k31385k00927j91391j34706J609J07705Q2732q881m1783n6923j51455
$$ 812351346 812119961 811919034 811727643 811592937 811594546 811702251 811784983 811776102 811734319 811677396 811525941
2820.8H11525941k81632l78728m43697n17368n82218o42956p05301p36535q35180j017452
$$ 811525941 811244309 810865581 810421884 809904516 809322298 808679342 807974041 807237506 806402326 805384874
2841.2H05384874j195371j375496j493275j433850j273334j169085j088381r04143
$$ 805384874 804189503 802814007 801320732 799886882 798613548 797444463 796356082 795451939
2857.5G95451939o69658n72264n93961o09636o38544p02739p63416q08061r04023j073718
$$ 795451939 794782281 794210017 793616056 793006420 792367876 791665137 790901721 790093660 789189637 788115919
2877.9G88115919j269818j428961j428545j214981q05557k54094K58505N61595O22988
$$ 788115919 786846101 785417140 783988595 782773614 781968057 781713963 781972468 782534063 783157051
2896.3G83157051M25875n0962o14703p70509k25127P56920J618087J939893J812100
$$ 783157051 783582926 783531964 782917261 782146752 781921625 782678545 784296632 786236525 788048625
2914.6G88048625J452923R49263M90308J45316j44839m24027p88987j219928j678050
$$ 788048625 789501548 790450811 790941119 791086435 790941596 790517569 789728582 788508654 786830604
2933G86830604k363980l325224m349947n390763o405055p140756p405520p189095o566941
$$ 786830604 784466624 781141400 776791453 771400690 764995635 757854879 750449359 743260264 736693323
2951.3G36693323n682648m598438l267765j783729l98815O94871J586140K504467L572107
$$ 736693323 731010675 726412237 723144472 721360743 720961928 721656799 723242939 725747406 729319513
2969.7G29319513M655123N331397N384564N015433M487276L989756L571689L218770
$$ 729319513 733974636 739306033 744690597 749706030 754193306 758183062 761754751 764973521
2986G64973521K944648K670885K345681K030849J778126J604140J522362J531124J567185
$$ 764973521 767918169 770589054 772934735 774965584 776743710 778347850 779870212 781401336 782968521
3004.4G82968521J563728J487136J358986J408219J789808K208293K314746K081752
$$ 782968521 784532249 786019385 787378371 788786590 790576398 792784691 795099437 797181189
3020.7G97181189J689017J334786J097799R40859P79152O17981M72426K50399j37746
$$ 797181189 798870206 800204992 801302791 802243650 803022802 803640783 804113209 804363608 804225862
3039H04225862p36177j449764k145052k741694k988637k539873j411199o6638Q49902
$$ 804225862 803489685 802039921 799894869 797153175 794164538 791624665 790213466 790146828 790996730
3057.4G90996730Q84474K89976k24054l38077j49846J74522L99113L50237R6023p7188
$$ 790996730 791881204 792171180 791947126 791609049 791459203 791633725 792032838 792383075 792479098 792401910
3077.8G92401910N5790M68433R77993J339793J493692J364708Q04544L3319n73933
$$ 792401910 792457700 792926133 793904126 795243919 796737611 798102319 798906863 798940182 798366249
3096.1G98366249q49486p58409k75731M01020R05990J181305J329183J288474J052022
$$ 798366249 797516763 796758354 796482623 796883643 797789633 798970938 800300121 801588595 802640617
3114.5H02640617P30991M19200J45316r0301j61827m5001K16007N89549P92146O85454
$$ 802640617 803371608 803790808 803936124 803845823 803683996 803638995 803855002 804444551 805236697 805922151
3134.9H05922151N01632M51863M62353L70264K73765K66015J95861P7307J11163K41697
$$ 805922151 806423783 806875646 807337999 807708263 807982028 808248043 808443904 808521211 808632374 808874071
3155.3H08874071K32279R4116M0352Q2731R5189O4552K9266J5258K0624L4093L3737
$$ 808874071 809106350 809200466 809240818 809323549 809418738 809483290 809512556 809527814 809548438 809582531 809616268
3177.7H09616268K1040J0967m2021q1479k2293J9134K4139P1109P5996J9312J2993
$$ 809616268 809637308 809648275 809606254 809524775 809502482 809521616 809545755 809616864 809692860 809712172 809725165
3200.1H09725165Q5116J02520k7955j62244j45197n8293n3048j04129j07348j06991
$$ 809725165 809810281 809912801 809884846 809722602 809577405 809519112 809466064 809361935 809254587 809147596
3220.5H09147596j65164j62244n3167r001p8320q6486q226P868j3530j788p16p391
$$ 809147596 808982432 808820188 808767021 808758020 808679700 808593214 808584988 808592856 808579326 808577538 808576822 808569431
3245H08569431o675M1306L7133r2387n8889R9957M9889j14918j28925l2663n3227j19150
$$ 808569431 808562756 808604062 808641195 808548808 808489919 808589876 808639765 808524847 808395922 808363259 808310032 808190882
3269.5H08190882p4029l7253l9816j4245r954q2791j78158j69814j13964j50323j86920
$$ 808190882 808116853 808079600 808039784 808025539 808015585 807932794 807754636 807584822 807470858 807320535 807133615
3291.9H07133615j15156m5479m5597k921R1553J09613L3915K6763J18970J28806R7275
$$ 807133615 807018459 806972980 806927383 806924462 807016015 807125628 807159543 807186306 807305276 807434082 807531357
3314.4H07531357P9512k5928j95264k99752k24233j32441j96636k40088j80602j08301
$$ 807531357 807610869 807584941 807389677 807089925 806865692 806733251 806536615 806296527 806115925 806007624
3334.8H06007624m8161J5020J01626K34306L76344L64423K17795K11716L27587K94626
$$ 806007624 805959463 805974483 806076109 806310415 806686759 807051182 807268977 807480693 807808280 808102906
3355.2H08102906J47640P0572N0724L3915o318m4346n662Q0049J03473L6896m1843
$$ 808102906 808250546 808321118 808371842 808405757 808399439 808355093 808349431 808429480 808532953 808569849 808528006
3377.6H08528006k6822M8041K325j09911j29223j65939j87457j00136j27732l12508
$$ 808528006 808501184 808549225 808551550 808441639 808312416 808146477 807959020 807858884 807731152 807418644
3398H07418644m38273m22120m45008o95169r36508j004994j101673j232981j350045
$$ 807418644 806980371 806558251 806113243 805418074 804481566 803476572 802374899 801141918 799791873
3416.3G99791873j507044j560629j512825j577854j663924j392960o28412J77681P32422
$$ 799791873 798284829 796724200 795211375 793633521 791969597 790576637 789948225 790125906 790858328
3434.7G90858328J222551J543343J509309J322627J222909J270890J354277J256168
$$ 790858328 792080879 793624222 795133531 796456158 797679067 798949957 800304234 801560402
3451H01560402J043320Q70108P16567O37889O18220N59210L84510K14398L21507N06759
$$ 801560402 802603722 803473830 804190397 804828286 805446506 806005716 806390226 806604624 806926131 807432890
3471.4H07432890L92914J77622J04308O5386M6313K4259n5552j24395j11401q4698
$$ 807432890 807825804 808003426 808107734 808173120 808219433 808243692 808188140 808063745 807952344 807867646
3491.8H07867646j49667k25246k29537k59758l22699k07663r1314k32875l80278l14534
$$ 807867646 807717979 807492733 807263196 807003438 806680739 806473076 806381762 806148887 805768609 805454075
3512.2H05454075j71899j65999k44677l86775n82755n69760l55900k14576j94371k31147
$$ 805454075 805282176 805116177 804871500 804484725 803901970 803332210 802976310 802761734 802567363 802336216
3532.6H02336216l16322l65138k74777j68860k86281m48406k68638K8789R6202J60575
$$ 802336216 802019894 801654756 801379979 801211119 800924838 800476432 800207794 800236583 800332785 800493360
3553H00493360L00049K82646J55866J32739J51158j2815J20878P53581R42052O93083
$$ 800493360 800793409 801076055 801231921 801364660 801515818 801503003 801623881 802377462 803319514 804012597
3573.4H04012597N62191M30524K81215K41935L7730l33250j93894M50790M79400J7584
$$ 804012597 804574788 805005312 805286527 805528462 805566192 805232942 805039048 805489838 805969238 805986822
3593.8H05986822j27316q3148j23084j04427n9009k66313n36204m89533l59058k04384
$$ 805986822 805859506 805776358 805653274 805548847 805489838 805223525 804687321 804197788 803838730 803634346
3614.2H03634346j22846l71813k70486J79350J26660m22835q37446j12772O70016N86808
$$ 803634346 803511500 803139687 802869201 803048551 803175211 802752376 801914930 801802158 802472174 803058982
3634.6H03058982L82781K08795J13308K02895J10387l60131m50432N47409J216292
$$ 803058982 803441763 803650558 803763866 803966761 804077148 803717017 803266585 803813994 805030286
3652.9H05030286P53045M55261P53045O93381M29928L51906J21772k58982o7115O7472
$$ 805030286 805783331 806238592 806991637 807685018 808114946 808466852 808588624 808329642 808262527 808329999
3673.3H08329999k00569L39389P40230M60028K64109J29461o9201P8797O49750Q54135
$$ 808329999 808129430 808468819 809209049 809669077 809933186 810062647 809993446 810072243 810721993 811576128
3693.7H11576128O17802L67582J23322o2585J25110K75255J5318l37303j99020M15445
$$ 811576128 812193930 812561512 812684834 812622249 812747359 813022614 813037932 812700629 812501609 812917054
3714.1H12917054M85539j5497l71039l22103k37644j62661M8935m2498m30882n61297
$$ 812917054 813402593 813387096 813016057 812693954 812456310 812293649 812342584 812300086 811869204 811307907
3734.5H11307907l3498O84321O09637k74897o16193J22368K3306m52995M9948N08428
$$ 811307907 811274409 811958730 812568367 812293470 811677277 811799645 811822951 811369956 811419904 811928332
3754.9H11928332K94030k9207J03176K36332M8757K2352P0870K03371L40521J67131
$$ 811928332 812222362 812193155 812296331 812532663 812581420 812603772 812674642 812878013 813218534 813385665
3775.3H13385665j21295k05815R596R6739P2121J47284Q6009j8060j74701m53532m41551
$$ 813385665 813264370 813058555 813068151 813164890 813237011 813384295 813470304 813452244 813277543 812824011 812382460
3797.7H12382460m14908k78831L12686L13878J74463L70502K37823k91347n87166k78711
$$ 812382460 811967552 811688721 812001407 812315285 812489748 812860250 813098073 812806726 812219560 811940849
3818.1H11940849l23832j0014P49409N63622N7220k18927k89917k49446l99947l36409
$$ 811940849 811617017 811607003 812356412 812920034 812977254 812758327 812468410 812218964 811819017 811482608
3838.5H11482608J72496L80874K68519J79410J7702n38587j164437k62737R05216O44147
$$ 811482608 811655104 812035978 812304497 812483907 812501609 811963022 810798585 810535848 811441064 812085211
3858.9H12085211l3676m23909k22086J42931K6584J6868J99855J89423N1856k42352
$$ 812085211 812051535 811627626 811405540 811548471 811575055 811591923 811791778 811981201 812033057 811790705
3879.3H11790705p6592O6280k17616N2928J43409j45077J19149K50161k50697o44803
$$ 811790705 811714113 811780393 811562777 811615705 811759114 811614037 811733186 811983347 811732650 811087847
3899.7H11087847m69983N067M37617N41031L21388O8784j31130k84731j84656Q6189
$$ 811087847 810617864 810622931 811060548 811601579 811922967 811991751 811860621 811575890 811391234 811477423
3920.1H11477423J04367l5822n603k5630j76608n2452K63571K96772K1279k54929k23935
$$ 811477423 811581790 811545968 811540365 811514735 811338127 811285675 811549246 811846018 811867297 811612368 811388433
3942.5H11388433k9027o1214q6844O4671J01626N543o2347l5882r238o8605j37747
$$ 811388433 811359406 811298192 811211348 811276019 811377645 811383188 811320841 811284959 811275721 811207116 811069369
3965H11069369j29223j02758j11043p3731r835q524m3213p5519j10567j15335q8632
$$ 811069369 810940146 810837388 810726345 810652614 810642779 810634255 810591042 810515523 810404956 810289621 810200989
3987.4H10200989m5836l099L4273R4354P9929
$$ 810200989 810155153 810152054 810186327 810280681 810360610
3997.6H10360610
$$ 810360610
##END=$$ End of the data block
