##TITLE=Ref 13803 - Solado interno $$ Begin of the data block
##JCAMP-DX=5.00 $$ ACD/SpecManager v 10.08
##SPECTROMETER/DATA SYSTEM=Alpha
##DATE=21 Jul 2016 08:26:52
##DATA TYPE=INFRARED SPECTRUM
##DATA CLASS=XYDATA
##ORIGIN=
##OWNER=
##NPOINTS=1765
##FIRSTX=399.76428223
##LASTX=3997.64306641
##MAXX=3997.64306641
##MINX=399.76428223
##MAXY=0.89818281
##MINY=0.00948095
##XFACTOR=1.0000000000
##YFACTOR=1.000000000000000e-9
##FIRSTY=0.86066127
##DELTAX=2.03961372
##XUNITS=1/CM
##YUNITS=ARBITRARY UNITS
##XYDATA=(X++(Y..Y))
399.8H60661268J797498P01963j64926l49521p1883n5552k90632n40078n94735M0233
$$ 860661268 862458766 863160729 862995803 862646282 862574399 862518847 862228215 861688137 861093402 861133635
420.2H61133635J62900l50535R7096J220285J489163R80496J19806r24647j077712
$$ 861133635 861296535 860946000 861043096 862263381 863752544 864733040 864852846 863928199 862850487
438.5H62850487k80857O48677P56205n55456j452863k89023J462638J742661J029611
$$ 862850487 862569630 863218307 863974512 863419056 861966193 861677170 863139808 864882469 865912080
456.9H65912080Q80062M53651p59244r51945L97622K311886L370046L302395K946497
$$ 865912080 866792142 867245793 866486549 865534604 865932226 868244112 871614158 874916553 877863050
475.2H77863050K225995J720488J841962J640260J161099J000106Q94129Q11458P38144
$$ 877863050 880089045 881809533 883651495 885291755 886452854 887452960 888347089 889158547 889896691
493.6H89896691K72453k11478j99437K60532R78053J583278J724482J307845P40468
$$ 889896691 890169144 889957666 889758229 890018761 890996814 892580092 894304574 895612419 896352887
511.9H96352887K83301L1889K91883N05805K14458J5616K11418K72274j94132l80635
$$ 896352887 896636188 896668077 896959960 897465765 897680223 897695839 897907257 898179531 897985399 897604764
532.3H97604764j4842K35915K61784R5188k4795P450k920m0591l01540n87284n26429
$$ 897604764 897589922 897825837 898087621 898182809 898158014 898165464 898162544 898121953 897820413 897233129 896706700
554.8H96706700k88546R358L9399j69277k16902m25815n20885j86861j96874l96609
$$ 896706700 896418154 896427512 896466911 896297634 896080732 895654917 895134032 894947171 894750297 894353688
575.2H94353688k96414k52426k71320k19643l50952n37098n90920p21753p52389p03752
$$ 894353688 894057274 893804848 893533528 893313885 892962933 892425835 891834915 891113162 890360773 889657021
595.6H89657021o14703l41475k66671m32194o37769q44777q78453n50032j78695j73568
$$ 889657021 889042318 888700843 888434172 888001978 887364209 886519432 885640979 885090947 884912252 884738684
616H84738684m37260o74903o56963n26190n08010n66065n56886n32270m20213l21150
$$ 884738684 884301424 883626521 882969558 882443368 881935358 881369293 880812407 880280137 879859924 879538774
636.4H79538774m27663m64082m80175m72962k97010l33727n75304n47826n05269o99937
$$ 879538774 879111111 878647029 878166854 877693892 877396882 877063155 876487851 875940025 875434756 874734819
656.8H74734819r43840j183271j357138r49204m33624j430988j475930O2227Q15987
$$ 874734819 873790979 872607708 871250570 870301366 869867742 868436754 866960824 867023051 867839038
675.1H67839038N10037m9472l02135l71218n14567o82712q62062j290321j904011k541661
$$ 867839038 868349075 868299603 867997468 867626250 867111683 866428971 865566909 864276588 862372577 859830916
695.5H59830916l287733m038810m952848o563604r048462j2620986j8169880k7260601
$$ 859830916 856543183 852504373 847551525 840987921 831939459 819318473 801148593 773887992
711.8G73887992m5292556p7774167r2806220l8007796M3179929N7596147J1811972
$$ 773887992 728595436 650821269 558015049 520007253 563187182 620783329 632595301
726.1F32595301k9043019n611181O3748359Q6771786N3519309K3096561J1397422P203579
$$ 632595301 603552282 597941101 661689460 748461246 801980555 825077116 836474538 843678117
742.4H43678117N299091M129172L292679K797604K379537J912772J539767J265287
$$ 843678117 848977208 853106380 856399059 859196663 861576200 863488972 865028739 866294026
758.7H66294026R57191O61075M67241M49002O16133O96659P27415O97375N32567M47989
$$ 866294026 867251217 867912292 868379533 868828535 869444668 870141327 870868742 871566117 872098684 872546673
779.1H72546673N78880P48694P70986O35266M97103L52383J33812J30415K69056K53558
$$ 872546673 873125553 873874247 874645233 875280499 875777602 876129985 876263797 876394212 876663268 876916826
799.5H76916826J26421K2590M5538J94133K92420L34561L18646J22249j06453j85669
$$ 876916826 877043247 877065837 877111375 877305508 877597928 877932489 878251135 878373384 878266931 878081262
819.9H78081262j30474j03355j32501j57237j94609k13444k62678m49538o46651o37949
$$ 878081262 877950788 877847433 877714932 877557695 877363086 877149642 876886964 876437426 875790775 875152826
840.3H75152826n33998n79953o68704n33700l48509m01675n79477o11961n19097n33938
$$ 875152826 874618828 874038875 873370171 872836471 872487962 872086287 871506810 870894849 870375752 869841814
860.7H69841814o90103r42111j382648k106548k885282l086924k188743n51164N53251
$$ 869841814 869151711 868209600 866826952 864720404 861835122 858748198 856559455 856008291 856561542
879.1H56561542N51521L49760M61877N84304Q04961J036942R27329O62267M72009K01285
$$ 856561542 857113063 857462823 857924700 858509004 859313965 860350907 861278236 861940503 862412512 862613797
899.5H62613797j89364o16967j040519j025438k30074O96659R44495N69880N1618k75970
$$ 862613797 862424433 861807466 860766947 859741509 859511435 860208094 861152589 861722469 861774087 861498117
919.9H61498117l56912l62277m32253n26309n61953m63783k77639k16067k23458j35004
$$ 861498117 861141205 860778928 860346675 859820366 859258413 858794630 858516991 858300924 858077466 857942462
940.3H57942462n3465m6432o9142j03891j80423k77758l43084m84765p11202q46684
$$ 857942462 857888997 857842565 857773423 857669532 857489109 857211351 856868267 856383502 855672300 854825616
960.7H54825616q38995o80924m11748j80722J0610J44482P6234j06037l02851n16891
$$ 854825616 853986621 853305697 852893949 852713227 852723837 852868319 852944553 852838516 852535665 852018774
981.1H52018774o51479p06554o96122n95510m50611l18408k91348m44174p67529j125514
$$ 852018774 851367295 850660741 849964619 849369109 848918498 848600090 848308742 847864568 847097039 845971525
1001.4H45971525j433313j835466k407193l129005l881634m203319l627300k109647
$$ 845971525 844538212 842702746 840295553 837166548 833284914 829081595 825454295 823344648
1017.8H23344648j53959J445472K223134K308548K097487J765132J318932Q49664M23014
$$ 823344648 823190689 824636161 826859295 829167843 831265330 833030462 834349394 835199058 835622072
1036.1H35622072J02937k1934O974l5704k89082m50611j02699M16875L73661q7201
$$ 835622072 835725009 835703075 835710049 835674345 835385263 834934652 834831953 835248828 835622489 835535288
1056.5H35535288l83437m34518l52502j98245j23143k08020k76446j55628J25170L96847
$$ 835535288 835151851 834717333 834364831 834166586 834043443 833835423 833558977 833403349 833528519 833925366
1076.9H33925366N81086P53403R17077R31859P34031N00858L25143R5904k12014m31895
$$ 833925366 834506452 835259855 836176932 837108791 837842822 838343680 838668823 838764727 838552713 838120818
1097.3H38120818l67462j11104J1147r8408k84254m96865p40409q63075p76887n77628
$$ 838120818 837753356 837642252 837653399 837554991 837270737 836773872 836033463 835170388 834393501 833815873
1117.7H33815873l07024L3319L50058N69761P46012R52005J105189J083017R31084
$$ 833815873 833508849 833542168 833892226 834461987 835207999 836160004 837265193 838348210 839279294
1136.1H39279294P46608N06222J75476j82509n84603j082062j508415j761317j955331
$$ 839279294 840025902 840532124 840707600 840525091 839940488 838858426 837350011 835588694 833633363
1154.4H33633363k101719k169907k193392k127587j919031j582742j227856j059711
$$ 833633363 831531644 829361737 827168345 825040758 823121727 821538985 820311129 819251418
1170.7H19251418j181900j433850j290023l66330J006484K372742L452777L728807
$$ 819251418 818069518 816635668 815345645 814979315 815985799 818358541 821811318 825540125
1187.1H25540125K669096M87626j674891k447545j246035R72271K504766K662003J960873
$$ 825540125 828209221 828696847 827021956 824574411 823328376 824300647 826805413 829467416 831428289
1205.4H31428289R92299j00852j164376j707316j677751j654804j383662k63989Q67903
$$ 831428289 832420588 832319736 831155360 829448044 827770293 826115489 824731827 824467838 825335741
1223.8H25335741R30905J61946p98046j725018k280951k090633j605630j514256j395583
$$ 825335741 826266646 826428592 825630546 823905528 821624577 819533944 817928314 816414058 815018475
1242.1H15018475n25236O46591J139581O83189j56939n60224l15309j11222n60939
$$ 815018475 814493239 815139830 816279411 816962600 816805661 816245437 815930128 815818906 815257967
1260.5H15257967j362861j572370q17538J05799M25040L63052M41730N19097K01047
$$ 815257967 813895106 812322736 811505198 811610997 812036037 812399089 812840819 813359916 813560963
1278.8H13560963n25117j342774j834631j656949j040340p02738p61450q25524p23898
$$ 813560963 813035846 811693072 809858441 808201492 807161152 806458414 805696964 804871440 804147542
1297.2H04147542n44787l66151k41697j13487K87413J112521K128005K854288K998590
$$ 804147542 803602755 803236604 802994907 802881420 803168833 804281354 806409359 809263647 812262237
1315.6H12262237K742469K429009J968741J222968L72053k94447o66440r97603j708984
$$ 812262237 815004706 817433715 819402456 820625424 820997477 820703030 820036590 819038987 817330003
1333.9H17330003k919257m018009m152059l526390l339290l757358l989696l446460
$$ 817330003 814410746 810392737 806240678 802714288 799374998 795617640 791627944 788181484
1350.2G88181484k103210o87301l26991j495421l499269n563856o748557o288051m049003
$$ 788181484 786078274 785390973 785063982 783568561 780069292 774505436 767756879 761468828 757419825
1368.6G57419825j497627k334714o331741n093873N814612J7201066J8940210J3080895
$$ 757419825 755922198 753587484 747255743 742161870 747976482 765177548 784117758 797198653
1384.9G97198653P083476L461540J539111N42521J18315M828j19090l77893r44734
$$ 797198653 804282129 807743669 809282780 809825301 809943616 809948444 809829354 809451461 808506727
1403.3H08506727j588762k109825k600372k961040k923190k705395k752304l022671
$$ 808506727 806917965 804808140 802207768 799246728 796323538 793618143 790865839 787843168
1419.6G87843168l431142m882454p484079j0502577j3826787j5262067j4224291j3516188
$$ 787843168 784412026 779529572 772045493 761542916 747716129 732454062 718229771 704713583
1435.9G04713583j2164772r540855q579731q816600j0181308j4215231k1082044k9126882
$$ 704713583 692548811 683007956 674428225 665611625 655430317 641215086 620133042 591006160
1452.2E91006160l4755647m2420805o1958104p8773320o3144982j0268301L0709833
$$ 591006160 556250513 513829708 451871604 373098284 309953302 299685001 330394834
1466.5C30394834K3146689r56774J7489046J04366362J42574609R6322536M4902325
$$ 330394834 353541523 352584749 370073795 474440157 617014766 713337302 758239627
1480.8G58239627K1602511J2362659Q080960O231725N247831M119754L190696L093720
$$ 758239627 779842138 792204797 800285757 806517482 811765313 815885067 819075763 822169483
1497.1H22169483L078758K634824J890838J399577J784324K074421J695692J268029
$$ 822169483 825248241 827883065 829773903 831173480 832957804 835032225 836727917 837995946
1513.4H37995946R64404Q52406P66217Q07584R90927Q85010P97093O84022L72470K85268
$$ 837995946 838960350 839812756 840578973 841386557 842377484 843262494 844059587 844743609 845116079 845401347
1533.8H45401347L52204M1544j92344K93731P04647P66038N81682L57032K04086K7836
$$ 845401347 845753551 845795095 845602751 845896482 846601129 847367167 847948849 848305881 848509967 848537803
1554.2H48537803k46585k70605O78301J028061N61893K28822J06454K40445L19004
$$ 848537803 848291218 848020613 848698914 849726975 850288868 850517690 850624144 850864589 851183593
1572.6H51183593K7001k8133K42412K50280K54094L71099L82423L22402L22878L20554
$$ 851183593 851210594 851182461 851424873 851675153 851929247 852300346 852682769 853005171 853328049 853648603
1593H53648603K72930K05278J53065J71184K83480L49045L17752K94149K64883J24633
$$ 853648603 853921533 854126811 854279876 854451060 854734540 855083585 855401337 855695486 855960369 856085002
1613.4H56085002q3029Q2493L46422J63794N6565J75893J64151J65403O3598l37958
$$ 856085002 856001973 856084466 856430888 856594682 856651247 856827140 856991291 857156694 857220292 856882334
1633.7H56882334m72307j2100K02596J51813Q1778J19745N03779M72486P331L77178
$$ 856882334 856410027 856397927 856600523 856752336 856834114 856953859 857457638 857930124 857937455 858314633
1654.1H58314633R22263N41747M3571r2924Q1658L5465k72214k36094l5346j01268
$$ 858314633 859236896 859778643 859822214 859729290 859810948 859846413 859574199 859338105 859302759 859201491
1674.5H59201491m1127k2829m03643q42809o66321p2896j60515n73814r90927j609147
$$ 859201491 859160364 859137535 858733892 857891083 857224762 857151866 856991351 856417537 855426610 853817463
1694.9H53817463j832485j761854j778364j489461j794815k347827k551674k879501
$$ 853817463 851984978 850223124 848444760 846955299 845160484 842812657 840260983 837381482
1711.3H37381482l296614l774285m194438l564060k697408k790273l432571m471898
$$ 837381482 834084868 830310583 826116145 822552085 819854677 817064404 813631833 809159935
1727.6H09159935n404830n411327m959643l122270p81119J039326L202915N507171
$$ 809159935 803755105 798343778 793384135 790261865 789480746 790520072 793722987 799230158
1743.9G99230158Q092225J0554910J1653065J0171652O931365M487514L121674K132535
$$ 799230158 807322383 817877293 829530358 839702010 846633375 851120889 854242563 856375098
1760.2H56375098J612962J276850R08196O40691M53054M21644O06298O19054L69906
$$ 856375098 857988060 859264910 860173106 860813797 861266851 861688495 862294793 862913847 863283753
1778.6H63283753J91808J78456J71006R4414j13785l97146k76148J45197J93715P2062
$$ 863283753 863475561 863654017 863825023 863919437 863805652 863408506 863132358 863277555 863471270 863543332
1799H63543332K10225M36962M20451K33352N3644K6405Q3983O8903N3942J46926K47359
$$ 863543332 863753557 864190519 864610970 864844322 864897966 864924371 865008354 865077257 865131199 865278125 865525484
1821.4H65525484K93672L79622L91007L33428M03166L89159K04265J39475J54018n663
$$ 865525484 865819156 866198778 866589785 866923213 867326379 867715538 867919803 868059278 868213296 868207633
1841.8H68207633j09016J33633K80142J89960J07646L5286j2219j5140K0385J2636
$$ 868207633 868098617 868232250 868512392 868702352 868809998 868845284 868833065 868817925 868838310 868850946
1862.2H68850946p8260j93060k09808k8849R0838j5974j41383j45077j52052k67565
$$ 868850946 868772686 868579626 868369818 868340969 868431807 868415833 868274450 868129373 867977321 867709756
1882.6H67709756m34339o27101q81910r72390p68066m58300j11162J76131L42667M39346
$$ 867709756 867275417 866648316 865766406 864794016 864025950 863567650 863456488 863632619 863975286 864414632
1903H64414632M60148M01259L40402L13937K90692J92941O0379P7903J48177J25647
$$ 864414632 864874780 865276039 865616441 865930378 866221070 866414011 866474390 866552293 866700470 866826117
1923.4H66826117R5308P6413K5392m709J3709O676k5511o3896r1613k4438M8876K9981
$$ 866826117 866921425 866997838 867023230 867018521 867032230 867038906 867013395 866949499 866857886 866833448 866882324 866912305
1947.9H66912305l397n6625j15990j00851m7863k8014j7822K027J4424L5465M6372
$$ 866912305 866908908 866852283 866736293 866635442 866587579 866559565 866541743 866543770 866558194 866593659 866640031
1970.3H66640031k443n3883l8028j6749l5763p0214j14560j48475j56999j75416j64211
$$ 866640031 866637588 866583705 866545677 866528928 866493165 866422951 866308391 866159916 866002917 865827501 865663290
1992.7H65663290j09196j34766k45154l65615n03361o60777q25763j085102j449764
$$ 865663290 865554094 865419328 865174174 864808559 864305198 863644421 862818658 861733556 860283792
2011.1H60283792j704812j569510r76800k59638K81274O27697P60853P18057O35326
$$ 860283792 858578980 857009470 856032670 855773032 856054306 856682003 857442856 858160913 858796239
2029.4H58796239N77390N25057M60506L92318L55899L91483M37081M04656L41833K94089
$$ 858796239 859373629 859898686 860359192 860751510 861107409 861498892 861935973 862340629 862682462 862976551
2049.8H62976551K50340K58982L00288K85387K28524J72436J46747J86741K22981J66119
$$ 862976551 863226891 863485873 863786161 864071548 864300072 864472508 864619255 864805996 865028977 865195096
2070.2H65195096J07586J26123J41144J37091J66654J93656J58846R9421R6083J32918
$$ 865195096 865302682 865428805 865569949 865707040 865873694 866067350 866226196 866325617 866421700 866554618
2090.6H66554618J35302J21534J31846J10268N5611M2916N3108L7908K7836L5762K8193
$$ 866554618 866689920 866811454 866943300 867053568 867109179 867152095 867205203 867243111 867270947 867306709 867334902
2113.1H67334902N424%l4630j17779j18911m3213n9665j59025j80721j72973k87473
$$ 867334902 867340326 867340326 867305696 867187917 867069006 867025793 866966128 866807103 866626382 866453409 866165936
2135.5H66165936m07457l98338l48091l15249k76566j93596m4107N6565P6890Q3208
$$ 866165936 865758479 865360141 865012050 864696801 864420235 864226639 864182532 864239097 864315987 864399195
2155.9H64399195Q7797J43290J97291J53840P6771K5391N424j4126o2227j01686j26600
$$ 864399195 864486992 864630282 864827573 864981413 865058184 865083575 865088999 865074873 865012646 864910960 864784360
2178.3H64784360j26243r8109n8472j4424p868j3590k2113k8849L695K2412j9610p8261
$$ 864784360 864658117 864560008 864501536 864487112 864479244 864465654 864443541 864414692 864418387 864440799 864421189 864342928
2202.8H64342928p1585l5107o2108j31309j71185j62244j56224j73688j35719l0697
$$ 864342928 864271343 864236236 864174128 864042819 863871634 863709390 863553166 863379478 863243759 863213062
2223.2H63213062K6822k4020r9480j25528k13504m02927n16772m97520m01855k30968
$$ 863213062 863239884 863215864 863116384 862990856 862777352 862374425 861857653 861360133 860958278 860727310
2243.6H60727310m3392N3227M4644K38j9788l9220q5354r8884j07587j66595k56896
$$ 860727310 860683918 860737145 860781789 860782027 860762239 860723019 860637665 860538781 860431194 860264599 860007703
2266H60007703l69668m31537m27187l99589l13461k04921j34230r3042m5896R656K9385
$$ 860007703 859638035 859206498 858779311 858379722 858066261 857861340 857727110 857634068 857588172 857597828 857627213
2288.5H57627213J2100l2842p3195n5432k8491m5717n5313M053Q5235R9301M4763n4121
$$ 857627213 857639313 857606471 857533276 857477844 857449353 857403636 857348323 857352376 857437611 857536912 857581675 857527554
2312.9H57527554j03712J0490J33932O0439o9022m2141J10686K35737K00092J93716
$$ 857527554 857423842 857434332 857568264 857628703 857559681 857517540 857628226 857863963 858064055 858257771
2333.3H58257771L17931L42250L31997K96772l3200n32806k76983Q69513J996577K395749
$$ 858257771 858575702 858917952 859249949 859546721 859513521 858980715 858703732 859573245 861569822 863965571
2353.7H63965571K089858J571417R43661M08768P1168l57210q09312j019836j004875
$$ 863965571 866055429 867626846 868570507 868979275 869050443 868693233 867883921 866864085 865859210
2372.1H65859210r30368r43840r76562r43363q11756n60880l24189j92464j22010p6652
$$ 865859210 864928842 863985002 863008440 862065077 861253321 860692441 860368252 860175788 860053778 859977126
2392.5H59977126n6386n4180o0857j12593j53840j48713j83702k57551l00050k89440
$$ 859977126 859920740 859866560 859805703 859693110 859539270 859390557 859206855 858949304 858649254 858359814
2412.9H58359814k42472j36077L9160J79469K62559L01003K16186R2268M5717M8220
$$ 858359814 858117342 857981265 858020425 858199894 858462453 858763456 858979642 859071910 859117627 859165847
2433.3H59165847O2108N0485J4186j1384l0518p7486j07765j00434j19626j50979j66237
$$ 859165847 859227955 859278440 859292626 859281242 859250724 859173238 859065473 858965039 858845413 858694434 858528197
2455.7H58528197j85490k08556k50876l11137l75449n22912o97791o82712m35054j64152
$$ 858528197 858342707 858134151 857883275 857572138 857196689 856673777 855975986 855293274 854858220 854694068
2476.1H54694068p2836r9242j37985j87039k25663k30015k50041l20196l56496l47316
$$ 854694068 854621232 854521990 854384005 854196966 853971303 853741288 853491247 853171051 852814555 852467239
2496.5H52467239l47316l30210l22521l55184l76701l90232m43637n01454n05388n49257
$$ 852467239 852119923 851789713 851467192 851112008 850735307 850345075 849901438 849399984 848894596 848345339
2516.9H48345339p06315q20994p59602n85675l52144l5286K32518L25739TK38717m3869
$$ 848345339 847639024 846818030 846058428 845472753 845120609 845085323 845317841 845643580 845969319 846208036 846164167
2539.3H46164167m57823p45237p74145o50525m92514l24607k09808k37882l14832l11553
$$ 846164167 845706344 844961107 844186962 843536437 843043923 842719316 842509508 842271626 841956794 841645241
2559.7H41645241l27111m20689m76658n06878n81265o34014o43790o93619p45416p49529
$$ 841645241 841318130 840897441 840420783 839913905 839332640 838698626 838054836 837361217 836615801 835866272
2580.1H35866272q11696r05215r42171r69768r95993j005232r92001r19640q42452
$$ 835866272 835054576 834149361 833207190 832237422 831241429 830236197 829244196 828324556 827482104
2598.5H27482104q50498r13978r86874j049757j118481j248658j390815j445472j411021
$$ 827482104 826631606 825717628 824730754 823680997 822562516 821313858 819923043 818477571 817066550
2616.8H17066550j396954j490354j637578j739085j749039j682102j551271j262963
$$ 817066550 815669596 814179242 812541664 810802579 809053540 807371438 805820167 804557204
2633.2H04557204p97510l18527L8981K22266K35200J04845j42992m23431n71669n82814
$$ 804557204 803759694 803441167 803480148 803702414 803937614 804042459 803899467 803476036 802904367 802321553
2653.5H02321553o01351n78344m46796k90811j53065j3292J48833L51727N61952O66500
$$ 802321553 801720202 801141858 800695062 800404251 800251186 800237894 800386727 800738454 801300406 801966906
2673.9H01966906O55174O15060N77331N27322M74930M87029N76497O26444N62549M12583
$$ 801966906 802622080 803237140 803814471 804341793 804816723 805303752 805880249 806506693 807069242 807481825
2694.3H07481825J75178j40667m25458n96165p33018q62837q83996q34108q29041q53240
$$ 807481825 807657003 807516336 807090878 806494713 805761695 804898858 804014862 803180754 802351713 801498473
2714.7H01498473q57234q81791r64642j078904j223683j307309j161873q51870n77151
$$ 801498473 800641239 799759448 798794806 797715902 796492219 795184910 794023037 793171167 792594016
2733.1G92594016m17054l49462k49982l3200J57953K02178R0600j73033m68850p13527
$$ 792594016 792176962 791827500 791577518 791544318 791702271 791904449 791995049 791822016 791353166 790639639
2753.5G90639639r46045j183867j388193j493454j555919j720071j964569k162039
$$ 790639639 789693594 788509727 787121534 785628080 784072161 782352090 780387521 778225482
2769.8G78225482k336920k629041l070593l545642l931165m258871m629850m951358
$$ 778225482 775888562 773259521 770188928 766643286 762712121 758453250 753823400 748872042
2786.1G48872042n220950n590677n947590o154239o267011o455720o776929p060706
$$ 748872042 743651092 738060415 732112825 725958586 719691575 713235855 706458926 699398220
2802.4F99398220p310927p653356q099139q748710r624302j0570824j1623443j2945473
$$ 699398220 692087293 684433937 676334798 667586088 657961786 647390962 635767519 622822046
2818.8F22822046j4620244j6680420j9208729k2337258k6251435l1418771l8563400
$$ 622822046 608201802 591521382 572312653 549975395 523723960 492305189 453741789
2833D53741789m8070818n9314192p0468306p7447236p4196011n8108963l4406833j2257617
$$ 453741789 405670971 346356779 275888473 198441237 124245226 66136263 31729430 19471813
2849.3A9471813L186662J3218891K1454613K9893078L7812583M2694226M2102352L5483137
$$ 19471813 22658475 35877366 57331979 87225057 125037640 167731866 209834218 245317355
2865.7B45317355K5173947J5226096P932395J992911m680127j1826366j7742724k1411225
$$ 245317355 270491302 285717398 293649793 295642704 290962577 279136211 261393487 239982262
2882B39982262k2903532k2745460k1448523j9414916j6934261j4398329j2307756j0832361
$$ 239982262 217078730 194333270 172884747 153469831 136535570 122137241 109829485 98997124
2898.3I8997124r882637r555958r954415j0936536j1967976j2179255j0908833q152408
$$ 98997124 89114487 79558529 69604114 58667578 46699602 34520347 23611514 15459106
2914.6A5459106m616541j361616R43907K560606M025461N664889P728108J0484054
$$ 15459106 10842565 9480949 10424856 12985462 17010923 22675812 30403920 40887974
2930.9D0887974J4193021J8874086K4497040L0839250L6764532M0250167L9469078
$$ 40887974 55080995 73955081 98452121 129291371 166055903 206306070 245775148
2945.2B45775148L3915594K5375039J7552525J3452440J3574600J6601980K1003664
$$ 245775148 279690742 305065781 322618306 336070746 349645346 366247326 387250990
2959.5C87250990K5795012L0323178L3956855L5854280L5513580L3382297L0149877
$$ 387250990 413046002 443369180 477326035 513180315 548693895 582076192 612226069
2973.8F12226069K6312232K2464097J8945872J5754104J3124108J1209965R699404
$$ 612226069 638538301 661002398 679948270 695702374 708826482 720036447 729735851
2988G29735851Q436144P385373O347894N363524M601479M113734L866672L662169L427506
$$ 729735851 738171995 745557368 751905262 757268786 761870265 765983999 769850671 773512840 776940346
3006.4G76940346L246128L031850K657414K176225J812219J690567J670957J690030
$$ 776940346 780186474 783218324 785875738 788051963 789864182 791554749 793225706 794915736
3022.7G94915736J747489J732111J742482J897633K003789J900792J860857K112448
$$ 794915736 796663225 798395336 800137818 802035451 804039240 805940032 807800889 809913337
3039H09913337K271116K036452J674712J556337J595259J428842J181364J077891R66429
$$ 809913337 812184453 814220905 815895617 817451954 819047213 820476055 821657419 822735310 823701739
3057.4H23701739Q36969Q63313J007736J034618Q01563N36442N30064P30693R66370
$$ 823701739 824538708 825402021 826409757 827444375 828245938 828782380 829312444 830043137 831009507
3075.7H31009507R49562O84201O57857Q30650R11296J082301J298845J380145J517594
$$ 831009507 831959069 832643270 833301127 834131777 835043073 836125374 837424219 838804364 840321958
3094.1H40321958J676977J620054J355827J039922Q98361R30906Q19742N74947O17265
$$ 840321958 841998935 843618989 844974816 846014738 846913099 847844005 848663747 849238694 849855959
3112.4H49855959Q42870P76350N00739J91927j20580j12176K15232L27051J40965M0829
$$ 849855959 850698829 851475179 851975918 852167845 852047265 851935089 852150321 852477372 852618337 852659166
3132.8H52659166J47283L48628L30924j1503j97351j17660k1398J86086L36230J38402
$$ 852659166 852806449 853155077 853486001 853474498 853277147 853159487 853138089 853324175 853660405 853798807
3153.2H53798807r3758j24515j18434o1214N0545R3102L9518l6418n9009q2791p7665
$$ 853798807 853705049 853580534 853462100 853400886 853451431 853544533 853584051 853547633 853488624 853405833 853328168
3175.7H53328168M530M4287l0339j00315o5028J7166N7399P749k0147p868l3855j8597
$$ 853328168 853332698 853376985 853346646 853246331 853181303 853198469 853255868 853263617 853243470 853235602 853201747 853183150
3200.1H53183150M2081Q3327L7790j9789J1563R835l3438j8954Q165O199j5139p4327
$$ 853183150 853225231 853308558 853346348 853326559 853338122 853347957 853314519 853295565 853303730 853309929 853294790 853220463
3224.6H53220463j14680n6386J16647J64628q8513k48373j55806r8229j08778l1233
$$ 853220463 853105783 853049397 853166044 853330672 853242159 852993786 852837980 852739751 852630973 852599740
3245H52599740Q94j85668k86103j87099j42395j61111j32978j11104j70886k16126
$$ 852599740 852600634 852414966 852128863 851941764 851799369 851638258 851505280 851394176 851223290 851007164
3265.4H51007164p2361J28985N782k72930l51191l28302k42472j32322n8115k9206
$$ 851007164 850934803 851063788 851069570 850796640 850445449 850117147 849874675 849742353 849684238 849655032
3285.8H49655032j02162k8491J22249p6711l63946l69966k30789O258K76864J93119
$$ 849655032 849552870 849524379 849646628 849569917 849205971 848836005 848605216 848611474 848888338 849081457
3306.2H49081457k14756n28097n78523l82900j74940j27255j25409m9472k8550k07186
$$ 849081457 848866701 848338604 847760081 847377181 847202241 847074986 846949577 846900105 846871555 846664369
3326.6H46664369l19600j97828p2479k8670L8564J6094j26481k32161k85387j93655
$$ 846664369 846344769 846146941 846074462 846045792 846084356 846100450 845973969 845741808 845456421 845262766
3347H45262766K6464J9610k45571l70622k43961q8871p0631j01746N5135K54631J08838
$$ 845262766 845289230 845308840 845063269 844692647 844448686 844359815 844289184 844187438 844242573 844497204 844606042
3369.4H44606042k19584k43604k4736Q8275R9897J12057J09732J06514K35140M76718
$$ 844606042 844386458 844142854 844118118 844206393 844306290 844418347 844528079 844634593 844869733 845346451
3389.8H45346451L52263q8215r9003L05951M23789o378l16381j4067K91943K19882
$$ 845346451 845698714 845610499 845511496 845817447 846241236 846234858 845918477 845904410 846196353 846416235
3410.2H46416235N6565o6757j14918j8597R8586R5606R0361K08080L11613K11239J28924
$$ 846416235 846472800 846406043 846291125 846272528 846371114 846466720 846557081 846765161 847076774 847288013 847416937
3432.7H47416937K47598K32220Q583n5492J01387J91927J73509J93894K40505K48611
$$ 847416937 847664535 847896755 847905338 847849846 847951233 848143160 848316669 848510563 848751068 848999679
3453.1H48999679K21253K38359K69472K30432K92956N17607N93961L50952Q4102J04129
$$ 848999679 849220932 849459291 849728763 849959195 850252151 850769758 851363719 851714671 851798773 851902902
3473.4H51902902K45750K37465J45614J61469K93434L36110K36273J91093K23696K35557
$$ 851902902 852148652 852386117 852531731 852693200 852986634 853322744 853559017 853750110 853973806 854209363
3493.8H54209363K47837K13384J42932J00315J6510n781J03116K03013K20418J62721
$$ 854209363 854457200 854670584 854813516 854913831 854930341 854924560 855027676 855230689 855451107 855613828
3514.2H55613828J13368J03712J74403K61366Q2970j43886J2577K73347L19421K68042
$$ 855613828 855727196 855830908 856005311 856266677 856349647 856205761 856218338 856491685 856811106 857079148
3534.6H57079148J54555L7551P9453J35481j847j33157r3758p2897l9458J11818J71662
$$ 857079148 857233703 857271254 857350707 857486188 857484341 857351184 857257426 857184529 857145071 857256889 857428551
3557.1H57428551O7591m6312j82093l17096j24038L13759L37780M232j90556j74642
$$ 857428551 857496142 857449830 857267737 856950641 856826603 857140362 857478142 857482374 857291818 857117176
3577.5H57117176p9870J0848o9738n08844j001954r51708q95679j365125j838028k018035
$$ 857117176 857037306 857048154 856978416 856469572 855467618 854515910 853620231 852255106 850417078 848399043
3597.9H48399043k006173j513064o27756L7491N42820J087427J376629J408040J216173
$$ 848399043 846392870 844879806 844252050 844289541 844832361 845919788 847296417 848704457 849920630
3616.2H49920630Q44121O98567O86824M14014j35541o41048k87175K09928l4154k92838
$$ 849920630 850764751 851463318 852150142 852564156 852428615 851787567 851500392 851710320 851676166 851383328
3636.6H51383328l03745l17991k23338p2181p4447k741M79221Q18372O86228O20365
$$ 851383328 851079583 850761592 850538254 850466073 850391626 850388885 850868106 851686478 852372706 852993071
3657H52993071O71566M07338P6771l6121j28567k52843j12772j8239j56879K76565
$$ 852993071 853664637 854071975 854148746 854112625 853984058 853731215 853618443 853600204 853443325 853719890
3677.4H53719890Q06213O68108K80738N6207o2227j69099n96L12746M00186K58863
$$ 853719890 854526103 855194211 855474949 855531156 855468929 855299830 855299234 855611980 856012166 856271029
3697.8H56271029J1980j30296L0935J83642k7001l40402j59860M27544N92590L39925
$$ 856271029 856283009 856152713 856183648 856367290 856340289 855999887 855840027 856267571 856860161 857200086
3718.2H57200086J16110r477o3420K6584J44839l5047m21167m25696M0949K63452l1412
$$ 857200086 857316196 857306719 857243299 857269883 857414722 857379675 856958508 856532812 856573761 856837213 856805801
3740.6H56805801n96582p85172j61350L5763r3043L18885N75661L31521j3470o5506
$$ 856805801 856209219 855424047 855262697 855298460 855205417 855524302 856099963 856431484 856418014 856352508
3761H56352508k2232j77920k32458r5606J09970K40565J59859m9710k23637k16603
$$ 856352508 856330276 856152356 855919898 855824292 855934262 856174827 856334686 856284976 856061339 855844736
3781.4H55844736j91033j59383k3424l5584j67132l08632m54426m00603m56452n41986
$$ 855844736 855653703 855494320 855470896 855435312 855268180 854959548 854505122 854104519 853648067 853106081
3801.8H53106081j83463j83582l36349l7312L57l73125m93944j05261m7326j11640
$$ 853106081 852922618 852739036 852402687 852365375 852365732 851992607 851498663 851393402 851346076 851234436
3822.2H51234436K05457K47836Q6010j3709m0412N36j43468k76744q0526J60277K76148
$$ 851234436 851439893 851687729 851773739 851760030 851719618 851720154 851576686 851299942 851219416 851379693 851655841
3844.6H51655841J80304j69337o56009r98973l46899N37157M69327M3630k82466l94285
$$ 851655841 851836145 851666808 851010799 850011826 849664927 850202084 850671411 850715041 850432575 850038290
3865H50038290l43084m19021l06368N3704J73211O3956j64807j07229O7830j16288
$$ 850038290 849695206 849276185 848969817 849023521 849196732 849260688 849095881 848988652 849056482 848940194
3885.4H48940194j23263k8908j29640o080J22905j48475m42147k85805K9862J85967
$$ 848940194 848816931 848788023 848658383 848652303 848775208 848626733 848184586 847898781 847928643 848114610
3905.8H48114610K36213J44243m3154j89006j83463J6391K43068K36332Q7142O1214
$$ 848114610 848350823 848495066 848451912 848262906 848079443 848095834 848338902 848575234 848662376 848723590
3926.2H48723590N7817O0499K71618M55558K91407M5240L6180J01507M9055l994Q8513
$$ 848723590 848781407 848841906 849113524 849569082 849860489 849905729 849941909 850043416 850092471 850088477 850176990
3948.7H50176990K40743K34842P6056n6803q2672o1393j05142j44482j50680k54274
$$ 850176990 850417733 850652575 850728631 850671828 850589156 850527763 850422621 850278139 850127459 849873185
3969.1H49873185k86221j58012p9274n3525k5332L2305J06633O4492N007P1049Q2314
$$ 849873185 849586964 849428952 849349678 849296153 849270821 849303126 849409759 849474251 849479258 849550307 849632621
3991.5H49632621k0087r2804r9302
$$ 849632621 849612534 849519730 849420428
3997.6H49420428
$$ 849420428
##END=$$ End of the data block
