##TITLE=Ref 13803 - Solado externo $$ Begin of the data block
##JCAMP-DX=5.00 $$ ACD/SpecManager v 10.08
##SPECTROMETER/DATA SYSTEM=Alpha
##DATE=21 Jul 2016 08:26:52
##DATA TYPE=INFRARED SPECTRUM
##DATA CLASS=XYDATA
##ORIGIN=
##OWNER=
##NPOINTS=1765
##FIRSTX=399.76428223
##LASTX=3997.64306641
##MAXX=3997.64306641
##MINX=399.76428223
##MAXY=0.34093499
##MINY=0.03732998
##XFACTOR=1.0000000000
##YFACTOR=1.000000000000000e-9
##FIRSTY=0.06524116
##DELTAX=2.03961372
##XUNITS=1/CM
##YUNITS=ARBITRARY UNITS
##XYDATA=(X++(Y..Y))
$$ plain form
399.8 65241158 64957000 65222338 65819956 66382609 67089655 67730777 67821242 67756251 68113409 68644211
420.2 68644211 68651311 68570435 68992592 69679223 70321903 70649296 70670918 70412837 69872275 69836199 70366435
442.6 70366435 70325382 69766343 69625475 69877647 70159517 70458427 70624918 70564218 70534088 70525199 70530206
465 70530206 70826374 71393363 72017163 72620235 73297895 74000247 74401192 74556515 74779190 75066470
485.4 75066470 75351909 75681366 75991713 76211214 76398879 76475330 76316655 76206625 76456264 76910891
505.8 76910891 77411227 77858463 78126960 78300580 78509994 78880936 79424433 79820745 79836816 79693034
526.2 79693034 79717964 79886243 79974785 79945453 80057696 80358721 80480732 80456667 80603041 80818266 80899872
548.7 80899872 80909543 81129335 81546098 81776068 81859201 82018286 82229823 82511611 82776405 82833387 82706310
$$ packed form
399.8F5241158k84158K65338N97618N62653P07046O41122R0465o4991L57158N30802
420.2F8644211P100q0876M22157O86631O42680L27393K1622k58081n40562l6076N30236
442.6G0366435m1053n59039j40868K52172K81870K98910J66491o0700l0130q889N007
465G0530206K96168N66989O23800O03072O77660P02352M00945J55323K22675K87280
485.4G5066470K85439L29457L10347K19501J87665P6451j58675j10030K49639M54627
505.8G6910891N00336M47236K68497J73620K09414L70942N43497L96312J6071j43782
526.2G9693034K4930J68279Q8542k9332J12243L01025J22011k4065J46374K15225Q1606
548.7H0899872R671K19792M16763K29970Q3133J59085K11537K81788K64794N6982j27077
$$ plain form
571.1 82706310 82507245 82333811 82292713 82301289 82248293 82157455 81955343 81601143 81188530 80614008 79659000
593.5 79659000 78236185 76399401 74350454 72387412 70883647 69913886 69246478 68852805 68780012
611.9 68780012 69021717 69496915 69965653 70277430 70492856 70699252 70917979 71013346 70806764 70383549
632.3 70383549 69989502 69833905 70078202 70684873 71341828 71983173 72749116 73493041 74135445 74879564
652.7 74879564 75868040 76903023 77663645 78046240 77936143 77561185 77600211 77383496 76192506 75294703
673.1 75294703 74946180 74678220 74364252 74021362 73566414 73040135 72539926 72014138 71519613 71208887
693.5 71208887 71025491 70781179 70337012 69593504 68521962 67217261 65422021 62978253 61464664
711.8 61464664 62706128 65643221 67860141 68403281 67463920 65680824 63929915 63204177 64261869
$$ packed form
571.1H2706310j99065j73434m1098Q576n2996r0838k02112l54200m12613n74522r55008
593.5G9659000j422815j836784k048947j963042j503765r69761o67408l93673p2793
611.9F8780012K41705M75198M68738L11777K15426K06396K18727R5367k06582m23215
632.3G0383549l94047j55597K44297O06671O56955O41345P65943P43925O42404P44119
652.7G4879564R88476J034983P60622L82595j10097l74958L9026k16715j190990q97803
673.1G5294703l48523k67960l13968l42890m54948n26279n00209n25788m94525l10726
693.5G1208887j83396k44312m44167p43508j071542j304701j795240k443768j513589
711.8F1464664J241464K937093K216920N43140r39361j783096j750909p25738J057692
$$ plain form
730.2 64261869 66973746 70509188 74003018 76847993 78922622 80569275 82323574 84600657 87399416
748.5 87399416 90339966 92983440 95069088 96546710 97491436 97911268 97795099 97335316 96914515
766.9 96914515 96658915 96441194 96335851 96345566 96307673 96274190 96333459 96424147 96477270 96441329 96296944
789.3 96296944 96050121 95882237 96123055 96826844 97877063 99170230 100467280 101462476 101966694
807.7 101966694 102069080 101992100 101776607 101354703 100688621 99748008 98481148 96894912 95057942
826 95057942 93055867 91161922 89595504 88284388 87120719 85995443 84717825 83099589 80742188
844.4 80742188 77765100 75529359 74441053 73818937 73542215 72883919 71111776 68619981 65824859
862.8 65824859 62673979 58801822 54112263 49754180 47428284 47400348 48686225 50469082 52454572
$$ packed form
730.2F4261869K711877L535442L493830K844975K074629J646653J754299K277083K798759
748.5H7399416K940550K643474K085648J477622R44726M19832j16169m59783m20801
766.9I6914515k55600k17721j05343R715l7893l3483N9269R0688N3123l5941j44385
789.3I6296944k46823j67884K40818P03789J050219J293167J297050R95196N04218
807.7A01966694J02386p6980k15493m21904o66082r40613j266860j586236j836970
826I5057942k002075j893945j566418j311116j163669j125276j277618j618236k357401
844.4H0742188k977088k235741j088306o22116k76722o58296j772143k491795k795122
862.8F5824859l150880l872157m689559m358083k325896k7936J285877J782857J985490
$$ plain form
881.1 52454572 54897323 58061663 61381985 64033121 65833807 66972129 67665257 68116508 68433434
899.5 68433434 68655707 68845958 69049574 69239818 69366537 69428451 69420934 69250390 68880774 68379112
919.9 68379112 67885369 67474835 67072541 66628568 66129617 65588713 65001480 64345129 63687250 63072480
940.3 63072480 62487680 61954647 61447520 60920499 60398903 59915092 59516303 59270721 59174493 59160333
960.7 59160333 59229013 59390593 59550285 59682671 59860062 60102653 60393129 60660422 60851857 61033677
981.1 61033677 61247572 61442304 61586164 61684709 61741609 61787702 61829302 61861090 61889172 61856259 61775599
1003.5 61775599 61674979 61448056 61082911 60645692 60159035 59729036 59508409 59586100 59889488 60248785
1023.9 60248785 60542580 60719162 60864136 60981467 60897954 60641069 60424596 60404301 60619995 60933154
$$ packed form
881.1E2454572K442751L164340L320322K651136J800686J138322O93128M51251L16926
899.5F8433434K22273J90251K03616J90244J26719O1914p517j70544l69616n01662
919.9F8379112m93743m10534m02294m43973m98951n40904n87233o56351o57879o14770
940.3F3072480n84800n33033n07127n27021n21596m83811l98789k45582r6228j4160
960.7E9160333O8680J61580J59692J32386J77391K42591K90476K67293J91435J81820
981.1F1033677K13895J94732J43860R8545N6900M6093M1600L1788K8082l2913q0660
1003.5F1775599j00620k26923l65145m37219m86657m29999k20627P7691L03388L59297
1023.9F0248785K93795J76582J44974J17331q3513k56885k16473k0295K15694L13159
$$ plain form
1044.3 60933154 61177313 61302155 61331805 61315883 61243080 61033525 60604520 59986427 59289370 58529880
1064.7 58529880 57662081 56737047 55992723 55642221 55700019 56090642 56627490 57103813 57465050 57716582
1085.1 57716582 57846390 57902008 57941630 57905018 57750974 57545315 57414871 57483662 57712380 57960011
1105.5 57960011 58090206 58005020 57705529 57228755 56665439 56154229 55752825 55501688 55449042 55571675
1125.9 55571675 55841699 56221236 56597795 56896232 57181891 57552349 58020543 58546185 59089620 59599273
1146.3 59599273 60000341 60236685 60343798 60400661 60384236 60227592 59959318 59699796 59521236 59390496
1166.7 59390496 59280418 59178576 59095807 59058145 59043244 59032459 59000358 58891810 58676802 58386900 58115609
1189.1 58115609 57906568 57729810 57586126 57501294 57486191 57517968 57542630 57529580 57488736 57436485 57372861
$$ packed form
1044.3F0933154K44159J24842K9650j5922p2803k09555m29005o18093o97057p59490
1064.7E8529880q67799r25034p44324l50502N7798L90623N36848M76323L61237K51532
1085.1E7716582J29808N5618L9622l6612j54044k05659j30444O8791K28718K47631
1105.5E7960011J30195q5186k99491m76774n63316n11210m01404k51137n2646J22633
1125.9E5571675K70024L79537L76559K98437K85659L70458M68194N25642N43435N09653
1146.3E9599273M01068K36344J07113N6863j6425j56644k68274k59522j78560j30740
1166.7E9390496j10078j01842q2769l7662j4901j0785l2101j08548k15008k89902k71291
1189.1E8115609k09041j76758j43684q4832j5103L1777K4662j3050m0844n2251o3624
$$ plain form
1211.5 57372861 57276428 57125684 56887858 56515742 56007296 55361666 54618455 53915706 53306773 52760419
1231.9 52760419 52255627 51745109 51226228 50751626 50336320 49952134 49596541 49275029 48922583 48511375
1252.3 48511375 48137400 47895838 47797211 47775533 47746871 47681771 47599100 47520012 47444060 47383089 47351941
1274.8 47351941 47354251 47402065 47465254 47484260 47443125 47378197 47344085 47400720 47601633 47934938 48320681
1297.2 48320681 48684940 48984703 49198966 49334850 49424723 49487382 49491655 49414705 49275417 49105491 48926502
1319.6 48926502 48729144 48524663 48351474 48185728 47982670 47742061 47484580 47283720 47211502 47234036
1340 47234036 47237139 47154538 46984434 46743721 46477936 46218675 45976173 45739058 45478411 45187272 44893064
1362.5 44893064 44580538 44221789 43859027 43486096 43100350 42730529 42347461 41963331 41613027 41281667
$$ packed form
1211.5E7372861r6433j50744k37826l72116n08446o45630p43211p02749o08933n46354
1231.9E2760419n04792n10518n18881m74602m15306l84186l55593l21512l52446m11208
1252.3D8511375l73975k41562r8627k1678k8662o5100q2671p9088p5952o0971l1148
1274.8D7351941K310M7814O3189J9006m1135o4928l4112N6635K00913L33305L85743
1297.2D8320681L64259K99763K14263J35884Q9873O2659M273p6950j39288j69926j78989
1319.6D8926502j97358k04481j73189j65746k03058k40609k57481k00860p2218K2534
1340D7234036L103q2601j70104k40713k65785k59261k42502k37115k60647k91139k94208
1362.5D4893064l12526l58749l62762l72931l85746l69821l83068l84130l50304l31360
$$ plain form
1382.9 41281667 41009940 40855043 40653720 40272072 39887168 39615609 39399758 39202582 38920578 38602266
1403.3 38602266 38391389 38188022 37953969 37773483 37621181 37444465 37373137 37471086 37445236 37336163
1423.7 37336163 37329983 37375804 37454553 37490036 37499540 37802909 38247280 38370252 38408812 38514104 38641676
1446.1 38641676 38838930 39003406 39014485 38992010 39354037 39922077 39995529 39928868 40158026 40484767
1466.5 40484767 40649656 40917657 41491829 41994106 42269461 42516395 42780910 43038510 43273397 43583531
1486.9 43583531 44115957 44698235 44968970 45208514 45800000 46392813 46652347 46733882 47262333 48453219
1507.3 48453219 49100187 49265292 49549095 50055508 50661374 51248465 52004356 52651957 53088024 53567801
1527.7 53567801 53886559 54229897 54801434 55085193 55364441 56408398 57359725 57654217 57822917 58003806
$$ packed form
1382.9D1281667k71727j54897k01323l81648l84904k71559k15851j97176k82004l18312
1403.3C8602266k10877k03367k34053j80486j52302j76716p1328R7949k5850j09073
1423.7C7336163o180M5821P8749L5483R504L03369M44371J22972L8560J05292J27572
1446.1C8641676J97254J64476J1079k2475L62027N68040P3452o6661K29158L26741
1466.5D0484767J64889K68001N74172N02277K75355K46934K64515K57600K34887L10134
1486.9D3583531N32426N82278K70735K39544N91486N92813K59534Q1535N28451J190886
1507.3D8453219O46968J65105K83803N06413O05866N87091P55891O47601M36067M79777
1527.7E3567801L18758L43338N71537K83759K79248J043957R51327K94492J68700J80889
$$ plain form
1548.1 58003806 58269911 58528695 58656532 58781344 59636272 60721792 60689460 60435150 60457010 60696039
1568.5 60696039 60997333 60897522 60784061 61127394 61312880 61366882 61714575 62211026 62681064 63079186
1588.9 63079186 63372158 63567415 63670523 63758157 63980728 64393625 64955808 65546706 66065855 66509642
1609.3 66509642 66846788 67058869 67534983 68404734 68855323 69083825 69665603 70275925 70740290 71129762
1629.7 71129762 71297646 71607202 72530255 73291525 73487826 73597237 73863171 74613065 75399622 75474210
1650.1 75474210 75966269 77378295 77812172 77656232 77771157 78239202 78654282 78723095 78891702 79264969
1670.5 79264969 79377525 79427399 79513647 79332843 79003766 78967713 79473875 79650864 79326272 78918569
1690.9 78918569 78343458 77705353 76919317 75752608 74234739 72288565 69983765 67469887 64892866
$$ packed form
1548.1E8003806K66105K58784J27837J24812Q54928J085520l2332k54310K1860K39029
1568.5F0696039L01294r9811j13461L43333J85486N4002L47693M96451M70038L98122
1588.9F3079186K92972J95257J03108Q7634K22571M12897N62183N90898N19149M43787
1609.3F6509642L37146K12081M76114Q69751M50589K28502N81778O10322M64365L89472
1629.7G1129762J67884L09556R23053P61270J96301J09411K65934P49894P86557P4588
1650.1G5474210M92059J412026M33877j55940J14925M68045M15080O8813J68607L73267
1670.5G9264969J12556M9874Q6248j80804l29077l6053N06162J76989l24592m07703
1690.9G8918569n75111o38105p86036j166709j517869j946174k304800k513878k577021
$$ plain form
1709.2 64892866 62393576 60141925 58333497 57203002 56487240 55841848 55488128 55533528 55857982
1727.6 55857982 56392789 57216857 58943193 61124559 62947057 65377079 68670504 72379366 76594517
1745.9 76594517 81403412 86970404 92699401 97496688 101663359 105517410 108856909 111979626
1762.2 111979626 114607275 116687380 118632719 120457269 122280881 123835698 124750994 125186890 125173509
1780.6 125173509 124329120 122075826 117749758 111095674 103050947 96386567 93079306 92167825 93384698
1799 93384698 97305045 102742590 107555769 110813849 112628691 113473542 113894537 114338472 115001611
1817.3 115001611 115880370 117012680 118722253 121455438 125318870 130514652 136604115 142481416
1833.6 142481416 147979721 153169721 157820761 161921337 166008562 170061097 173601955 176794440
$$ packed form
1709.2F4892866k499290k251651j808428j130495p15762o45392l53720M5400L24454
1727.6E5857982N34807Q24068J726336K181366J822498K430022L293425L708862M215151
1745.9G6594517M808895N566992N728997M797287M166671L854051L339499L122717
1762.2A11979626K627649K080105J945339J824550J823612J554817R15296M35896j3381
1780.6A25173509q44389k253294m326068o654084q044727o664380l307261r11481J216873
1799I3384698L920347N437545M813179L258080J814842Q44851M20995M43935O63139
1817.3A15001611Q78759J132310J709573K733185L863432N195782O089463N877301
1833.6A42481416N498305N190000M651040M100576M087225M052535L540858L192485
$$ plain form
1850 176794440 179786921 182598919 185252771 187722683 190068617 192322195 194433004 196431786 198508576
1868.3 198508576 200703651 202778995 204737723 206661984 208535388 210378334 212252647 214160487
1884.6 214160487 215987191 217758328 219590500 221452713 223298773 225147218 226968840 228767097
1900.9 228767097 230531707 232268468 234025046 235765681 237442300 239044175 240585089 242133886
1917.3 242133886 243745551 245313063 246836126 248338699 249739468 251030505 252232105 253353834
1933.6 253353834 254393995 255365789 256234348 257072657 258055001 259224564 260555804 262066007 263711333
1951.9 263711333 265362769 266916960 268310636 269733608 271528453 273661435 275703967 277323723
1968.3 277323723 278448135 279240906 280106574 281430274 283272892 285377264 287479877 289449781 291277587
$$ packed form
1850A76794440K992481K811998K653852K469912K345934K253578K110809J998782K076790
1868.3A98508576K195075K075344J958728J924261J873404J842946J874313J907840
1884.6B14160487J826704J771137J832172J862213J846060J848445J821622J798257
1900.9B28767097J764610J736761J756578J740635J676619J601875J540914J548797
1917.3B42133886J611665J567512J523063J502573J400769J291037J201600J121729
1933.6B53353834J040161R71794Q68559Q38309R82344J169563J331240J510203J645326
1951.9B63711333J651436J554191J393676J422972J794845K132982K042532J619756
1968.3B77323723J124412P92771Q65668J323700J842618K104372K102613J969904J827806
$$ plain form
1986.6 291277587 292972684 294589549 296206057 297763526 299236745 300695568 302128851 303494960
2002.9 303494960 304835051 306141973 307386339 308583200 309736341 310836524 311899513 312943429
2019.2 312943429 313955605 314925551 315849543 316776574 317739725 318716466 319708675 320731610 321763277
2037.6 321763277 322792947 323808253 324756235 325652421 326531440 327372074 328158021 328895122 329578072
2056 329578072 330230922 330855370 331407279 331909567 332388699 332838416 333256036 333657056 334055722 334463477
2076.4 334463477 334906220 335381478 335865289 336342812 336830378 337328166 337807506 338271618 338724583 339154571
2096.8 339154571 339569390 339961439 340283096 340525091 340724498 340874583 340934992 340913594 340817869 340603828
2117.1 340603828 340222955 339658409 338966399 338226736 337459922 336662084 335832417 334966421 334072024 333139747
$$ packed form
1986.6B91277587J695097J616865J616508J557469J473219J458823J433283J366109
2002.9C03494960J340091J306922J244366J196861J153141J100183J062989J043916
2019.2C12943429J012176R69946R23992R27031R63151R76741R92209J022935J031667
2037.6C21763277J029670J015306R47982Q96186Q79019Q40634P85947P37101O82950
2056C29578072O52850O24448N51909N02288M79132M49717M17620M01020L98666M07755
2076.4C34463477M42743M75258M83811M77523M87566M97788M79340M64112M52965M29988
2096.8C39154571M14819L92049L21657K41995J99407J50085O0409k1398r5725k14041
2117.1C40603828l80873n64546o92010p39663p66814p97838q29667q65996q94397r32277
$$ plain form
2137.5 333139747 332142681 331127375 330214143 329493612 329032212 328907669 329111189 329532117 330033064
2155.9 330033064 330527157 331001163 331436008 331827343 332249939 332762092 333347589 334004939 334737748 335496306
2176.3 335496306 336239308 336964607 337629795 338164687 338551730 338839978 339095443 339312106 339459121 339573115
2196.7 339573115 339668453 339684576 339617282 339503944 339360446 339254946 339232206 339253634 339316040 339459032 339650363
2219.1 339650363 339795679 339829415 339770466 339646250 339435428 339128703 338728577 338236988 337685078 337105274
2239.5 337105274 336456567 335735500 335081995 334578514 334123850 333700627 333425760 333249062 333064735 332931966
2259.9 332931966 332911670 332944095 332934827 332848847 332729876 332566679 332299113 331955820 331581980 331206173
2280.3 331206173 330886215 330698848 330647409 330646157 330634534 330607921 330562472 330456138 330257624 329971313 329624623
$$ packed form
2137.5C33139747r97066j015306r13232p20531m61400j24543K03520M20928N00947
2155.9C30033064M94093M74006M34845L91335M22596N12153N85497O57350P32809P58558
2176.3C35496306P43002P25299O65188N34892L87043K88248K55465K16663J47015J13994
2196.7C39573115R5338J6123o7294j13338j43498j05500k2740K1428O2406J42992J91331
2219.1C39650363J45316L3736n8949j24216k10822l06725m00126m91589n51910n79804
2239.5C37105274o48707p21067o53505n03481m54664m23223k74867j76698j84327j32769
2259.9C32931966k0296L2425r268q5980j18971j63197k67566l43293l73840l75807
2280.3C31206173l19958j87367n1439j252j1623k6613m5449j06334j98514k86311l46690
$$ plain form
2302.7 329624623 329311460 329140544 329098910 329088151 328979284 328744501 328597218 328623474 328597695 328367293
2323.1 328367293 328066528 327881992 327775449 327506810 327024460 326599926 326399297 326333314 326142758 325344890
2343.5 325344890 323507577 321580082 321033865 322027743 323595434 324712068 325109690 324843168 324030966
2361.9 324030966 322892874 321434408 319565654 317504436 315451801 313490987 311664820 309917569
2378.2 309917569 308262706 306807995 305590451 304596305 303793788 303076774 302380234 301727980 301081538
2396.6 301081538 300366133 299580485 298767507 297962815 297179580 296460450 295854151 295293480 294724613 294205040
2417 294205040 293754488 293325692 292881489 292409748 291882902 291268408 290585607 289905101 289230943 288472027
2437.4 288472027 287615210 286737263 285820097 284790665 283665359 282429039 281043500 279560000 277995825
$$ packed form
2302.7C29624623l13163j70916m1634j0759j08867k34783j47283K6256k5779k30402
2323.1C28367293l00765j84536j06543k68639m82350m24534k00629o5983j90556p97868
2343.5C25344890j837313j927495n46217R93878J567691J116634L97622k66522q12202
2361.9C24030966j138092j458466j868754k061218k052635j960814j826167j747251
2378.2C09917569j654863j454711j217544r94146q02517p17014o96540o52254o46442
2396.6C01081538p15405p85648q12978q04692p83235p19130o06299n60671n68867n19573
2417B94205040m50552m28796m44203m71741n26846o14494o82801o80506o74158p58916
2437.4B88472027q56817q77947r17166j029432j125306j236320j385539j483500j564175
$$ plain form
2455.7 277995825 276309997 274490356 272540808 270420253 268042743 265317738 262148231 258472681
2472 258472681 254325926 249817789 245040804 239984706 234576851 228755042 222515419 215820119 208414987
2490.4 208414987 200068802 190913305 181328848 171714097 162355617 153376430 144949377 137391761
2506.7 137391761 130883604 125303954 120435327 116294667 113165326 111385323 111165181 112490542
2523 112490542 115097530 118602544 122716889 127237678 131973848 136814237 141551808 145686045 148848101
2541.4 148848101 151225507 153275803 155253991 157245919 159475029 162302315 165916070 170137197
2557.7 170137197 174568519 178813651 182543039 185449317 187329054 188239127 188500986 188618124 189009354
2576 189009354 189786911 190851837 192078039 193440199 195038348 197072297 199764311 203199327 207204595
$$ packed form
2455.7B77995825j685828j819641j949548k120555k377510k725005l169507l675550
2472B58472681m146755m508137m776985n056098n407855n821809o239623o695300p405132
2490.4B08414987q346185r155497r584457r614751r358480q979187q427053p557616
2506.7A37391761o508157n579650m868627m140660l129341j780003k20142J325361
2523A12490542K606988L505014M114345M520789M736170M840389M737571M134237L162056
2541.4A48848101K377406K050296J978188J991928K229110K827286L613755M221127
2557.7A70137197M431322M245132L729388K906278J879737R10073K61859J17138L91230
2576A89009354P77557J064926J226202J362160J598149K033949K692014L435016M005268
$$ plain form
2594.4 207204595 211317286 214954615 217678964 219362512 220226780 220587686 220576778 220175877 219379455
2612.8 219379455 218193188 216587767 214638725 212500930 210433289 209018484 208932832 210500658 213462457
2631.1 213462457 217142895 221018434 224911451 228718594 232268810 235404417 238108024 240464166
2647.4 240464166 242527559 244317487 245896325 247358575 248731300 249975681 251078874 252070457
2663.7 252070457 252925456 253603935 254161507 254610270 254862130 254943937 254986137 254997879 254929632 254782706
2684.1 254782706 254569829 254355937 254176170 253958732 253658682 253315061 252970248 252595484 252143294 251631826
2704.5 251631826 251082897 250483871 249840409 249144420 248364285 247534201 246673450 245698482 244575530
2722.9 244575530 243354544 242111489 240933225 239926547 239218861 238796890 238544583 238400683 238304287
$$ packed form
2594.4B07204595M112691L637329K724349J683548Q64268L60906j0908m00901p96422
2612.8B19379455j186267j605421j949042k137795k067641j414805q5652J567826K961799
2631.1B13462457L680438L875539L893017L807143L550216L135607K703607K356142
2647.4B40464166K063393J789928J578838J462250J372725J244381J103193R91583
2663.7B52070457Q54999O78479N57572M48763K51860Q1807M2200J1742o8247j46926
2684.1B54782706k12877k13892j79767k17438l00050l43621l44813l74764m52190n11468
2704.5B51631826n48929n99026o43462o95989p80135q30084q60751r74968j122952
2722.9B44575530j220986j243055j178264j006678p07686m21971k52307j43900r6396
$$ plain form
2741.2 238304287 238220453 238185018 238163397 238071844 237925172 237758711 237550557 237261385 236911595 236565128
2761.6 236565128 236202940 235764667 235231668 234608784 233920380 233162448 232278585 231238529 230060965
2780 230060965 228749767 227298394 225707829 223963395 222127587 220270038 218309790 216201439 214009613
2798.4 214009613 211757943 209405318 206826240 203783140 200121194 195982397 191673025 187560856
2814.7 187560856 184091732 181454763 179290548 176939562 173904836 169986844 165068805 159000754
2831 159000754 151673421 143045619 133117020 121999949 110029995 97826481 86243257 76198705
2847.3 76198705 68460956 63269243 60204554 58665924 58275577 58801901 59980042 61433058 62621735
2865.7 62621735 63083299 62892549 62701419 63183621 64519778 66453502 68561457 70330232 71284480
$$ packed form
2741.2B38304287q3834l5435k1621r1553j46672j66461k08154k89172l49790l46467
2761.6B36565128l62188m38273n32999o22884o88404p57932q83863j040056j177564
2780B30060965j311198j451373j590565j744434j835808j857549j960248k108351k191826
2798.4B14009613k251670k352625k579078l043100l661946m138797m309372m112169
2814.7A87560856l469124k636969k164215k350986l034726l917992m918039o068051
2831A59000754p327333q627802r928599j1117071j1969954j2203514j1583224j0044552
2847.3G6198705p737749n191713l064689j538630l90347N26324J178141J453016J188677
2865.7F2621735M61564j90750j91130M82202J336157J933724K107955J768775R54248
$$ plain form
2884 71284480 71254008 70365682 68866037 66960178 64764149 62463690 60234647 58134172 56206696
2902.4 56206696 54507345 53051274 51781580 50619110 49535148 48546799 47676373 46943743 46316229
2920.7 46316229 45757074 45374449 45279056 45413066 45755643 46387244 47256418 48277605 49455114 50678462
2941.1 50678462 51712073 52369796 52595846 52416526 51890846 51205762 50642360 50396711 50507132 50953828
2961.5 50953828 51789694 53039789 54632958 56527134 58750398 61331030 64226456 67361705 70748329
2979.9 70748329 74460477 78479789 82767211 87410584 92428967 97622283 102717176 107477717
2996.2 107477717 111777104 115608662 119008355 122035928 124727309 127095178 129189491 131053090
3012.5 131053090 132747233 134356380 135966554 137758449 139918745 142572597 145834267 149830714
$$ packed form
2884G1284480l0472q88326j499645j905859k196029k300459k229043k100475j927476
2902.4E6206696j699351j456071j269694j162470j083962r88349q70426p32630o27514
2920.7D6316229n59155l82625r5393J34010L42577O31601Q69174J021187J177509J223348
2941.1E0678462J033611O57723K26050j79320n25680o85084n63402k45649J10421M46696
2961.5E0953828Q35866J250095J593169J894176K223264K580632K895426L135249L386624
2979.9G0748329L712148M019312M287422M643373N018383N193316N094893M760541
2996.2A07477717M299387L831558L399693L027573K691381K367869K094313J863599
3012.5A31053090J694143J609147J610174J791895K160296K653852L261670L996447
$$ plain form
3028.8 149830714 154628098 159869298 164810181 168837294 171751961 173725560 175033167 175830767
3045.1 175830767 176169962 176206648 176212043 176302582 176402763 176497489 176620245 176652089 176494315 176276162 176213592
3067.6 176213592 176360920 176604733 176871210 177214235 177757174 178516522 179383695 180320472 181294218 182157144
3088 182157144 182792425 183210447 183434278 183437496 183267638 183076292 182973206 183018595 183241248 183545992
3108.4 183545992 183826581 184068263 184229508 184274122 184272006 184276849 184235647 184105501 183927745 183783665 183717519
3130.8 183717519 183676124 183582887 183453262 183353052 183270425 183113292 182867676 182608098 182349592 182049274
3151.2 182049274 181734070 181500316 181300998 181028396 180702597 180366173 180056661 179783463 179525509 179228798
3171.6 179228798 178830594 178382427 177993953 177718624 177508041 177321523 177150443 176926896 176641256 176374108
$$ packed form
3028.8A49830714M797384N241200M940883M027113K914667J973599J307607P97600
3045.1A75830767L39195L6686N395R0539J00181R4726J22756L1844j57774k18153o2570
3067.6A76213592J47328K43813K66477L43025N42939P59348Q67173R36777R73746Q62926
3088A82157144O35281M18022K23831L218j69858j91346j03086M5389K22653L04744
3108.4A83545992K80589K41682J61245M4614k116M843m1202j30146j77756j44080o6146
3130.8A83717519m1395r3237j29625j00210q2627j57133k45616k59578k58506l00318
3151.2A82049274l15204k33754j99318k72602l25799l36424l09512k73198k57954k96711
3171.6A79228798l98204m48167l88474k75329k10583j86518j71080k23547k85640k67148
$$ plain form
3192 176374108 176145360 175910667 175678760 175463006 175241813 175025120 174811289 174581662 174350619 174124956
3212.4 174124956 173930600 173779786 173594415 173366562 173152238 172975764 172835127 172638953 172345608 172044680
3232.8 172044680 171832204 171725720 171629369 171470866 171304777 171145409 170960054 170774668 170605943 170460597
3253.2 170460597 170324191 170179889 170043841 169897869 169713080 169476345 169212431 169013187 168888167 168737203
3273.6 168737203 168522298 168262228 168005168 167770147 167506844 167205885 166876763 166538939 166233182 165952265
3294 165952265 165705264 165542290 165403202 165164426 164832488 164565608 164445356 164350793 164201230 164012834
3314.4 164012834 163799033 163560838 163277358 162972927 162685424 162409291 162168130 161975548 161748379 161438286
3334.8 161438286 161146909 160973236 160847291 160667390 160422623 160141841 159906536 159769326 159675166 159545258
$$ packed form
3192A76374108k28748k34693k31907k15754k21193k16693k13831k29627k31043k25663
3212.4A74124956j94356j50814j85371k27853k14324j76474j40637j96174k93345l00928
3232.8A72044680k12476j06484r6351j58503j66089j59368j85355j85386j68725j45346
3253.2A70460597j36406j44302j36048j45972j84789k36735k63914j99244j25020j50964
3273.6A68737203k14905k60070k57060k35021k63303l00959l29122l37824l05757k80917
3294A65952265k47001j62974j39088k38776l31938k66880j20252r4563j49563j88396
3314.4A64012834k13801k38195k83480l04431k87503k76133k41161j92582k27169l10093
3334.8A61438286k91377j73673j25945j79901k44767k80782k35305j37210r4160j29908
$$ plain form
3355.2 159545258 159373239 159213379 159051180 158835813 158606172 158364609 158066750 157800496 157686576 157639831
3375.5 157639831 157482043 157261759 157091960 156918198 156686828 156393260 156052724 155754849 155535266 155278414
3395.9 155278414 154925093 154595450 154345810 154023305 153557226 153091490 152685508 152261853 151833981 151414543
3416.3 151414543 150941998 150465101 150039926 149613306 149183899 148830190 148592114 148504302 148577675 148754075
3436.7 148754075 149011269 149311155 149576858 149805576 150060415 150304839 150482535 150671437 150882348 151075915
3457.1 151075915 151274428 151507244 151753739 151903123 151973352 152132541 152351841 152496308 152616203 152732432
3477.5 152732432 152763218 152773574 152856022 152942851 152989328 153083667 153224766 153260767 153184652 153152898 153149068
3500 153149068 153077677 153027326 153083920 153147727 153099224 153001904 153002158 153066307 153084800 153065979 153008983 152919114
$$ packed form
3355.2A59545258j72019j59860j62199k15367k29641k41563k97859k66254j13920m6745
3375.5A57639831j57788k20284j69799j73762k31370k93568l40536k97875k19583k56852
3395.9A55278414l53321l29643k49640l22505m66079m65736m05982m23655m27872m19438
3416.3A51414543m72545m76897m25175m26620m29407l53709k38076q7812P3373J76400
3436.7A48754075K57194K99886K65703K28718K54839K44424J77696J88902K10911J93567
3457.1A51075915J98513K32816K46495J49384P0229J59189K19300J44467J19895J16229
3477.5A52732432L0786J0356Q2448Q6829M6477R4339J41099L6001p6115l1754l830
3500A53149068p1391n0351N6594O3807m8503r7320K54O4149J8493j8821n6996q9869
$$ plain form
3524.4 152919114 152850613 152842656 152896821 152944341 152935937 152896062 152876556 152868450 152853012 152870938 152930066 152984768
3548.9 152984768 153018117 153075799 153179348 153278634 153351694 153414100 153432742 153441757 153570965 153808847 154000193
3571.3 154000193 154136896 154302120 154467553 154591873 154681444 154758021 154860198 155038312 155225471 155319169
3591.7 155319169 155367315 155377805 155323192 155303285 155371279 155392662 155300692 155256525 155323043 155304924 155147135
3614.2 155147135 154895946 154653072 154580593 154579118 154467002 154170096 153743446 153187379 152351826 151213437
3634.6 151213437 149795994 148054272 146109998 144360244 143086910 142326206 142118901 142420724 142860740
3652.9 142860740 143306240 143781692 144019917 143897146 143488973 142753556 141752511 140571848 138876796
3671.3 138876796 136225626 132675856 129125416 125555366 121173188 116463222 112530254 110233657
$$ packed form
3524.4A52919114o8501p957N4165M7520q404l9875j9506q106j5438J7926N9128N4702
3548.9A52984768L3349N7682J03549R9286P3060O2406J8642R015J29208K37882J91346
3571.3A54000193J36703J65224J65433J24320Q9571P6577J02177J78114J87159R3698
3591.7A55319169M8146J0490n4613j9907O7994K1383r1970m4167O6518j8119j57789
3614.2A55147135k51189k42874p2479j475j12116k96906m26650n56067q35553j138389
3634.6A51213437j417443j741722j944274j749754j273334p60704k07305L01823M40016
3652.9A42860740M45500M75452K38225j22771m08173p35417j001045j180663j695052
3671.3A38876796k651170l549770l550440l570050m382178m709966l932968k296597
$$ plain form
3687.6 110233657 110228710 112290993 115701862 120083205 124833949 129159287 132797763 136580154 141522467
3706 141522467 147262499 152439341 156255215 158797845 160662457 162379116 163993299 165404662 166684791
3724.3 166684791 167935356 169142812 170271337 171316549 172227800 172877982 173191950 173365384 173721552
3742.7 173721552 174292967 174581587 174581870 174746364 174912259 174921080 175002769 175179586 175364554 175497144 175594285
3765.1 175594285 175655782 175710052 175766066 175760657 175790817 175912544 176062107 176136002 176071227 176024154 176087588
3787.5 176087588 176158026 176193744 176170945 176115096 176077485 176019728 175971702 175913051 175817281 175767317 175757408 175746337
3812 175746337 175723776 175714388 175657138 175546944 175495252 175401643 175283939 175223976 175134152 175044000 175010845 174998581
3836.5 174998581 174999669 174891666 174624026 174366280 174225941 174194261 174171507 174152732 174165040 174000144 173741221
$$ packed form
3687.6A10233657m947K062283L410869M381343M750744M325338L638476L782391M942313
3706A41522467N740032N176842L815874K542630J864612J716659J614183J411363J280129
3724.3A66684791J250565J207456J128525J045212R11251O50182L13968J73434L56168
3742.7A73721552N71415K88620K83J64494J65895Q821Q1689J76817J84968J32590R7141
3765.1A75594285O1497N4270N6014n409L0160J21727J49563P3895o4775m7073O3434
3787.5A76087588P0438L5718k2799n5849l7611n7757m8026n8651r5770m9964r909j1071
3812A75746337k2561r388n7250j10194n1692r3609j17704n9963q9824r0152l3155j2264
3836.5A74998581J088j08003k67640k57746j40339l1680k2754j8775J2308j64896k58923
$$ plain form
3858.9 173741221 173572421 173541754 173599511 173534036 173337221 173178077 173054904 172995254 172949538 172887996 172838435
3881.4 172838435 172695145 172606006 172596484 172421530 172191992 172059625 171957031 171868548 171712160 171415746
3901.8 171415746 171181247 171074897 170957237 170833394 170689330 170484781 170320421 170217872 170058563 169831499
3922.1 169831499 169626728 169478327 169319674 169086069 168833062 168678969 168589473 168419495 168153703 167925999
3942.5 167925999 167801082 167657286 167461753 167338446 167244464 167110965 167002663 166952282 166911110 166769594
3962.9 166769594 166566104 166419536 166299611 166164458 166037217 165935993 165847376 165725797 165553778 165379837
3983.3 165379837 165214345 165072903 165015027 164986715 164904177 164780110 164645717
3997.6 164645717
$$ packed form
3858.9A73741221j68800l0667N7757o5475j96815j59144j23173n9650m5716o1542m9561
3881.4A72838435j43290q9139r522j74954k29538j32367j02594q8483j56388k96414
3901.8A71415746k34499j06350j17660j23843j44064k04549j64360j02549j59309k27064
3922.1A69831499k04771j48401j58653k33605k53007j54093q9496j69978k65792k27704
3942.5A67925999j24917j43796j95533j23307r3982j33499j08302n0381m1172j41516
3962.9A66769594k03490j46568j19925j35153j27241j01224q8617j21579j72019j73941
3983.3A65379837j65492j41442n7876k8312q2538j24067j34393
3997.6A64645717
##END=$$ End of the data block
