##TITLE=Ref 13803 - Solado externo $$ Begin of the data block
##JCAMP-DX=5.00 $$ ACD/SpecManager v 10.08
##SPECTROMETER/DATA SYSTEM=Alpha
##DATE=21 Jul 2016 08:26:52
##DATA TYPE=INFRARED SPECTRUM
##DATA CLASS=XYDATA
##ORIGIN=
##OWNER=
##NPOINTS=1667
##FIRSTX=599.57470703
##LASTX=3997.16503906
##MAXX=3997.16503906
##MINX=599.57470703
##MAXY=0.95153129
##MINY=0.32118469
##XFACTOR=1.0000000000
##YFACTOR=1.000000000000000e-9
##FIRSTY=0.64066100
##DELTAX=2.03937006
##XUNITS=1/CM
##YUNITS=ARBITRARY UNITS
##XYDATA=(X++(Y..Y))
599.6F40661001j1988342r212136n349755j892746J59026J708209L536344N099356
615.9F22720957N916834O004572N266189L684759J957715N02944p38263r36926J02520
634.2F44481301K248109N135178P240653P642091O814718N410313M210949M306257
650.6F87489569N792201O912648N663634K770185J05798j934587l114582l723681l948390
668.9F96012795k577364j496077j296997j230717r14454o43730o82831j037300j388371
687.3F84744954j060724p5638J045346J896858K011716R88365j182080l486454n916655
705.6F78965688j2206435k0303131j0591030K0546496L7444115K3767590K551079j1138677
721.9G09035695j7108560j4513075j700819J6396165K6679337K2688329J2166500L592313
$$ plain form
599.6 640661001 628672659 619460523 614110768 612218022 612377048 614085257 617621601 622720957
615.9 622720957 628637791 634642363 639908552 643593311 645551026 646053970 645315707 644378781 644481301
634.2 644481301 646729410 651864588 659105241 666747332 673562050 678972363 683183312 687489569
650.6 687489569 693281770 700194418 705858052 708628237 708734035 706799448 703684866 699961185 696012795
668.9 696012795 693435431 691939354 690642357 689411640 688497186 687853456 687170625 686133325 684744954
687.3 684744954 683684230 683608592 684653938 686550796 688562512 689550877 688368797 684882343 678965688
705.6 678965688 666759253 646456122 635865092 656411588 693855703 717623293 720174372 709035695
721.9 709035695 691927135 677414060 675713241 692109406 718788743 741477072 753643572 757235885
738.3G57235885n64516l90947K671421O263792Q198977Q003592O382883M331887K815187
756.6G94948161J721263M37736m79996n97179k72512J02341J68979J87397M67896O88553
777G97372639O44446O37352P77423R25363Q08000N28515M07397M21047P40231J390516
797.4H04652929K191663K818346K850831K179384J216292N80669L25799L2067m34279
815.7H16413701j180888k111792k664566l009022l538608l643572k845169k044677
832.1G95375407j695454j682103k270341l581643n604386q953214j1179268p469655
848.4G52939343l287136l973961o398320j1644840j8716157k4662971l1431735m1187942
864.7F11636281n5635691o9474905o0141117j6751170K9797912N1362157N3742230
$$ plain form
738.3 757235885 756671369 756280422 758951843 765215635 773414612 781418204 787801087 792132974 794948161
756.6 794948161 796669424 797107160 796627164 796029985 795757473 795859814 796028793 796216190 796684086 797372639
777 797372639 798017085 798654437 799431860 800357223 801165223 801693738 802101135 802522182 803262413 804652929
797.4 804652929 806844592 809662938 812513769 814693153 815909445 816490114 816815913 816847980 816413701
815.7 816413701 815232813 813121021 810456455 807447433 803908825 800265253 797420084 795375407
832.1 795375407 793679953 791997850 789727509 786145866 780541480 771588266 760408998 752939343
848.4 752939343 749652207 745678246 739279926 727635086 708918929 684255958 652824223 611636281
864.7 611636281 556000590 486525685 426384568 409633398 439431310 490793467 544535697
879E44535697N0368368N1300109N6145548N1654935L5490394J9681334J0220826M853010
895.3H24250221J403272p67290j951039k474666k735555k983689l091455l196597l441632
913.6H05011570l813922m303694m655122m580081m249275m110455m271090m671455
930G70356476n305528n968511o391287o539822o552696o504953o174803n656421n399287
948.3G15863168n247235m613757l408075j870393j90497J240909K288103K977670L202319
966.7G10242212L208458L409982L818691M137456M124105L805339L417492L014207
983G39177942K524555K014816J545787J069426O69539N28455N18143K87831j11342
1001.3G48225152n17725j112819j811683k516747l441810m314900l891110j382411
$$ plain form
879 544535697 594904065 646204174 702349722 754004657 789495051 809176385 819397211 824250221
895.3 824250221 825653493 824886203 822935164 820460498 817724943 814741254 811649799 808453202 805011570
913.6 805011570 801197648 796893954 792238832 787658751 783409476 779299021 775027931 770356476
930 770356476 765050948 759082437 752691150 746151328 739598632 733093679 726918876 721262455 715863168
948.3 715863168 710615933 706002176 702594101 700723708 700533211 701774120 704062223 707039893 710242212
966.7 710242212 713450670 716860652 720679343 724816799 728940904 732746243 736163735 739177942
983 739177942 741702497 743717313 745263100 746332526 747002065 747530520 748048663 748336494 748225152
1001.3 748225152 747707427 746594608 744782925 742266178 738824368 734509468 730618358 729235947
1017.6G29235947J761615L495038L910303L973007L403962J937568N1379j793205k890349
1036G43085265k306819j40786K160728L165066K636075J428902K28882q65638j850307
1054.4G47541368k910495m205942n597591p154823q917570j0302722j0280729p813513
1070.7F90357983k941608K748072P237792R134888Q279980N863785L439785J715123
1087G25835800N93960j21951n22017n05328k2650Q44240K018094K964556L102184K216398
1107.4G36403286J79887k537012m987180o469011o370783m323900j109660J804471
1123.7G12590098L784359N182564O324828O990909P042885O870866O920457P316708
1140G63023674P666767P206738N661965L635883J806021L83019o75082j544535k506554
$$ plain form
1017.6 729235947 730997562 734492600 738402903 742375910 745779872 747717440 747768819 745975614 743085265
1036 743085265 740778446 740637660 742798388 745963454 748599529 750028431 750257313 749391675 747541368
1054.4 747541368 744630873 740424931 734827340 727672517 718754947 708452225 698171496 690357983
1070.7 690357983 687416375 690164447 697402239 706537127 714817107 720680892 724120677 725835800
1087 725835800 726429760 726307809 725785792 725280464 725257814 726102054 728120148 731084704 734186888 736403286
1107.4 736403286 736583173 734046161 729058981 722589970 716219187 711895287 710785627 712590098
1123.7 712590098 716374457 721557021 727881849 734872758 741915643 748786509 755706966 763023674
1140 763023674 770690441 777897179 783559144 787195027 789001048 789384067 788708985 787164450 784657896
1158.4G84657896l434897l572285k608061j366079p07209n29408m58539l55303k15113
1176.7G71411002k77520p19845j511454k470911l278971l691196l566027k946734k109826
1195.1G50838518j180827l08931K97546N87344M29809k3484m33862q63493j546025
1213.4G47796595k533734l827989n587816p965684j0521710j2166679j2127936j0964811
1229.7F82100236j0094165j0171354j0565996j0436118r662211q540869p407665o492019
1246.1F08729839n966246n999863n899727m097402p81596J714468K569854K893627
1262.4E93162954L247440L298104K918124K396762K102494K387464L174186L924728
1278.7F16612256M031002L247321J976490J318931K256751M798413P694125R279609
$$ plain form
1158.4 784657896 781222999 777650714 775042653 773676574 772969365 772439957 771981418 771626115 771411002
1176.7 771411002 771133482 770413637 768902183 766431272 763152301 759461105 755895078 752948344 750838518
1195.1 750838518 749657691 749348760 749646306 750233650 750663459 750639975 750206113 749342620 747796595
1213.4 747796595 745262861 741434872 735847056 727881372 717359662 705192983 693065047 682100236
1229.7 682100236 672006071 661834717 651268721 640832603 631170392 622629523 615221858 608729839
1246.1 608729839 602763593 596763730 590864003 586766601 585985005 587699473 590269327 593162954
1262.4 593162954 596410394 599708498 602626622 605023384 607125878 609513342 612687528 616612256
1278.7 616612256 620643258 623890579 625867069 627186000 629442751 634241164 641935289 651214898
1295F51214898R022832P570684N755364M153312K916991J550794r9421j689493k961993
1313.4F77433968l811121m292667m540205m730761m931152n063534n112469n233884
1329.7F39718175n240619m781306l578723j919150q01504r03010k049267l943265o174028
1348F10327303p803618q300245q077801p878601p897258q264005r112835r806216j0146677
1366.4E33040047j0774076j1337161j1903018j2585312j1934966j0212243q744031
1380.7D55549240q059055q384644r681553j0986775j1227161j1241913j1068195r586096
1397C75313848q182615q151471q939714r409934q229554n881756l498078j600533k35498
1415.3C21184695J367718L421098L715008M165709O371707P872850Q245080P802755
$$ plain form
1295 651214898 660237730 667808414 673563778 677717090 680634081 682184875 682085454 680395961 677433968
1313.4 677433968 673622847 669330180 664789975 660059214 655128062 650064528 644952059 639718175
1329.7 639718175 634477556 629696250 626117527 624198377 623396873 622493863 620444596 616501331 610327303
1348 610327303 602523685 594223440 586145639 578267038 570369780 562105775 552992940 543186724 533040047
1366.4 533040047 522265971 510928810 499025792 486440480 474505514 464293271 455549240
1380.7 455549240 447490185 439105541 429423988 418437213 407210052 395968139 384899944 375313848
1397 375313848 367131233 358979762 350040048 340630114 332400560 326518804 323020726 321420193 321184695
1415.3 321184695 322552413 325973511 329688519 333854228 340225935 348098785 356343865 364146620
1431.6C64146620P539034R970248J2155264R565801P778674P743627P999539Q720994
1448D35619801Q513183P338494O789148R323597J2278318R528488P888406J0090679
1464.3E07370114J1791528J0719359J0605990J2901366J3197422J1245072J0407567
1478.6E88238418J0463715J0722458J0275006J0345638J1880577J3086498J1433720
1492.8F66446030J0506511J2175917J2331129J0525405Q812308R682715J3608158J2180030
1509.1G56268203R163142Q688092Q561492Q587897Q116424Q338511P901132O339788
1525.5H21964681N962908N233229M575491M664301L955782L100991L755689M006445
1541.8H57219517L210962L049493K665281K231956J846373J597702J306415J276731
$$ plain form
1431.6 364146620 371685654 381655902 393811166 403376967 411155641 418899268 426898807 435619801
1448 435619801 444132984 451471478 458260626 467584223 479862541 489391029 497279435 507370114
1464.3 507370114 519161642 529881001 540486991 553388357 566585779 577830851 588238418
1478.6 588238418 598702133 609424591 619699597 630045235 641925812 655012310 666446030
1492.8 666446030 676952541 689128458 701459587 711984992 720797300 730480015 744088173 756268203
1509.1 756268203 765431345 774119437 782680929 791268826 799385250 807723761 815624893 821964681
1525.5 821964681 827927589 833160818 837736309 842400610 846356392 849457383 853213072 857219517
1541.8 857219517 860430479 863479972 866145253 868377209 870223582 871821284 873127699 874404430
1558.1H74404430J601160J310706J185894J294971J367449J505077J223445N59151
1574.4H84452283J52111M44890J500368K658546L087043K704680K137423J733541J342595
1592.8I00213480R42767O67333Q53420J655101K508104K543450K055704J650572J415610
1611.1I14505541J248896J091361J211703J246512J079142J022995J022041R93073
1627.4I23421264R90152Q56817N93483N07832P62999R29356Q04424N82933M24206N64278
1647.8I30437744N94556L14772M62473Q52465P11739L43740Q2433J76073J80721k04921
1668.2I33951795l56495j57774k61187l86894l92973n72920q56161r32873n91278n35548
1688.6I28907692q14139j131416j962542k787173l542185n444348o227731p930160
$$ plain form
1558.1 874404430 876005590 877316296 878502190 879797161 881164610 882669687 883893132 884452283
1574.4 884452283 884604394 885049284 886549652 889208198 892295241 894999921 897137344 898870885 900213480
1592.8 900213480 901156247 901823580 902677000 904332101 906840205 909383655 911439359 913089931 914505541
1611.1 914505541 915754437 916845798 918057501 919304013 920383155 921406150 922428191 923421264
1627.4 923421264 924411416 925268233 925861716 926369548 927132547 928061903 928866327 929449260 929873466 930437744
1647.8 930437744 931032300 931347072 931809545 932662010 933373749 933717489 933799922 933975995 934156716 933951795
1668.2 933951795 933595300 933437526 933176339 932789445 932396472 931823552 930967391 930034518 929443240 928907692
1688.6 928907692 928093553 926962137 924999595 922212422 918670237 913225889 906998158 899067998
1704.9H99067998j1402726j3769925j5757382j7360389j7727494j5882910r933531
1719.2G97233641l668845L9340K881050N401075P313728Q679032J2087405J4568686
1735.5H44535112J2556613J3267517J4278114J2760460J1082709R440184Q163035O676912
1751.8I32760656M542291K938390K213955J644969J138389P90834N43297L96430K35438
1770.2I47204649r775p0452R5188O6936j98006n99802j096904j763225k725243l752113
1790.6I37151253l446340j396776L42191J778304L266275L648758K675653J493692
1806.9I45513010O99699L02911K19464J84655O6281J29938L46958L23117K83182M19080
1827.3I48488295M80175N29647N01573L27230K35498J29759j10030j36316J71423L06487
$$ plain form
1704.9 899067998 887665272 873895347 858137965 840777576 823050082 807167172 797233641
1719.2 797233641 793564796 793604136 796485186 801886261 809199989 817879021 829966426 844535112
1735.5 844535112 857091725 870359242 884637356 897397816 908480525 917920709 926083744 932760656
1751.8 932760656 937302947 940241337 942455292 944100261 945238650 946029484 946572781 946969211 947204649
1770.2 947204649 947194874 947124422 947219610 947286546 947088540 946488738 945391834 943628609 940903366 937151253
1790.6 937151253 933704913 932308137 932650328 934428632 937694907 941343665 944019318 945513010
1806.9 945513010 946212709 946515620 946735084 946919739 946986020 947115958 947462916 947786033 948069215 948488295
1827.3 948488295 948968470 949498117 949999690 950326920 950562418 950692177 950582147 950445831 950617254 950923741
1847.7I50923741K15232Q4937j133R9779J50263N8472k205j11938k92718k82705K6703
1870.1I50868428K79426K45512J4543j23918j58846j89722n3465J34528J26004L695
1890.5I51146185j02937j04308N2810R9063k9266p7248r537m9531j57893n6505J07169
1913I50818002M3631j20938q6784j2398o2406j0669N8293o020p3493j15096j60754
1935.4I50271368j51575j52885j56880j3590N4002n960K3663K7597J4662K0802o616
1957.8I49924588J4961K9027l1471p2896k7955J8060j7464o1929L576R8706N6147j5259
1982.3I49918091j0967l9458r5427p2181O7889J32561K9147o1691r7335q1122m7922
2004.7I49641585Q94J4842p9691j15276q6248m3511N3227J02579M6671o0797o3062
$$ plain form
1847.7 950923741 951138973 951223910 951222777 951322556 951472819 951531291 951529086 951417148 951124430 950841725 950868428
1870.1 950868428 951147854 951393366 951407909 951283991 951125145 950935423 950881958 951016486 951142490 951146185
1890.5 951146185 951043248 950938940 950991750 951090813 951061547 950984299 950974762 950925231 950767338 950710833 950818002
1913 950818002 950861633 950740695 950653911 950641513 950579107 950568438 950626731 950620711 950547218 950432122 950271368
1935.4 950271368 950119793 949966908 949810028 949796438 949850440 949844480 949868143 949895740 949910402 949931204 949924588
1957.8 949924588 949939549 949968576 949937105 949864209 949836254 949854314 949836850 949774921 949778497 949877203 949933350 949918091
1982.3 949918091 949907124 949867666 949772239 949700058 949767947 949900508 949929655 949867964 949770629 949689507 949641585
2004.7 949641585 949642479 949657321 949577630 949462354 949376106 949332595 949385822 949488401 949535072 949474275 949411213
2027.2I49411213L1352j2397o7175K2888L7969n9009o8903j2159m5836n8890J5617
2049.6I49194670L6120j8000k7955O1691L4928j32799j83523j15216j5795M9293J4246
2072I48897660k1279j2159n5373r5129k0027O4790L815r0123l1471O4850P7844M1723
2096.5I48825121n1200j09137l0219L0398l1948o4134l9459l1650l4928n7519o7234
2118.9I48338091m0292j7107K1935N0187m1306j35184r1076k1696n4359j11580r4175
2141.4I47803438K205R2924L1173o5446o3777k5332N1856J08957P4447L1352k0504
2163.8I48021293j11878j11759m291M172r6798q1122M0889J01983L9757k7419q34L2783
2188.3I47806776K6106l6120j28865j39892l9041M9054O8248j3113j60277j43648k8431
$$ plain form
2027.2 949411213 949442565 949430168 949362993 949385881 949423850 949364841 949295938 949283779 949237943 949179053 949194670
2049.6 949194670 949230790 949212790 949184835 949246526 949281454 949148655 948965132 948849916 948834121 948883414 948897660
2072 948897660 948876381 948864222 948808849 948713720 948693693 948758483 948762298 948672175 948640704 948705554 948783398 948825121
2096.5 948825121 948773921 948664784 948634565 948664963 948633015 948568881 948529422 948497772 948462844 948405325 948338091
2118.9 948338091 948297799 948280692 948302627 948352814 948311508 948176324 948085248 948063552 948009193 947897613 947803438
2141.4 947803438 947805643 947898567 947929740 947864294 947800517 947775185 947827041 947935998 948010445 948041797 948021293
2163.8 948021293 947909415 947797656 947793365 947797537 947700739 947619617 947660506 947762489 947802246 947774827 947773993 947806776
2188.3 947806776 947832882 947796762 947667897 947528005 947488964 947538018 947606266 947593153 947432876 947289228 947260797
2210.7I47260797J3709N7340M8816j1265J371l4154j06335l9517R9003J38700M0889
2233.1I47469354j16110j90020j02043J5616L6896m5955j17124p6890q940R238M3870
2255.6I46917892O9141l6657j01030m2915m8042n8293N7817J00433n9306j52469o1929
2278I46584642K8789N96m2737m410K146k3127j1921j2040l0935r3579j18912j0609
2302.5I46267903M8160J8418N4479N5075j04011j82092p9274o8724j46747j05977M1545
2324.9I45798755J98364K38538O3956j32561j32978k2769N8234o736j58965j87755
2345.3I45716083K0623K65777K40446j4604j64866k72989k78116q3625p6294j05083
2365.7I45247352j7881K861l3915q4877l9518L9995J7464M4822J06097Q3863N9784
$$ plain form
2210.7 947260797 947274506 947331846 947380662 947369397 947370768 947336614 947230279 947190762 947289765 947428465 947469354
2233.1 947469354 947353244 947163224 947061181 947076797 947113693 947067738 946950614 946873724 946864784 946874022 946917892
2255.6 946917892 946987033 946950376 946849346 946806431 946758389 946700096 946757913 946858346 946799040 946646571 946584642
2278 946584642 946613431 946614027 946571290 946566880 946569026 946545899 946533978 946521938 946491003 946397424 946278512 946267903
2302.5 946267903 946316063 946334481 946388960 946444035 946340024 946157932 946078658 946009934 945863187 945757210 945798755
2324.9 945798755 945997119 946235657 946299613 946167052 946034074 946011305 946069539 946062803 945903838 945716083
2345.3 945716083 945736706 946002483 946242929 946228325 946063459 945790470 945512354 945428729 945352435 945247352
2365.7 945247352 945229471 945232332 945198417 945113540 945074022 945114017 945131481 945176303 945282400 945366263 945426047
2388.1I45426047M77r1434p0333j312l1292p4923l2485j9371q2135n7400M8161K7239
2412.6I45041239o8545q6725l0815K5510M1366L0935k4855k3246K2173m3571j16110
2435I44767356n2273P6890N3525r0659q7977N365K2292l7551j28865j61648j45078
2457.5I44221377r7572N36k980j42217k01583j36196p8917r0837j63436k31147k72393
2479.9I42804635l60311m38928l82602l38853m07696n28633o93560p76887q19087r42230
2500.3I37115848j006663q90672p69436p43568n71013k46167k9385m828N1081K36154
2520.7I33141351L73780N14687P16924P73132O46830N74946O18279O05583M20869K08378
2541.1I38594759J76846J77205Q7082N6863J04070J35124J77264K46763K38061P5162
$$ plain form
2388.1 945426047 945426524 945335090 945264757 945263445 945232153 945157230 945124745 945105374 945023239 944965839 945014000 945041239
2412.6 945041239 944972694 944885969 944855154 944880664 944922030 944952965 944928110 944904864 944927037 944883466 944767356
2435 944767356 944715083 944791973 944845498 944754839 944666862 944672227 944694519 944656968 944528103 944366455 944221377
2457.5 944221377 944123805 944124341 944121361 943979144 943777561 943641365 943562448 943471611 943308175 943077028 942804635
2479.9 942804635 942444324 942005396 941622794 941283941 940876245 940347612 939654052 938877165 938058078 937115848
2500.3 937115848 936109185 935218513 934449077 933705509 933134496 932888329 932858944 932854116 932905197 933141351
2520.7 933141351 933515131 934029818 934746742 935519874 936166704 936741650 937359929 937965512 938386381 938594759
2541.1 938594759 938771605 938948810 939035892 939092755 939196825 939331949 939509213 939755976 939994037 940069199
2561.5I40069199k2173Q9049J90854K49207K43724N006k31623j67847K6464O7115l4153
2583.9I40484822q6606m2021K6464J10746K16186K32756R0420K9683J11580O3181m3154
2606.3I41194057J4306P7545j490k3305J02818K06828J35958n0843q6605M6372P7486
2628.8I41693127k3007J013J27196J12832J0610k2054L636P6592J21236N0067Q762
2651.2I42160010J2219k026K5511J1622q3625j81019j69277m4167J2040l994L457j0550
2675.7I41730201m9889l4153M1604N5790p4089j55568l874J35719N8234j18851k03789
2698.1I41381335r9957O56O497L2544k7657j80244j73330m2320j8775j04547k00688
2720.5I40573514k30432j46031j967J6152j22308j71900p8201O675o854o1274r715
$$ plain form
2561.5 940069199 940047026 940136075 940326929 940576136 940819860 940824866 940593243 940425396 940451860 940518975 940484822
2583.9 940484822 940398216 940356195 940382659 940493405 940709591 940942347 941032767 941062450 941174030 941237211 941194057
2606.3 941194057 941208363 941285908 941284418 941261113 941363931 941570759 941706717 941655874 941569269 941615641 941693127
2628.8 941693127 941670120 941671133 941798329 941911161 941921771 941899717 941903353 941979945 942101181 942151248 942160010
2651.2 942160010 942172229 942170203 942195714 942207336 942123711 941942692 941773415 941729248 941741288 941737294 941740751 941730201
2675.7 941730201 941680312 941646159 941687763 941743553 941669464 941513896 941510022 941645741 941703975 941585124 941381335
2698.1 941381335 941281378 941282034 941288531 941321075 941293418 941113174 940939844 940897524 940878749 940774202 940573514
2720.5 940573514 940343082 940197051 940195084 940211236 940088928 939917028 939838827 939845502 939838648 939777374 939767659
2743I39767659J23203J49607J1981j16468r6679j8596j5199n6506n8114j05202k09928
2765.4I39375758k00987j20520j09732r8288l9638j01208k53499k37584j31667j82569
2785.8I37900066l18884l74139l55005l23475l27765l89636m05848l86477m41730n17666
2806.2I34059441n99146p02321p67649p41720o82056p01129p06375o75261p31528q74638
2826.6I26877618j175761j726509k302765k818823l597617m664660n982995p832527
2842.9H96775961r996951j1288762j0182321o453156j918137J575291L746569N054891
2859.2H67313385N688250N379319L978491K003014M89414L26514J425088K700090L143728
2877.6H92447293K617717J526534L29435p67410j809418k710879l367901l893792m347921
$$ plain form
2743 939767659 939890862 940040469 940052450 939935982 939839303 939820707 939805508 939749002 939690888 939585686 939375758
2765.4 939375758 939174771 939054251 938944519 938846231 938806593 938705385 938451886 938214302 938082635 937900066
2785.8 937900066 937581182 937207043 936852038 936528563 936200798 935811162 935405314 935018837 934577107 934059441
2806.2 934059441 933460295 932757974 931990325 931248605 930566549 929865420 929159045 928483784 927752256 926877618
2826.6 926877618 925701857 923975348 921672583 918853760 915256143 910591483 904608488 896775961
2842.9 896775961 886779010 875490248 865307927 858854771 856936634 858511925 862258494 867313385
2859.2 867313385 873001635 878380954 882359445 884362459 884851873 885178387 886603475 889303565 892447293
2877.6 892447293 895065010 896591544 896920979 896153569 894344151 891633272 888265371 884371579 880023658
2895.9H80023658m769027n215585n579531n872906o221592o736100p537007q490443
2912.2H29601467q997202q208514o058931l386557r15050J192152L076613M735291
2928.5H11039269O239176P522225Q281171Q508683Q125961P031142N424202L498375
2944.9H65670204J358807p32064k245367k670586j854956j74463J678408L256022M507185
2963.2H68793190N489885O196678O488740O298781N760372N144834M609406M104912
2979.5I12886798L688038L302276K835929K448917K211272J907170J477421J180470
2995.8I31938291J097381R88900P26045M46498L26872M30524N16832M26889M32431
3014.2I37330663N36025N01334L62695K76148K69592J65820N3704J76370K84612K52724
$$ plain form
2895.9 880023658 875254631 870039046 864459515 858586609 852365017 845628917 838091910 829601467
2912.2 829601467 820604265 812395751 806336820 802950263 802035213 803227365 806303978 811039269
2928.5 811039269 817278445 824800670 833081841 841590524 849716485 856747627 862171829 865670204
2944.9 865670204 867029011 866296947 864051580 861380994 859526038 859351575 861029983 864286005 868793190
2963.2 868793190 874283075 880479753 886968493 893267274 899027646 904172480 908781886 912886798
2979.5 912886798 916574836 919877112 922713041 925161958 927373230 929280400 930757821 931938291
2995.8 931938291 933035672 934024572 934750617 935197115 935523987 935954511 936471343 936898232 937330663
3014.2 937330663 937866688 938368022 938730717 939006865 939276457 939442277 939495981 939672351 939956963 940209687
3034.6I40209687K23398Q7023q4400n6625O0558L4035P212O8247j3232j45555M769
3057I40395117J65164n2571k54393j96933q1361L1650R3818K7895n8651q881J18971
3079.4I40179825J90914Q7201K2829Q2075P7844O1095L576n3704r7036q5354M8459
3101.9I40517724P3850o4254j73390j77622n0068J47224J31011j01686k27451o2704
3122.3I40012634J39475P8201p2062j49608j53959m4405J16766R2625r3698j65582
3142.7I39760387j47879j09136k6822p928n1558k5332j550K8372O7652j17183k85268
3165.1I39083755j66774j3947J728r1135j53601j23501l9101N5969k9028j99437o8605
3187.5I38256323J60456J06216o7831j83165j70409l159Q6128L6419l0935j25170q4162
$$ plain form
3034.6 940209687 940433085 940520108 940435708 940379083 940439641 940473676 940480888 940549135 940535903 940390348 940395117
3057 940395117 940560281 940507710 940253317 940056384 939975023 940006673 940100491 940128386 940069735 940060854 940179825
3079.4 940179825 940370739 940457940 940480769 940562844 940640688 940701783 940705359 940651655 940554619 940469265 940517724
3101.9 940517724 940591574 940527320 940353930 940176308 940126240 940273464 940404475 940302789 940075338 940012634
3122.3 940012634 940152109 940230310 940158248 940008640 939854681 939810276 939927042 940019667 939925969 939760387
3142.7 939760387 939612508 939503372 939476550 939468622 939417064 939391732 939390182 939418554 939486206 939369023 939083755
3165.1 939083755 938916981 938903034 938904762 938813627 938660026 938536525 938497424 938553393 938524365 938324928 938256323
3187.5 938256323 938416779 938522995 938455164 938271999 938101590 938098431 938184559 938220978 938190043 938064873 937980711
3210I37980711N6983m5300k23398k15352j08480O2644K08140J68621k8491k50161k48968
3232.4I37356949j6391O2346l636K3544Q0466M3512j35601k92182j62244N9486l517
3254.8I37012732j48058n3763J06752O0737k7359L4154L1173p3612j27911o7056K6405
3277.3I36774194l1173k7776P3195n4360j22428N9307J11282L4034K8968l6836k07185
3299.7I36601222k52665j37329n3882j5319L2246M7029L1828o2346j38104p0751n3644
3322.1I35928285q5294o2883p3016n3048L5286M2796n8472j10865k4735J28030J52707
3344.6I35818791O4016O3598L6418j09374j82748p8559J4246m5181j11222q5950K3484
3367I35407519K2591o9917n1319j04905j27911M4048J21832R8168L7015j38283j54912
$$ plain form
3210 937980711 938037694 937992394 937768996 937553644 937445164 937507808 937715948 937884569 937856078 937605917 937356949
3232.4 937356949 937340558 937402904 937399268 937422812 937503278 937546790 937411189 937119007 936956763 937016249 937012732
3254.8 937012732 936864674 936810911 936917663 936978400 936951041 936985195 937016368 936942756 936814845 936747789 936774194
3277.3 936774194 936743021 936715245 936788440 936734080 936611652 936670959 936782241 936816275 936845243 936808407 936601222
3299.7 936601222 936348557 936211228 936157346 936142027 936174273 936221302 936253130 936190784 936052680 935981929 935928285
3322.1 935928285 935842991 935780108 935707092 935654044 935689330 935732126 935673654 935562789 935538054 935666084 935818791
3344.6 935818791 935882807 935946405 935982823 935873449 935690701 935612142 935626388 935581207 935469985 935384035 935407519
3367 935407519 935430110 935360193 935308874 935203969 935076058 935120106 935241938 935340106 935377121 935238838 935083926
3389.4I35083926P510N7816M18q5116j10030p1228J01924L33071J70469j81257j71662
3411.9I35135841R1792K35974J32144j06514j59144N3644O7353j57356j40250P7010
3432.2I35230494R5486K0385Q7678R4831N2631O5327O318j8656P3910J56819J61529
3454.7I36026752O6102K801Q7500J22547M7624P450M8459M8995j550J43290K58386
3477.1I36858356k7955k38001j9789j6212j62363J58787M18782K11716K1338Q762O556
3499.5I37219977P5460J51455J46508N9724q9824m1365J69277K27272J00434M7684
3519.9I38066602Q7321L0219k5213j967J43052K90453J21057j16706M1306K33174M7385
3542.4I38916683j87993q9288K09093K50042N8770L3200R6321o199p0035l0577j00255
$$ plain form
3389.4 935083926 935091436 935149252 935149670 935064554 934954524 934883296 934985220 935318291 935488760 935307503 935135841
3411.9 935135841 935227633 935463607 935595751 935489237 935330093 935383737 935451090 935293734 935153484 935230494
3432.2 935230494 935325980 935346365 935434043 935528874 935581505 935646832 935653150 935634494 935708404 935865223 936026752
3454.7 936026752 936092854 936095655 936183155 936305702 936353326 936360776 936409235 936458230 936456680 936599970 936858356
3477.1 936858356 936830401 936592400 936572611 936556399 936394036 936552823 936971605 937183321 937204659 937213421 937219977
3499.5 937219977 937295437 937446892 937593400 937653124 937563300 937521935 937691212 937918484 938018918 938066602
3519.9 938066602 938153923 938184142 938158929 938156962 938300014 938590467 938711524 938594818 938636124 938869298 938916683
3542.4 938916683 938728690 938639402 938848495 939098537 939157307 939190507 939286828 939280629 939210594 939180017 939079762
3564.8I39079762q1420K01880L79980L10838K34187K34008K05040J54316N9307k78771
3585.2I40499127m79877M2081M24981K74777J60933J25646j0848m5478J17600J11878
3605.6I41220820l9518p152N9664R8109Q8334k02000k10583K90394M42862J31250l79026
3628I41493154l82185J14500J94967n4538l17157l03566l2306J4782l13222n71966
3648.4I39842463k31803M30226N87881L12507K02477J76191M0651M0829J13249k55942
3668.8I41258729o63877o27875j062811j097262n92112r60708j590848j672566j403987
3687.2I31586683o43850R72033K131462K214015J796782J319706Q95500P98047J084030
3705.5I42154408J183867N57542j90675J38759N43833K49267l6002l2425q9407l7789
$$ plain form
3564.8 939079762 938998342 939200222 939580202 939891040 940125227 940359235 940564275 940718591 940777898 940499127
3585.2 940499127 940019250 940061331 940486312 940761089 940922022 941047668 941036820 940991342 941108942 941220820
3605.6 941220820 941181302 941174150 941233814 941331923 941420257 941218257 941007674 941298068 941740930 941872180 941493154
3628 941493154 941110969 941225469 941420436 941365898 941048741 940745175 940712869 940727651 940414429 939842463
3648.4 939842463 939610660 940040886 940628767 940941274 941143751 941319942 941360593 941401422 941514671 941258729
3668.8 941258729 940594852 939966977 938904166 937806904 937214792 936254084 934663236 932990670 931586683
3687.2 931586683 930942833 931914866 934046328 936260343 938057125 939376831 940272331 941070378 942154408
3705.5 942154408 943338275 943895817 943705142 943843901 944387734 944637001 944600999 944568574 944479167 944441378
3725.9I44441378L49045M71711p1764p62582n23329L80636O74247K18392l35753j20699
3746.3I44721282M5478k48492n0545J67907m5300j40130N3942K16067J98900J86861
3766.7I45105970J65760R1792N8293l7015j60694k6345K01464K4140k27690q1420J99854
3789.1I45314109K33293j28567n99087m23073L874N2392K87533J36018k86937O4969
3809.5I44654524L53515j21772o11782k43962j3888n0246L82006M41909K01106R8586
3829.9I45089996R8646R4592k64168n54859k63274N5552K34663K65956K42889J3113
3850.3I45013106p65920p04586L85165N33223K55644l1709k02656k0504l5346j73211
3870.7I44253206o3419O2942K29896N8770k2114J37270k69532l33011J62124K97308
$$ plain form
3725.9 944441378 944790423 945262134 945190370 944427788 943904459 944285095 944959342 945177734 944841981 944721282
3746.3 944721282 944766760 944518268 944467723 944635630 944590330 944450200 944504142 944720209 944919109 945105970
3766.7 945105970 945271730 945363522 945421815 945384800 945224106 945197761 945399225 945423365 945195675 945114255 945314109
3789.1 945314109 945547402 945418835 944819748 944396675 944400549 944452941 944740474 944876492 944589555 944654524
3809.5 944654524 945008039 944886267 944274485 944030523 944016635 943966389 944348395 944790304 944991410 945089996
3829.9 945089996 945188642 945283234 945019066 944464207 944200933 944256485 944491148 944757104 944999993 945013106
3850.3 945013106 944247186 943542600 943927765 944460988 944716632 944684923 944482267 944461763 944426417 944253206
3870.7 944253206 944189787 944252729 944482625 944541395 944519281 944656551 944387019 944054008 944216132 944513440
3891.1I44513440K05219Q2135k1577q0943k46286l32415k2412K69115J95086P4089
3911.5I44635451M0054k20775m23432j37865J36911J52052P2777M0293Q9884j8776
3931.9I44366574J0968L03089Q5473m74930m52399j311J54614J32025J09434n96R4652
3954.3I44327593K63750J39356j30892l96430m72188j74463K28345L09289J13368l5048
3974.7I44172680j57475j53840M6313J10805J11580J58131J17243L4809j789K5154
3995.1I44463611k3306
3997.1I44440305
$$ plain form
3891.1 944513440 944718659 944800794 944779217 944698274 944451988 944119573 944097161 944366276 944561362 944635451
3911.5 944635451 944675505 944454730 944031298 943893433 944030344 944182396 944255173 944295466 944385350 944366574
3931.9 944366574 944377542 944680631 944766104 944291174 943838775 943837464 943992078 944124103 944233537 944232941 944327593
3954.3 944327593 944591343 944730699 944599807 944203377 943731189 943556726 943785071 944094360 944207728 944172680
3974.7 944172680 944015205 943861365 943907678 944018483 944130063 944288194 944405437 944440246 944438457 944463611
3995.1 944463611 944440305
3997.1 944440305
##END=$$ End of the data block
