##TITLE=Ref 13803 - Espuma $$ Begin of the data block
##JCAMP-DX=5.00 $$ ACD/SpecManager v 10.08
##SPECTROMETER/DATA SYSTEM=Alpha
##DATE=21 Jul 2016 08:26:52
##DATA TYPE=INFRARED SPECTRUM
##DATA CLASS=XYDATA
##ORIGIN=
##OWNER=
##NPOINTS=1667
##FIRSTX=599.57470703
##LASTX=3997.16503906
##MAXX=3997.16503906
##MINX=599.57470703
##MAXY=0.95487469
##MINY=0.69101351
##XFACTOR=1.0000000000
##YFACTOR=1.000000000000000e-9
##FIRSTY=0.77714872
##DELTAX=2.03937006
##XUNITS=1/CM
##YUNITS=ARBITRARY UNITS
##XYDATA=(X++(Y..Y))
599.6 777148724 778331757 779633701 780446172 781029820 781114221 780832827 780681312 780663610 781032026 781993806
620 781993806 782842398 782947719 782587349 782216489 781876862 781620324 781670034 781761289 781683147 781595707 781413853
642.4 781413853 781146348 780916870 780412436 779535174 778941631 778884470 779158235 779498994 779493272 779225826
662.8 779225826 779249132 780047417 781158447 781746328 782568812 783793569 785032034 786040545 786728621
681.1 786728621 787371516 787818253 787377298 785652339 781976461 775165439 765397906 756329417 753696561
699.5 753696561 760026276 772103488 784659326 794523597 801569402 808301091 816600680 824354351
715.8 824354351 828837574 830500424 831011117 831154168 831163228 831083655 830847859 830157697 828724563 826733112
736.2 826733112 824306250 821408212 818293273 815155983 811792135 808207095 804797947 801811576
752.5 801811576 799541354 798778117 800101578 803364038 808102846 813509881 818833172 823762298 827936769
770.9 827936769 831068039 833247662 834576607 835105240 835134029 834952593 834757745 834580243 834266007
789.2 834266007 833855391 833176434 831775486 829719543 827476442 825354278 823415756 821651995 820101500
807.6 820101500 819047630 818879783 819588304 821153343 823630154 826811075 830396116 834122300 837825060
825.9 837825060 841189384 843856394 845731378 847001493 847956061 848480642 848332465 847816467 847182274
844.3 847182274 846403718 845757067 845132649 843977451 842221260 840163350 837987840 835718334 833325386
862.7 833325386 830708385 827904344 824946105 822245717 821361899 823426425 827783823 832891047 837627292
881 837627292 842119277 846735597 850660086 852957964 853832364 853849173 853283882 852226317 850730717
899.4 850730717 849017203 847372890 845935762 844816566 844107509 843545020 842691839 841377079 839804351
917.7 839804351 838272452 836973846 836234987 836243451 836868465 837924123 839246988 840787947 842562079
936.1 842562079 844649553 847091258 849626958 851953566 853842199 854942203 855105281 854515374 853433132
954.4 853433132 852066517 850545287 849020541 847583592 846264482 845159590 844326615 843729198 843276501
972.8 843276501 842697322 841719151 840423167 838920712 837039411 834596753 831574678 827928126 823450327
991.1 823450327 818087995 812299013 806827843 802419126 799631298 798426092 798195660 798303723 798410118
1009.5 798410118 798422575 798545957 799082160 799993515 800935507 801432133 801066160 799747288 797662318
1027.8 797662318 795065999 792138994 788897216 785358131 781506836 777147591 772112310 766458869
1044.2 766458869 760394275 754104912 747825384 741879225 736592352 732003033 727808595 723752439
1060.5 723752439 719667792 715472579 711235523 707136691 703409970 700150192 697341621 695072949
1076.8 695072949 693401456 692257822 691511929 691074133 691013515 691311479 691793978 692480326 693613827
1095.1 693613827 695285738 697471857 700298965 703872263 708143055 712958157 718173265 723837316
1111.5 723837316 730047762 736704767 743668854 750916839 758207977 765107572 771496773 777362525
1127.8 777362525 782652557 787625968 792607725 797596633 802292585 806449831 810067892 813153863
1144.1 813153863 815626740 817513227 818997025 820215344 821368158 822745144 824340940 826049626
1160.4 826049626 828013539 830332398 832825541 835083723 836690903 837472379 837417901 836523890 834797800
1178.8 834797800 832471490 829992771 827706039 825825810 824272335 822565734 820257187 817185938
1195.1 817185938 813526988 809680998 806013107 802705884 799559236 796105564 792172492 788024187
1211.4 788024187 784029186 780619085 778284252 777304530 777722836 779577613 782901466 787495136 793035448
1229.7 793035448 799240112 805758834 812245965 818487883 824304044 829618096 834389269 838436782
1246.1 838436782 841715276 844233394 845875978 846655309 846699178 846235633 845636010 845191061 844976425
1264.4 844976425 844962537 845187068 845713735 846486211 847453058 848558009 849524915 850036979 849947631 849201441
1284.8 849201441 847822368 846021414 844271243 843207240 843312621 844609082 846743524 849246085
1301.1 849246085 851767540 854205430 856527388 858707428 860819042 862929821 864986062 866998434
1317.4 866998434 869025946 870971739 872663796 874008715 874993980 875558496 875661194 875294268 874411285
1335.8 874411285 873199224 872422576 872637510 873468399 874497354 875659406 876805842 877599239 877741039
1354.2 877741039 876919866 874809265 871005476 865166247 857638240 848956764 839914143 832803249
1370.5 832803249 829854488 832042456 838209271 845630288 852244437 856801212 859055042 859644830
1386.8 859644830 859299898 858067274 855646372 852354646 848980844 845660627 842344046 838939667
1403.1 838939667 835527301 832794189 830975115 830141783 830342174 831137955 832295656 834116697 835993290
1421.5 835993290 837164164 837711096 837366521 835669398 832589746 828231812 822144091 815420866 810199499
1439.8 810199499 805983067 802522361 800242722 799505413 800647080 803340852 807141483 812430918
1456.1 812430918 818409741 821879983 822621226 821300089 818749487 816015065 813259959 811280131
1472.4 811280131 811993837 815157235 818821251 821461082 822509170 821885049 819736898 816510260 813094199
1490.8 813094199 810489178 808763921 807401717 805666745 803572774 801572978 799709737 798821807
1507.1 798821807 799651146 800558329 800264716 798375368 795303345 791626990 787321031 783217132 779810429
1525.5 779810429 777127147 775436342 774517596 774720728 775749505 776882052 779010713 782524765 786302507
1543.8 786302507 790460765 794801056 799592674 805057049 811074376 817352116 825953245 838155270
1560.1 838155270 847517073 855286837 863341630 871357203 879240811 884767711 887091637 886534631
1576.4 886534631 883487463 878759861 872818470 866855800 861810505 857971728 855357945 853725374
1592.8 853725374 852840245 852674067 853399754 855422199 858932912 863449931 868437707 873518109 878060460
1611.1 878060460 881509721 884159267 886660278 888515830 889132321 888269007 885588229 880564630 873124361
1629.5 873124361 864659727 855820060 847269535 843109071 844014525 847622395 852431059 858381271
1645.8 858381271 865082026 869913697 873697340 878874898 883278310 886226594 888621032 890923321
1662.1 890923321 893336475 895213783 896629214 898261666 899811864 901025474 902289271 903315246
1678.4 903315246 903706074 903598845 903849661 904609680 904983282 905022621 904654980 903633237 902442575
1696.8 902442575 901513278 900797188 900457501 900133550 899903059 900014639 900294363 900649548 901182175 902433634
1717.2 902433634 904463410 906429410 908342004 910616338 913147688 915787637 918643832 922910869
1733.5 922910869 928604782 933317542 937488377 941540003 944825292 947289586 948979318 950241923
1749.8 950241923 951624751 952792406 953275561 953492999 953712881 953838527 953963459 953869104 953558326
1768.2 953558326 953282177 953119934 953248322 953492939 953573525 953510821 953337848 953144014 953104615 952907383
1788.5 952907383 952338636 951985717 952151954 952312768 952209830 952111781 952331960 952640772 952669978 952447057
1808.9 952447057 952307761 952444851 952577353 952534199 952499211 952431023 952131212 951857388 951786935 951696575
1829.3 951696575 951841533 952167392 952207386 952056170 951854169 951421142 950968623 951020539 951329529 951518238
1849.7 951518238 951534271 951441348 951379538 951279521 951106489 950981677 950803280 950349152 949863851 949914813
1870.1 949914813 950368822 950625837 950536668 950358272 950207472 950031281 949916184 949920356 949944794 950026393
1890.5 950026393 950088143 949997663 949964583 950036883 950017989 949964702 949957550 949887872 949792027 949758947 949740112 949608684
1915 949608684 949337065 949225307 949332118 949458182 949623764 949729145 949672580 949578226 949515939 949429035 949292243
1937.4 949292243 949072838 948808014 948778927 948954046 949039578 949077427 949124277 949090540 948986828 948937535 948996305
1959.9 948996305 949038982 948949933 948803246 948769927 948871434 948960364 948930025 948885977 948917508 948892593 948821902
1982.3 948821902 948818803 948810220 948728621 948630333 948636711 948731661 948773384 948747814 948696733 948638618 948576391 948527157
2006.8 948527157 948529959 948539317 948506832 948419094 948330104 948357522 948469758 948546231 948514640 948422551 948390484 948394775
2031.2 948394775 948378742 948362887 948349059 948345721 948385417 948429883 948393822 948309720 948277295 948332846 948425591 948484659
2055.7 948484659 948525786 948510766 948372960 948192418 948104799 948177576 948285341 948294759 948297262 948331416 948294699
2078.1 948294699 948209882 948176324 948176026 948149860 948078394 947985649 947959900 948062897 948216736 948267877 948223174
2100.6 948223174 948166490 948068142 948008358 948087692 948141873 948068082 947978675 947941542 947928488 947905302 947935402
2123 947935402 948050916 948119342 948022783 947850347 947817266 947912097 947883964 947678208 947487295 947440922 947494745
2145.4 947494745 947509706 947471440 947482169 947535157 947608650 947689593 947724998 947726190 947708488 947629929 947497308
2167.9 947497308 947440922 947438419 947329164 947209001 947194099 947219849 947247982 947289944 947336555 947294593 947175801
2190.3 947175801 947125971 947088361 947000384 947016776 947131932 947132349 946990609 946868420 946800590 946707189 946618974
2212.7 946618974 946588397 946534097 946406245 946280599 946185231 946090758 945951700 945640564 945118368 944496989
2233.1 944496989 943924665 943604827 943598568 943798482 944076180 944229305 944160342 943921149 943526626 943022072
2253.5 943022072 942530453 942108870 941637635 941073477 940559208 940100908 939746499 939655185 939791203 940108418
2273.9 940108418 940535665 940934598 941395164 942042768 942749202 943359852 943905711 944469333 945012748 945456088
2294.3 945456088 945820689 946078718 946194232 946309209 946465433 946591675 946739972 946903586 946947515 946852863
2314.7 946852863 946731925 946706116 946830988 947015047 947164536 947313607 947546363 947870255 948126197 948238194
2335.1 948238194 948273540 948222518 948040187 947762132 947524190 947479904 947673321 948004842 948182464 948120654
2355.5 948120654 948144317 948250592 948261738 948194265 948087931 948029876 947966993 947730780 947375059 947121859
2375.9 947121859 947008312 946978092 947113514 947386801 947604954 947714865 947764218 947758377 947747409 947772920 947771728
2398.3 947771728 947729647 947704375 947676003 947621882 947610378 947655261 947659016 947594941 947577178 947635293 947680175 947699904
2422.8 947699904 947698474 947667956 947648466 947615802 947536945 947483718 947501957 947547555 947583973 947601199 947599471 947571933
2447.3 947571933 947487593 947365344 947264314 947162867 947087407 947165549 947329879 947385967 947291672 947168052
2467.7 947168052 947164834 947237432 947264254 947238028 947182834 947123885 947026908 946871221 946773291 946796417 946893215
2490.1 946893215 946941614 946867764 946810484 946807802 946773231 946740270 946731806 946710408 946679175 946678042 946669340 946652830
2514.6 946652830 946653485 946618557 946574569 946595967 946688294 946745634 946678817 946592987 946617663 946680725 946666002 946603596
2539 946603596 946520805 946444631 946439028 946437299 946351409 946292043 946364641 946453333 946447134 946401656 946325600 946206748
2563.5 946206748 946148694 946160972 946183622 946198046 946132362 945956171 945784330 945719123 945704937 945661306 945618033
2585.9 945618033 945616007 945617914 945639312 945724368 945779622 945716977 945674658 945798695 945928991 945872366 945750475
2608.4 945750475 945752859 945809424 945783257 945776999 945894539 945970833 945862412 945676208 945565820 945493460 945364296
2630.8 945364296 945302486 945373416 945426941 945385456 945297658 945222497 945189178 945162356 945108116 945099056 945137441 945151567
2655.3 945151567 945126712 945092022 945094943 945076525 944966614 944814861 944703758 944660962 944692314 944691956 944562376
2677.7 944562376 944496751 944534063 944473565 944315135 944132626 944027781 944066286 944110692 944016516 943797350 943629980
2700.1 943629980 943566859 943459630 943365693 943326831 943178296 942975163 942886770 942847550 942725718 942551494
2720.5 942551494 942378044 942210078 942096293 941986084 941806614 941667557 941617370 941556513 941408217 941195369
2740.9 941195369 941041291 941018462 941043615 940972269 940817654 940697491 940576971 940397322 940257072 940158486
2761.3 940158486 939977109 939732075 939474583 939246476 939115703 939019084 938921213 938839555 938687325 938459039
2781.7 938459039 938209414 937923014 937651455 937457979 937372744 937399626 937401772 937218487 936928511 936737895
2802.1 936737895 936640680 936515450 936292470 935978353 935624301 935212016 934718311 934165061 933623850 933130741
2822.5 933130741 932560623 931822479 930939019 929788172 928279281 926511467 924494267 922197223 919605911
2840.8 919605911 916654766 913390994 910064399 907017648 904514968 902626574 901240647 900165856
2857.2 900165856 899313986 898754299 898579597 898799181 899254620 899898469 900853753 902007043 903167427
2875.5 903167427 904301107 905333638 906114995 906567037 906790555 906919837 906959534 906920493 906812727 906665683
2895.9 906665683 906613648 906715751 906905830 907108903 907259464 907279789 907094657 906548381 905649781 904811084
2916.3 904811084 904239893 903838694 903681159 903933704 904611051 905571818 906906307 908845127 911308050
2934.7 911308050 914109468 917036772 919661343 921757281 923502982 924858987 925588548 925721884 925389767
2953 925389767 924638033 923383355 921469331 918837309 915714025 912820160 910985708 910534501 911395550
2971.4 911395550 913294971 915834963 918616652 921320498 923920155 926472187 928951561 931368768
2987.7 931368768 933677733 935787499 937566876 938958585 940074146 940937519 941514432 941955805 942388654
3006 942388654 942690432 942729592 942619324 942450166 942172587 941866934 941559136 941145599 940679431 940315604
3026.4 940315604 940205574 940427601 940777063 941020072 941171050 941221237 941172242 941103280 941011846 940861821
3046.8 940861821 940715492 940671921 940637648 940485358 940379083 940375745 940271020 940103471 939976275 939925909
3067.2 939925909 940082848 940354884 940389752 940155625 939996898 940002918 940064073 940148771 940302014 940553725
3087.6 940553725 940805435 940969586 941009820 940992177 941072166 941244483 941377461 941375792 941132009 940785944
3108 940785944 940643549 940709412 940864444 940957725 940832675 940529108 940320373 940319419 940250874 940043509 939868808
3130.4 939868808 939747810 939596891 939424157 939329565 939238489 939086378 939001799 938954771 938785434 938568056
3150.8 938568056 938421845 938249767 938041151 937960088 937956750 937802315 937525153 937281668 937082827 936844707
3171.2 936844707 936502814 936166942 935847878 935497224 935228348 934974194 934677064 934480011 934284210 933910906
3191.6 933910906 933466733 933080196 932755351 932494342 932299376 932166994 932009935 931676984 931239009 930886686
3212 930886686 930555165 930089474 929515243 929009616 928721070 928522944 928142428 927562118 926866829 926122546
3232.4 926122546 925492942 924959660 924396753 923829257 923307300 922784507 922171175 921501279 920890152 920373976
3252.8 920373976 919905126 919462740 919076324 918760300 918506742 918242037 917936444 917702734 917563915 917431533
3273.2 917431533 917338967 917372167 917455196 917579949 917836785 918030381 918061435 918180525 918452501 918796480
3293.6 918796480 919270396 919796109 920174360 920501649 920948505 921492338 922081769 922623336 923126519 923610091
3314 923610091 924008965 924536109 925304174 926022112 926568031 927063882 927538991 928071141 928712785 929260254
3334.4 929260254 929629087 930012286 930534720 931158185 931766331 932315111 932907403 933456957 933777511 934015572
3354.8 934015572 934367716 934798658 935236335 935641527 936046124 936544299 937077343 937627375 938246548 938799739
3375.1 938799739 939364970 940084100 940730631 941212714 941640258 942039132 942433119 942839563 943330526 943923235
3395.5 943923235 944464922 944833934 945075095 945406139 945860028 946173608 946260989 946355283 946670353 947079659
3415.9 947079659 947385192 947694540 948093116 948447168 948694408 948911130 949141622 949299216 949369311 949551761
3436.3 949551761 949828565 949963987 949931562 949849427 949859262 949912906 949879289 949867427 949972868 950104058 950093865
3458.8 950093865 949966908 949924529 950015843 950125813 950175166 950211942 950278878 950421631 950598776 950532556 950282931
3481.2 950282931 950191498 950170636 950157285 950303793 950457692 950458407 950506508 950625181 950523198 950310469 950329363
3503.6 950329363 950556338 950696051 950660229 950635731 950689316 950734377 950696111 950659692 950729311 950832963 950927973
3526.1 950927973 951128244 951435030 951637626 951622427 951468647 951459646 951559722 951351821 950952172 950911880
3546.4 950911880 951265574 951566160 951705992 951857030 951990068 951997101 951919436 951701641 951139510 950741291
3566.8 950741291 951188028 951872826 952198684 952266514 952295601 952467203 952692747 952600360 952042758 951588094
3587.2 951588094 951815248 952173054 952213705 952199101 952354252 952592492 952820599 952963173 952792048 952392936
3607.6 952392936 952206314 952254415 952461600 952648759 952452481 952326179 952727020 953153312 953040063 952358603
3628 952358603 952140689 952615678 953051150 953354478 953474700 953483582 953593552 953426123 952660084 951927602
3648.4 951927602 952197969 953117788 953644037 953591168 953566849 953737557 953951180 954218686 954285681 953914046
3668.8 953914046 953706920 953732729 953344047 953197777 953656614 954120755 954297602 954180181 953907013 953700900
3689.2 953700900 953871250 954276919 954613209 954739034 954637349 954610109 954821587 954874694 954657912 954249799
3709.6 954249799 953756809 953790069 954164267 954357684 954414725 954288602 953901291 953652918 953899801 954212904
3730 954212904 953844428 952918708 952675045 953318715 953770697 953546584 953158379 953376174 953567147 953279376
3750.4 953279376 953328192 953834891 954208910 954352498 954487443 954577744 954357743 954107106 954162121 954395473
3770.8 954395473 954698861 954859495 954727948 954524994 954473317 954392672 954270244 954382598 954598069 954733670
3791.2 954733670 954772234 954606533 954444408 954367399 954239666 954266548 954185486 953988194 954100490 954317093
3811.6 954317093 954257965 953953862 953854680 953733265 953645885 954086304 954531312 954655588 954554856 954311252
3831.9 954311252 953965783 953430593 953129947 953490078 953947306 954268932 954594314 954716504 954223931 953062296
3852.3 953062296 952619910 953312933 953914404 954080582 953847826 953624129 953752041 953810155 953859985 954106152
3872.7 954106152 954222381 954234779 953935623 953580141 953604519 953572810 953616619 953744411 953776777 954062581
3893.1 954062581 954433501 954364777 953683436 952907205 952795863 953422546 954142928 954516113 954595923 954433382
3913.5 954433382 954074323 953822851 953934610 954161286 954118907 953887641 953816295 954020202 954307854 954436958
3933.9 954436958 954388142 954231679 953950942 953710079 953743696 953848124 953960478 954262614 954525352 954557955
3954.3 954557955 954537332 954495907 954370797 954284728 954165936 953926384 953862071 954029560 954162180 954308093
3974.7 954308093 954395294 954291940 954292476 954424143 954460800 954410017 954420924 954478085 954380453 954234838 954261899
3997.1 954261899
##END=$$ End of the data block
