##TITLE=R4-2 $$ Begin of the data block
##JCAMP-DX=5.00 $$ ACD/SpecManager v 10.08
##SPECTROMETER/DATA SYSTEM=Alpha
##DATE=05 Mar 2015 09:08:46
##DATA TYPE=INFRARED SPECTRUM
##DATA CLASS=XYDATA
##ORIGIN=
##OWNER=
##NPOINTS=1765
##FIRSTX=399.76428223
##LASTX=3997.64306641
##MAXX=3997.64306641
##MINX=399.76428223
##MAXY=0.87615228
##MINY=0.41249982
##XFACTOR=1.0000000000
##YFACTOR=1.000000000000000e-9
##FIRSTY=0.83431304
##DELTAX=2.03961372
##XUNITS=1/CM
##YUNITS=ARBITRARY UNITS
##XYDATA=(X++(Y..Y))
$$ plain form
399.8 834313035 834560513 833459556 831451595 830155253 829746366 828692138 826580822 824695110 823241830
418.1 823241830 821376443 819673300 819215238 820373893 822511494 824483931 825097740 824146092 822776139
436.5 822776139 821930587 821387708 820422411 818549812 815849841 813361883 812927783 815265238 818881452
454.8 818881452 821753144 822431266 821071684 819184184 817503631 814889610 809662700 801595509 792331159
473.2 792331159 785534501 784655809 790974259 801874399 811452985 814453125 811195850 808444977
489.5 808444977 811364770 816080689 816586971 813414991 809180558 802622437 792782545 785056710 784215033
507.9 784215033 785663486 780707002 767102242 752681375 750953853 765460491 783754826 795796812
524.2 795796812 802429676 806158960 806521714 804604411 804586828 808146358 811641097 811836362 810706794
$$ packed form
399.8H34313035K47478j100957k007961j296342m08887j054228k111316j885712j453280
418.1H23241830j865387j703143m58062J158655K137601J972437O13809r51648j369953
436.5H22776139q45552n42879r65297j872599k699971k487958m34100K337455L616214
454.8H18881452K871692O78122j359582j887500j680553k614021n226910q067191r264350
473.2G92331159o796658q78692O318450J0900140R578586L000140l257275k750873
489.5H08444977K919793M715919N06282l171980m234433o558121r839892p725835q41677
507.9G84215033J448453m956484j3604760j4420867j727522J4506638J8294335J2041986
524.2G95796812O632864L729284L62754j917303j7583L559530L494739J95265j129568
$$ plain form
542.5 810706794 811521769 813270867 812819242 810647309 810108364 811614931 811899841 809656799 807929337
560.9 807929337 808830500 809893727 808448493 806153417 806126773 807617426 807354033 805082500 804081559
579.3 804081559 805541337 806465745 804797232 802990913 803773582 805505157 804951012 802826107 802567959
597.6 802567959 804318249 804785252 802977741 801844954 803176224 804498792 803270102 801129878 801097989
616 801097989 802544773 802262843 799901307 798156559 797626734 793305278 781025410 772202432 780091286
634.3 780091286 793359697 796138048 789721131 778149605 758601010 736660898 736487508 765482187
650.6 765482187 797001243 812221587 815038860 813983977 814338565 816165268 816348016 813464344
667 813464344 811465144 813399076 814479113 812548876 809903085 809058428 808448792 805070400 799050152
$$ packed form
542.5H10706794Q14975J749098m51625k171933n38945J506567K84910k243042j727462
560.9H07929337R01163J063227j445234k295076k6644J490653k63393k271533j000941
579.3H04081559J459778R24408j668513j806319P82669J731575n54145k124905k58148
597.6H02567959J750290M67003j807511j132787J331270J322568j228690k140224l1889
616H01097989J446784k81930k361536j744748n29825m321456j2279868q822978P888854
634.3G80091286J3268411K778351o416917j1571526j9548595k1940112j73390K8994679
650.6G65482187L1519056J5220344K817273j054883L54588J826703J82748k883672
667H13464344j999200J933932J080037j930237k645791q44657o09636l378392o020248
$$ plain form
685.3 799050152 792366207 784073174 769666135 747189045 723209441 703573227 689463794 694117129
701.6 694117129 726227105 765821338 791484952 801375866 801171839 795049906 782771170 764076352
717.9 764076352 750357687 754655540 768231750 772311628 763902605 757973254 765874505 780091166
734.3 780091166 789330184 791093171 790269434 795226514 805551767 811864734 810147166 803069055
750.6 803069055 791870594 774994373 753390491 730765045 700206339 646683753 584709644
764.9 584709644 558835387 575368464 602334678 641701400 704316854 764234662 800818384
779.1 800818384 819345534 828037083 831430972 833419740 835857809 837558210 836797893 833691895
795.4 833691895 830498695 830570042 834463298 838751912 841418326 842843473 842822790 841390252 839730859
$$ packed form
685.3G99050152o683945q293033j4407039k2477090k3979604j9636214j4109433M653335
701.6F94117129L2109976L9594233K5663614R890914k04027o121933j2278736j8694818
717.9G64076352j3718665M297853J3576210M079878q409023n929351P901251J4216661
734.3G80091166R239018J762987q23737M957080J0325253O312967j717568p078111
750.6H03069055j1198461j6876221k1603882k2625446l0558706n3522586o1974109
764.9E84709644k5874257J6533077K6966214L9366722O2615454N9917808L6583722
779.1H00818384J8527150Q691549L393889J988768K438069J700401p60317l105998
795.4H33691895l193200P1347L893256M288614K666414J425147k0683j432538j659393
$$ plain form
813.8 839730859 838346660 835984886 831674755 826295674 821062505 815376759 806663930 792534649
830.1 792534649 775172532 763215184 762925923 767704070 765388310 749732792 716395199 663774133
846.4 663774133 609882295 592082858 630313993 700845182 764049113 803179085 823687613
860.7 823687613 834315300 839571595 841219187 840303659 837727845 835171402 834527254 835857153 837857366
879.1 837857366 839269280 838730276 835017979 828417659 821717918 818605781 820489287 826181412 833371341
897.4 833371341 839481592 842919171 844004571 844145060 844294906 844266236 843517005 842308939 841362417
915.8 841362417 840664387 839475095 837460876 834983289 832380414 829392731 825042546 818035007 808313191
934.1 808313191 798743844 793710053 794754028 799063027 802350461 801400542 795078814 784334064
$$ packed form
813.8H39730859j384199k361774m310131n379081n233169n685746q712829j4129281
830.1G92534649j7362117j1957348k89261M778147k315760j5655518l3337593n2621066
846.4F63774133n3891838j7799437L8231135P0531189O3203931L9129972K0508528
860.7H23687613J0627687N256295J647592r15528k575814k556443o44148J329899K000213
879.1H37857366J411914n39004l712297o600320o699741l112137J883506N692125P189929
897.4H33371341O110251L437579J085400J40489J49846k8670p49231j208066r46522
915.8H41362417o98030j189292k014219k477587k602875k987683m350185p007539r721816
934.1H08313191r569347n033791J043975M308999L287434r49919o321728j0744750
$$ plain form
950.5 784334064 771543801 759830356 751494706 747472286 749963522 760162830 771467924 774050891
966.8 774050891 767918408 763073266 764394224 767200887 767885208 766773462 764186442 760308743 755703986
985.1 755703986 750779629 746407688 744080245 743545771 741398811 734139323 721408665 705310166
1001.4 705310166 688660800 673488259 658141673 642215490 633219898 633139133 633521199 632355630
1017.8 632355630 634170175 640118718 648410499 656923771 665420651 676902056 693070292 708824933
1034.1 708824933 716055155 712028801 701373816 690614045 682986081 679152608 679854631 684368670
1050.4 684368670 688634694 688659132 684154868 677637696 671830714 668180943 667289853 670376420 678290248
1068.8 678290248 690128028 704307437 719110012 732536614 742904186 749509752 752777040 753992438
$$ packed form
950.5G84334064j2790263j1713445q335650m022420K491236J0199308J1305094K582967
966.8G74050891o132483m845142J320958K806663O84321j111746k587020l877699m604757
985.1G55703986m924357m371941k327443n34474k146960p259488j2730658j6098499
1001.4G05310166j6649366j5172541j5346586j5926183q995592q0765L82066j165569
1017.8F32355630J814545N948543Q291781Q513272Q496880J1481405J6168236J5754641
1034.1G08824933P230222m026354j0654985j0759771p627964l833473P02023M514039
1050.4F84368670M266024K4438m504264o517172n806982l649771q91090L086567P913828
1068.8F78290248J1837780J4179409J4802575J3426602J0367572O605566L267288J215398
$$ plain form
1085.1 753992438 754129708 752672017 748166978 739270985 724874616 703740180 674415708 636401176
1101.4 636401176 594303310 561313868 551526308 561688244 572182119 576359272 588748395 619699776
1117.7 619699776 662487626 704178035 737450242 761677384 778323650 788819492 794799507
1132 794799507 798062503 799904287 800438225 799209356 796478629 793134093 789482951 784800410 778137863
1150.3 778137863 768843353 756085575 738702714 716742635 692981303 669884801 644584477
1164.6 644584477 610065162 565936148 537165344 561024010 633334517 707807243 753683686
1178.9 753683686 771973312 772071362 759538770 737333536 710793614 690745890 688535571 705860913
1195.2 705860913 732799590 757842243 776225686 787842333 793332517 793886840 791149616 786294520
$$ packed form
1085.1G53992438J37270j457691m505039q895993j4396369k1134436k9324472l8014532
1101.4F36401176m2097866l2989442r787560J0161936J0493875M177153J2389123L0951381
1117.7F19699776M2787850M1690409L3272207K4227142J6646266J0495842N980015
1132G94799507L262996J841784N33938j228869k730727l344536l651142m682541o662547
1150.3G78137863r294510j2757778j7382861k1960079k3761332k3096502k5300324
1164.6F44584477l4519315m4129014k8770804K3858666P2310507P4472726M5876443
1178.9G53683686J8289626R8050j2532592k2205234k6539922k0047724k210319J7325342
1195.2G05860913K6938677K5042653J8383443J1616647N490184N54323k737224m855096
$$ plain form
1211.5 786294520 780035257 772994161 765350163 756955922 748337865 740635514 734126270 728243113
1227.9 728243113 722336113 714944363 704417527 690976977 675917447 659403443 640575945 618743420
1244.2 618743420 593461454 564684212 534331799 505755782 480067283 457367480 443431616
1258.4 443431616 449679285 481918901 529190600 569201767 586866021 584009826 571515083 557222128
1274.8 557222128 542822361 528318048 515867949 510204494 515038252 529249251 548342824 568341553
1291.1 568341553 587845683 607568324 627451420 644667208 658347487 672118902 683838964
1305.4 683838964 683141232 665299118 635096490 600130081 570452154 557291627 565855563 590248525
1321.7 590248525 619106114 644312620 663022518 676091552 685508728 692863226 699647248 707595766
$$ packed form
1211.5G86294520o259263p041096p643998q394241q618057p702351o509244n883157
1227.9G28243113n907000p391750j0526836j3440550j5059530j6514004j8827498k1832525
1244.2F18743420k5281966k8777242l0352413k8576017k5688499k2699803j3935864
1258.4D43431616O247669L2239616M7271699M0011167J7664254k856195j2494743j4292955
1274.8E57222128j4399767j4504313j2450099n663455M833758J4210999J9093573J9998729
1291.1E68341553J9504130J9722641J9883096J7215788J3680279J3771415J1720062
1305.4F83838964o97732j7842114l0202628l4966409k9677927j3160527Q563936K4392962
1321.7E90248525K8857589K5206506J8709898J3069034R417176P354498O784022P948518
$$ plain form
1338 707595766 717640877 728937328 740244746 750709116 759386480 765628397 769300640 770953357
1354.3 770953357 771606207 772271991 773491800 775362134 777447462 779118001 780160487 780792832 781532526
1372.7 781532526 782819152 784838498 787203610 788952231 789350688 788212597 783488393 772273242
1389 772273242 757010639 745593965 747303009 761502743 777509451 787670135 791537464 790970683
1405.3 790970683 786639214 778787255 765738189 748154163 734903514 732565045 738437712 746023655
1421.6 746023655 747126639 734211206 705596745 665398121 625769734 596878469 586321950
1435.9 586321950 607495129 646102190 678891182 697946012 706631243 713708699 724107206 735911727
1452.2 735911727 745034575 747092962 733539402 707293153 682565987 675967515 686023712 687895179
$$ packed form
1338G07595766J0045111J1296451J1307418J0464370Q677364O241917L672243J652717
1354.3G70953357O52850O65784J219809J870334K085328J670539J042486O32345P39694
1372.7G81532526J286626K019346K365112J748621L98457j138091m724204j1215151
1389G72273242j5262603j1416674J709044J4199734J6006708J0160684L867329n66781
1405.3G90970683m331469p851959j3049066j7584026j3250649k338469N872667P585943
1421.6G46023655J102984j2915433k8614461m0198624l9628387k8891265j0556519
1435.9E86321950K1173179L8607061L2788992J9054830Q685231P077456J0398507J1804521
1452.2G35911727R122848K058387j3553560k6246249k4727166o598472J0056197J871467
$$ plain form
1468.5 687895179 680676162 677950203 683483064 693825126 704384923 716825128 737979114 763926506
1484.9 763926506 786259174 802092969 811664760 816565573 818865716 818442166 813808680 805443287
1501.2 805443287 793520272 767438054 710509300 661533415 657485485 692723572 743587077
1515.4 743587077 785653889 810916185 826274872 835924804 841531515 845279932 847747624 849453986
1531.8 849453986 850375056 850703478 850861251 850622296 849996090 849635899 849520385 849583685 849641383 849619687
1552.2 849619687 849666238 849693358 848861217 846806407 845279157 843804240 841808259 838928342 835161865
1570.5 835161865 831815600 827452719 818490624 807144105 798065841 792949736 790398717 786006451
1586.8 786006451 778003454 767438769 755388319 742040873 726388037 706092358 678407371
$$ packed form
1468.5F87895179p219017k725959N532861J0342062J0559797J2440205K1153986K5947392
1484.9G63926506K2332668J5833795R571791M900813K300143m23550m633486q365393
1501.2H05443287j1923015k6082218n6928754m8975885m047930L5238087N0863505
1515.4G43587077M2066812K5262296J5358687R649932N606711L748417K467692J706362
1531.8H49453986R21070L28422J57773k38955o26206l60191j15514O3300N7698k1696
1552.2H49619687M6551K7120q32141k054810j527250j474917j995981k879917l766477
1570.5H35161865l346265m362881q962095j1346519r078264n116105k551019m392266
1586.8G86006451q002997j0564685j2050450j3347446j5652836k0295679k7684987
$$ plain form
1601.1 678407371 642116606 599895597 559980512 539143443 553960323 599076986 657945633
1615.4 657945633 712941825 744814932 760594726 770826817 777479231 782336771 786688089 790576637
1631.7 790576637 794416189 798349977 801113665 802770793 804082751 805250168 806316733 807380199
1648 807380199 808515012 809723973 810804784 811664701 812731922 814090788 815472901 816465735 816974461
1666.4 816974461 816547513 814614415 811500430 806235909 799534559 796569169 799328148 805407941
1682.7 805407941 810296655 810448945 807220101 802571774 798188031 792485714 784104288 773354769
1699 773354769 758802772 744494855 728831112 708897054 686521590 660032630 626018465 580060422
1715.3 580060422 521452248 471422285 441135883 420282513 412499815 430191964 475034386
$$ packed form
1601.1F78407371l6290765m2221009l9915085k0837069J4816880M5116663N8868647
1615.4F57945633N4996192L1873107J5779794J0232091O652414M857540M351318L888548
1631.7G90576637L839552L933788K763688J657128J311958J167417J066565J063466
1648H07380199J134813J208961J080811Q59917J067221J358866J382113R92834N08726
1666.4H16974461m26948j933098l113985n264521o701350k965390K758979O079793
1682.7H05407941M888714J52290l228844m648327m383743n702317q381426j0749519
1699G73354769j4551997j4307917j5663743j9934058k2375464k6488960l4014165m5958043
1715.3E80060422n8608174n0029963l0286402k0853370p782698J7692149M4842422
$$ plain form
1729.6 475034386 535161734 603333712 661659956 697562218 725874364 750008881 767697155
1743.9 767697155 781279445 792145669 801082611 808127642 813515246 818015039 821721435 824420333
1760.2 824420333 826819181 829635084 833175123 837173879 840705454 843270063 844883740 845907867
1776.5 845907867 846566796 847049415 847652733 848509014 849357188 850019574 850718915 852087915 854289949
1794.9 854289949 856715977 859043717 861286998 863447905 865243554 866459548 867274463 868239284 869545579
1813.2 869545579 870797873 871640623 872166514 872649252 873031199 873234153 873510242 874089718 874786794
1831.6 874786794 875256479 875403583 875502527 875827134 876152277 876034617 875672638 875636995 875787437 875748515
1852 875748515 875456572 875237584 875288486 875367522 875224054 875059664 875164986 875344276 875238657 874948919
$$ packed form
1729.6D75034386O0127348O8171978N8326244L5902262K8312146K4134517J7688274
1743.9G67697155J3582290J0866224Q936942P045031N387604M499793L706396K698898
1760.2H24420333K398848K815903L540039L998756L531575K564609J613677J024127
1776.5H45907867O58929M82619O03318Q56281Q48174O62386O99341J369000K202034
1794.9H54289949K426028K327740K243281K160907J795649J215994Q14915R64821J306295
1813.2H69545579J252294Q42750N25891M82738L81947K02954K76089N79476O97076
1831.6H74786794M69685J47104R8944L24607L25143j17660l61979l5643J50442l8922
1852H75748515k91943k18988N0902P9036j43468j64390J05322J79290j05619k89738
$$ plain form
1872.4 874948919 874807417 874835670 874702990 874183297 873575509 873285830 873234391 872941911 872282743 871677995
1892.8 871677995 871156991 870293498 868902385 867338896 866027832 864835978 863212943 861066341 859239399
1911.1 859239399 858556807 858656347 858429492 857135534 854276061 849334955 843904376 841973901 845714390
1929.5 845714390 852732420 858977675 862805486 864749432 865534842 865421474 864800155 864519835 865052462
1947.9 865052462 866127610 867122233 867678165 867948413 868166387 868231833 867986262 867638826 867549002 867839456
1968.3 867839456 868319213 868791223 869261324 869720817 869913399 869638503 869082212 868546605 868036747 867364824
1988.7 867364824 866581917 866004169 865795255 865657151 865283132 864848495 864671707 864635170 864317894 863594472
2009 863594472 862728417 861935437 861118495 860118330 859036028 858116031 857374012 856751263 856420219 856399775
$$ packed form
1872.4H74948919j41502K8253j32680n19693o07788k89679n1439k92480o59168o04748
1892.8H71677995n21004q63493j391113j563489j311064j191854j623035k146602j826942
1911.1H59239399o82592R9540k26855j293958k859473m941106n430579j930475L740489
1929.5H45714390P018030O245255L827811J943946P85410j13368o21319k80320N32627
1947.9H65052462J075148R94623N55932K70248K17974O5446k45571l47436q9824K90454
1968.3H67839456M79757M72010M70101M59493J92582k74896n56291n35607n09858o71923
1988.7H67364824p82907n77748k08914j38104l74019m34637j76788l6537l17276p23422
2009H63594472q66055p92980q16942j000165j082302r19997p42019o22749l31044k0444
$$ plain form
2029.4 856399775 856395960 856189966 855829060 855627000 855877936 856487155 857131481 857724309 858415067 859152079
2049.8 859152079 859596968 859532714 859139085 858716190 858273327 857630551 856823742 856133223 855699539 855387032
2070.2 855387032 855098605 854962468 855130911 855578482 856162190 856821239 857615292 858511865 859321713 859977484
2090.6 859977484 860634804 861336172 861892164 862215459 862523794 863068581 863754094 864248097 864429653 864455104
2111 864455104 864470720 864468455 864405751 864356577 864440382 864628434 864785314 864887953 865028679 865212202 865325272
2133.5 865325272 865293324 865163147 865045190 864968300 864885330 864801586 864761472 864767790 864777744 864808440 864952385
2155.9 864952385 865262747 865657210 865973949 866150260 866249144 866332054 866438925 866545916 866572320 866537869
2176.3 866537869 866494834 866454661 866422832 866411805 866432965 866439700 866382360 866305053 866274238 866266549 866240621 866174698
$$ packed form
2029.4H56399775l815k05994l60906k02060K50936O09219O44326N92828O90758P37012
2049.8H59152079M44889o4254l93629m22895m42863o42776q06809o90519m33684l12507
2070.2H55387032k88427j36137J68443M47571N83708O59049P94053Q96573Q09848O55771
2090.6H59977484O57320P01368N55992L23295L08335N44787O85513M94003J81556K5451
2111H64455104J5616k265o2704m9174Q3805J88052J56880J02639J40726J83523J13070
2133.5H65325272l1948j30177j17957p6890q2970q3744m0114O318R954L0696J43945
2155.9H64952385L10362L94463L16739J76311R8884Q2910J06871J06991K6404l4451
2176.3H66537869m3035m0173l1829j1027K1160O735n7340p7307l0815p689k5928o5923
$$ plain form
2200.8 866174698 866070211 865943313 865768731 865516305 865216851 864942551 864711285 864495516 864259839 863960445
2221.2 863960445 863591135 863231242 862956643 862735331 862535834 862389326 862291098 862216353 862164080 862112880
2241.6 862112880 862031579 861915410 861766458 861558795 861321867 861140966 861010551 860854387 860623658 860285342
2262 860285342 859806716 859187722 858491540 857813239 857205153 856727242 856465399 856457055 856600702 856672943
2282.3 856672943 856548607 856300294 856096804 856038332 856087625 856096148 855922997 855552435 854963720 854090929
2302.7 854090929 853075802 852313876 852055132 852140486 852261662 852237761 851965129 851414621 850726962 850148141
2323.1 850148141 849794686 849541068 849252701 849004388 848868728 848707855 848470688 848264396 848193944 848433793
2343.5 848433793 849253893 850260019 850414097 849280000 847400188 845636308 844334781 843556583 843300402
$$ packed form
2200.8H66174698j04487j26898j74582k52426k99454k74300k31266k15769k35677k99394
2221.2H63960445l69310l59893k74599k21312j99497j46508r8228p4745n2273n1200
2241.6H62112880q1301j16169j48952k07663k36928j80901j30415j56164k30729l38316
2262H60285342m78626o18994o96182o78301o08086m77911k61843q344J43647P2241
2282.3H56672943j24336k48313k03490n8472M9293Q523j73151l70562n88715q72791
2302.7H54090929j015127p61926k58744Q5354J21176k3901k72632n50508o87659n78821
2323.1H50148141l53455k53618k88367k48313j35660j60873k37167k06292p0452K39849
2343.5H48433793Q20100J006126J54078j134097j879812j763880j301527p78198k56181
$$ plain form
2361.9 843300402 843504846 844021440 844657660 845312238 845941126 846470416 846878469 847239494 847673833 848201692
2382.3 848201692 848676920 848948836 849015355 848975062 848865807 848649621 848348618 848083735 847917616 847797036
2402.7 847797036 847760022 847961307 848436892 849005640 849450171 849750936 850004375 850202501 850278318 850253344
2423.1 850253344 850200176 850157380 850095570 849936962 849706233 849526286 849414110 849278212 849094272 848909795
2443.5 848909795 848711073 848412097 848002553 847606182 847315490 847075045 846744299 846237719 845589638 844857275
2463.9 844857275 844059289 843260825 842608511 842172325 841876268 841639280 841503620 841534197 841662049 841789365
2484.3 841789365 841945350 842246413 842747211 843332589 843818009 844149232 844378114 844518006 844517112 844341934
2504.7 844341934 844041944 843669295 843181729 842534184 841814339 841198564 840761483 840416849 840104282 839828730
$$ packed form
2361.9H43300402K04444N16594O36220O54578O28888N29290M08053L61025M34339N27859
2382.3H48201692M75228K71916O6519m0293j09255k16186l01003k64883j66119j20580
2402.7H47797036l7014K01285M75585N68748M44531L00765K53439J98126P5817k4974
2423.1H50253344n3168m2796o1810j58608k30729j79947j12176j35898j83940j84477
2443.5H48909795j98722k98976m09544l96371k90692k40445l30746n06580o48081p32363
2463.9H44857275p97986p98464o52314m36186k96057k36988j35660L0577J27852J27316
2484.3H41789365J55985L01063N00798N85378M85420L31223K28882J39892q94j75178
2504.7H44341934k99990l72649m87566o47545p19845o15775m37081l44634l12567k75552
$$ plain form
2525.1 839828730 839538515 839140296 838595271 837945282 837226272 836430132 835586548 834794819 834129155 833593965
2545.5 833593965 833129168 832638502 832128048 831685245 831295431 830915272 830624878 830585480 830878496 831387162
2565.8 831387162 831933081 832423389 832782984 832886040 832605779 831977487 831228197 830602944 830246150 830110431
2586.2 830110431 829981029 829708278 829291344 828820050 828457117 828331053 828445435 828697026 828939140 829025984
2606.6 829025984 828821361 828242242 827320635 826221883 825158596 824237823 823461771 822847962 822454870
2625 822454870 822317481 822363973 822480321 822664082 822961330 823330462 823636651 823793411 823848009 823832989
2645.4 823832989 823662579 823265195 822701871 822062731 821397007 820762575 820209444 819758952 819445014 819263756
2665.8 819263756 819123387 818962991 818742990 818355441 817752838 817005277 816187024 815377831 814682126 814159274
$$ packed form
2525.1H39828730k90215l98219n45025o49989p19010p96140q43584p91729o65664n35190
2545.5H33593965m64797m90666n10454m42803l89814l80159k90394l9398K93016N08666
2565.8H31387162N45919M90308L59595J03056k80261o28292p49290o25253l56794j35719
2586.2H30110431j29402k72751m16934m71294l62933j26064J14382K51591K42114Q6844
2606.6H29025984k04623n79119r21607j098752j063287r20773p76052o13809l93092
2625H22454870j37389M6492J16348J83761K97248L69132L06189J56760N4598j5020
2645.4H23832989j70410l97384n63324o39140o65724o34432n53131m50492l13938j81258
2665.8H19263756j40369j60396k20001l87549o02603p47561q18253q09193o95705n22852
$$ plain form
2686.2 814159274 813801467 813550711 813334227 813111067 812883914 812653899 812343061 811873913 811259687 810542285
2706.6 810542285 809736490 808828592 807848155 806889176 805984914 805101573 804233909 803396583 802605748 801824391
2727 801824391 800985456 800136387 799346566 798579097 797744274 796808422 795855403 794987679 794242680 793601632
2747.4 793601632 792981088 792290211 791521609 790689051 789741099 788606822 787257016 785744667 784208655
2765.7 784208655 782861233 781899691 781367958 781087816 780713081 779995561 778955817 777679980 776201904
2784.1 776201904 774590850 772830069 770752847 768337429 765754879 763100147 760297835 757226467
2800.4 757226467 753923535 750540078 747274518 744305313 741478324 738380015 734749436 730583489
2816.7 730583489 725952208 720822096 715091228 708633661 701264143 692763746 682812929 670914531
$$ packed form
2686.2H14159274l57807k50756k16484k23160k27153k30015l10838m69148o14226p17402
2706.6H10542285q05795r07898r80437r58979r04262q83341q67664q37326p90835p81357
2727H01824391q38935q49069p89821p67469q34823r35852r53019q67724p44999o41048
2747.4G93601632o20544o90877p68602q32558r47952j134277j349806j512349j536012
2765.7G84208655j347422r61542n31733k80142l74735p17520j039744j275837j478076
2784.1G76201904j611054j760781k077222k415418k582550k654732k802312l071368
2800.4G57226467l302932l383457l265560k969205k826989l098309l630579m165947
2816.7G30583489m631281n130112n730868o457567p369518q500397r950817j1898398
$$ plain form
2833 670914531 656471789 638717353 616555512 589131951 556953907 523421943 497192353 489623368
2849.3 489623368 503426373 527115524 547215402 560697436 571639776 584041536 599239171
2863.6 599239171 614449620 625027239 628836751 626612365 620370567 613214374 608798981 609067857
2879.9 609067857 612864017 617392957 620407403 620919108 618793786 614360034 608363569 601740539
2896.3 601740539 595052660 588137388 580263376 570532143 557938099 541446209 520498633 495657742
2912.6 495657742 470440716 452491969 448453933 457092702 471691042 487294734 501880705 513523459
2928.9 513523459 520188570 521272957 518249512 515353680 518796265 532390296 554107547 578384995
2945.2 578384995 600685537 618912041 632359147 640976787 645586491 648305118 652087212 659281313
$$ packed form
2833F70914531j4442742j7754436k2161841k7423561l2178044l3531964k6229590p568985
2849.3D89623368J3803005K3689151K0099878J3482034J0942340J2401760J5197635
2863.6E99239171J5210449J0577619L809512k224386o241798p156193m415393K68876
2879.9F09067857L796160M528940L014446N11705k125322m433752n996465o623030
2896.3F01740539o687879o915272p874012r731233j2594044j6491890k0947576k4840891
2912.6D95657742k5217026j7948747m038036Q638769J4598340J5603692J4585971J1642754
2928.9E13523459O665111J084387l023445k895832L442585J3594031K1717251K4277448
2945.2E78384995K2300542J8226504J3447106Q617640M609704K718627L782094P194101
$$ plain form
2961.5 659281313 670558989 685073495 700893462 715680182 728065133 738008022 745924175 752252698
2977.8 752252698 757309258 761182725 764079154 766395390 768388271 770206988 771836400 773072481
2994.2 773072481 773882985 774243414 774044693 773332477 772002637 769801438 766824841 763559639 760672331
3012.5 760672331 758940637 759007156 760922849 764006555 767189085 769546390 770728946 770937860 770456314
3030.9 770456314 769527376 768508494 767938435 768408358 769819021 771301746 772066295 771853089 770961404
3049.2 770961404 770070255 770022571 771223068 772932351 773939252 773650110 772349119 771069527 770459771
3067.6 770459771 769846499 768295109 765936434 764181793 764678955 767413199 770575583 772571743 773112416
3085.9 773112416 772710681 771829903 770581782 769066393 767442346 765774965 764124572 762785912 762167275
$$ packed form
2961.5F59281313J1277676J4514506J5819967J4786720J2384951R942889P916153O328523
2977.8G52252698N056560L873467K896429K316236J992881J818717J629412J236081
2994.2G73072481Q10504L60429j98721p12216j329840k201199k976597l265202k887308
3012.5G60672331j731694O6519J915693L083706L182530K357305J182556K08914m81546
3030.9G70456314r28938j018882n70059M69923J410663J482725P64549k13206q91685
3049.2G70961404q91149m7684J200497J709283J006901k89142j300991j279592o09756
3067.6G70459771o13272j551390k358675j754641M97162K734244L162384J996160N40673
3085.9G73112416m01735q80778j248121j515389j624047j667381j650393j338660o18637
$$ plain form
3104.3 762167275 762244761 762431383 762170315 761590302 760996521 760185003 759030938 757735252 756432950
3122.6 756432950 755245924 754239321 753293872 752207696 750904679 749529362 748261392 747044146
3139 747044146 745604873 743909776 742184699 740550578 739065647 737643182 735930800 733865380 731869578
3157.3 731869578 730177104 728644669 727104902 725543439 724013150 722473860 720844865 719144523
3173.6 719144523 717494428 715914369 714273155 712519288 710781276 709171414 707599461 705934405
3189.9 705934405 704215825 702547610 700930417 699315071 697697639 696141183 694683850 693251550
3206.3 693251550 691759408 690274477 688904285 687604070 686243057 684760034 683244884 681759775
3222.6 681759775 680212915 678577542 676972270 675535679 674210548 672714412 671021879 669422448
$$ packed form
3104.3G62167275P7486J86622k61068n80013n93781q11518j154065j295686j302302
3122.6G56432950j187026j006603r45449j086176j303017j375317j267970j217246
3139G47044146j439273j695097j725077j634121j484931j422465j712382k065420j995802
3157.3G31869578j692474j532435j539767j561463j530289j539290j628995j700342
3173.6G19144523j650095j580059j641214j753867j738012j609862j571953j665056
3189.9G05934405j718580j668215j617193j615346j617432j556456j457333j432300
3206.3F93251550j492142j484931j370192j300215j361013j483023j515150j485109
3222.6F81759775j546860j635373j605272j436591j325131j496136j692533j599431
$$ plain form
3238.9 669422448 668033838 666758239 665529430 664291501 662934184 661521733 660238862 659072101
3255.2 659072101 657869935 656633198 655463040 654328048 653226435 652353466 651737690 650958121 649794221
3273.6 649794221 648546755 647415221 646328449 645221114 644152164 643190324 642327666 641569912 640837014
3291.9 640837014 639974892 638937354 637754023 636599541 635763049 635295630 634781659 633789420 632434070
3310.3 632434070 631119013 630048811 629094899 628097057 627111375 626275778 625570834 624713838 623612106
3328.6 623612106 622555256 621684074 620939136 620297551 619565547 618611395 617583394 616507292 615486383
3347 615486383 614762545 614045560 612928867 611647606 610576093 609698176 608788431 607803464 606970787
3365.4 606970787 606313229 605493426 604311228 603056431 602121711 601498187 600960374 600385249 599857986
$$ packed form
3238.9F69422448j388610j275599j228809j237929j357317j412451j282871j166761
3255.2F59072101j202166j236737j170158j134992j101613q72969o15776p79569j163900
3273.6F49794221j247466j131534j086772j107335j068950r61840q62658p57754p32898
3291.9F40837014q62122j037538j183331j154482q36492m67419n13971r92239j355350
3310.3F32434070j315057j070202r53912r97842r85682q35597p04944q56996j101732
3328.6F23612106j056850q71182p44938o41585p32004r54152j028001j076102j020909
3347F15486383p23838p16985j116693j281261j071513q77917r09745r84967q32677
3365.4F06970787o57558q19803j182198j254797r34720o23524n37813n75125n27263
$$ plain form
3383.7 599857986 599522471 599459946 599665940 599796534 599545121 599281907 599472165 599853396 599844158 599495351
3404.1 599495351 599317729 599335432 599226058 598873377 598263800 597458959 596756518 596613348 597389936 599013269
3424.5 599013269 601016998 602992475 604755759 606327295 607812285 609263599 610688269 612150669
3440.8 612150669 613743246 615416229 617107749 618832231 620616436 622423112 624170959 625893116
3457.1 625893116 627663612 629455447 631261766 633109689 634994149 636833191 638522744 640169680
3473.4 640169680 641927540 643893778 646004856 648000121 649893582 651901543 653948724 655912280
3489.8 655912280 657916248 660055161 662299275 664526165 666703284 668932915 671119213 673178315
3506.1 673178315 675312877 677645028 680124700 682597995 684934199 687236071 689633727 692171097
$$ packed form
3383.7E99857986l35515o2525K05994J30594k51413k63214J90258L81231r238l48807
3404.1E99495351j77622J7703j09374l52681o09577q04841p02441j43170P76588J623333
3424.5E99013269K003729J975477J763284J571536J484990J451314J424670J462400
3440.8F12150669J592577J672983J691520J724482J784205J806676J747847J722157
3457.1F25893116J770496J791835J806319J847923J884460J839042J689553J646936
3473.4F40169680J757860J966238K111078J995265J893461K007961K047181J963556
3489.8F55912280K003968K138913K244114K226890K177119K229631K186298K059102
3506.1F73178315K134562K332151K479672K473295K336204K301872K397656K537370
$$ plain form
3522.4 692171097 694647849 696875215 699045539 701315284 703710258 706270993 708791614 711055279
3538.7 711055279 713332832 715838850 718263805 720287919 722125530 724114478 726201177 728217959
3555 728217959 730241060 732386053 734549642 736550212 738440514 740503132 742707253 744763494 746720552
3573.4 746720552 748781025 750946999 753220439 755641878 758080482 760367095 762458324 764494121
3589.7 764494121 766530037 768545687 770592570 772665024 774610579 776399374 778180599 779998422
3606 779998422 781953394 784109712 786316454 788489819 790499628 792315841 794121683 795847714 797397435
3624.4 797397435 798753977 800049365 801580846 803095162 804411054 805570006 806601286 807590783
3640.7 807590783 808553398 809416413 810129106 810792148 811465919 812005222 812447309 813094854 813884854 814351857
$$ packed form
3522.4F92171097K476752K227366K170324K269745K394974K560735K520621K263665
3538.7G11055279K277553K506018K424955K024114J837611J988948K086699K016782
3555G28217959K023101K144993K163589K000570J890302K062618K204121K056241J957058
3573.4G46720552K060473K165974K273440K421439K438604K286613K091229K035797
3589.7G64494121K035916K015650K046883K072454J945555J788795J781225J817823
3606G79998422J954972K156318K206742K173365K009809J816213J805842J726031J549721
3624.4G97397435J356542J295388J531481J514316J315892J158952J031280R89497
3640.7H07590783R62615Q63015P12693O63042O73771N39303M42087O47545P90000M67003
$$ plain form
3661.1 814351857 814526439 814774990 815002501 814974070 814977527 814903736 814423740 814058900 813986659 814025939 814316154
3683.5 814316154 814932823 815839231 816691220 817191005 817626357 818079352 818365395 818487525 818617404 818844378
3703.9 818844378 819051087 819116712 818997741 818916500 819147766 819433630 819543242 819544911 819549024 819512367 819477558
3726.4 819477558 819566488 819687545 819832981 820012689 820179641 820399106 820396602 819788456 819104016 819156885
3746.7 819156885 819219768 818999588 819132984 819555223 819808900 819772899 819703817 819713712 819714785 819689155 819559991
3769.2 819559991 819402397 819347501 819352269 819369853 819357276 819303691 819212079 819113374 819080710 819085062 819077969 819055915
3793.7 819055915 819054484 819062948 818855584 818625033 818645418 818473876 818212330 818221807 818256915 818043470 817752004
3816.1 817752004 817665994 817480803 817297578 817337334 817311943 817217886 817136765 817132950 817231059 817197323 817006886
$$ packed form
3661.1H14351857J74582K48551K27511k8431L457p3791m79996l64840p2241L9280K90215
3683.5H14316154O16669R06408Q51989M99785M35352M52995K86043J22130J29879K26974
3703.9H18844378K06709O5625j18971q1241K31266K85864J09612J669M113l6657l4809
3726.4H19477558Q8930J21057J45436J79708J66952K19465k504o08146o84440N2869
3746.7H19156885O2883k20180J33396M22239K53677l6001o9082R895J073k5630j29164
3769.2H19559991j57594n4896M768J7584j2577n3585r1612r8705l2664M352p093k2054
3793.7H19055915j431Q464k07364k30551K0385j71542k61546R477L5108k13445k91466
3816.1H17752004q6010j85191j83225L9756k5391r4057q1121l815R8109l3736j90437
$$ plain form
3838.5 817006886 816899121 816831470 816806793 816878974 816938758 816711485 815984786 815512598 815581143 815526307 815247893
3861 815247893 814858735 814543128 814377725 814189136 814085126 814063489 814053237 814105868 814074457 814062595 814027190
3883.4 814027190 813743830 813429713 813074231 812576711 812243342 812147439 812045038 811811328 811470270 811115444
3903.8 811115444 810928941 810895145 810841441 810802579 810854077 810936749 811029255 811178148 811354697 811491668 811602652
3926.2 811602652 811688423 811746418 811852336 812026620 812111616 812036872 811945438 811899841 811838210 811738312 811648190
3948.7 811648190 811589360 811503530 811362922 811178565 810964525 810776591 810619652 810447872 810329616 810322404
3969.1 810322404 810363770 810364246 810298383 810250521 810273707 810321808 810341418 810285747 810165942 810056567 810009837
3991.5 810009837 810047567 810100198 810049951
$$ packed form
3838.5H17006886j07765o7651k4677P2181N9784k27273p26699m72188O8545n4836k78414
3861H15247893l89158l15607j65403j88589j04010k1637j0252N2631l1411j1862l5405
3883.4H14027190k83360l14117l55482m97520l33369r5903j02401k33710l41058l54826
3903.8H11115444j86503l3796n3704l8862N1498Q2672R2506J48893J76549J36971J10984
3926.2H11602652Q5771N7995J05918J74284Q4996p4744r1434m5597o1631r9898r0122
3948.7H11648190n8830q5830j40608j84357k14040j87934j56939j71780j18256p212
3969.1H10322404M1366M76o5863m7862K3186M8101J9610n5671j19805j09375m6730
3991.5H10009837L7730N2631n0247
$$ plain form
3997.6 810049951
$$ packed form
3997.6H10049951
##END=$$ End of the data block
