##TITLE=$$ Begin of the data block
##JCAMP-DX=5.00 $$ ACD/SpecManager v 10.08
##SPECTROMETER/DATA SYSTEM=Varian
##DATE=21 Jan 2013 16:06:18
##DATA TYPE=INFRARED SPECTRUM
##DATA CLASS=XYDATA
##ORIGIN=
##OWNER=
##NPOINTS=3735
##FIRSTX=399.26403809
##LASTX=4000.35498047
##MAXX=4000.35498047
##MINX=399.26403809
##MAXY=69.24292755
##MINY=30.92258835
##XFACTOR=1.0000000000
##YFACTOR=0.000000100000000
##FIRSTY=44.36316681
##DELTAX=0.96440572
##XUNITS=1/CM
##YUNITS=TRANSMITTANCE
##XYDATA=(X++(Y..Y))
399.3D43631668Q998909J1546288J364212j0646019M277649K18811o245041j094551
407D52051926M918060k221947n417099J238213l356743q07114k015266K746467M080582
415.7D51217079k825012p720680n887070J2630806n277939L103333J749611J398201
423.4D48388329L391113l779717J637001O23513k075997l728103k313118J310463Q38546
432.1D44292030k645111j882210O013070j174240m595643J36414Q75931q20732l358231
440.7D36841278O92101j394768k327194k631531n40619K092972K623749k50321k813682
449.4D32291985M818725K898369J259651l137016o723709K3155j190224J243935o60057
458.1D30824814K056122J404037k188148l76168l373832q05283j220550M6501o23017
$$ plain form
399.3 443631668 452630577 464176865 465541077 454895058 459172707 459391518 453146477 452051926
407 452051926 456969986 454748039 449330940 450569153 447212410 446405296 444390030 447136497 451217079
415.7 451217079 448392067 440671387 434784317 447415123 442137184 445240517 446990128 448388329
423.4 448388329 451779442 447999725 449636726 450260239 448184242 444456139 442143021 443453484 444292030
432.1 444292030 441646919 439764709 445777779 444603539 440007896 440144310 441020241 440199509 436841278
440.7 436841278 437533379 436138611 433811417 431179886 430639267 432732239 435355988 435105667 432291985
449.4 432291985 437110710 440009079 441268730 438131714 431408005 431431160 430240936 431484871 430824814
458.1 430824814 432880936 434284973 432096825 431720657 428346825 427541542 426320992 426367493 425744476
466.8D25744476K554970P142143o20155J333199j992035j0158463r55887O841889L680839
475.5D33570976l793106l290481n88189K04850j344185J967621Q32939k84081J641846
484.1D28918190j798935j490059l121338R1934k43339J77078K039833j696892p85446
492.8D22091026j718483J489334O37131o39267K620697N62363p95441l669662m394112
501.5D16183586k647972M03214j235466Q86192K890472L24402K163849k469749k636681
510.2D13861847q7433j061592j158791k19650M788933J046944l386689k904815L36609
518.9D11215363J277046k754326j936989j386185J484185J818962r5749n64308l02353
527.5D08755646J220321j051864m006081l194046J453018P00455J17111J483002L39432
$$ plain form
466.8 425744476 428299446 435441589 434821434 436154633 434162598 424004135 423048248 429890137 433570976
475.5 433570976 429777870 426487389 425899200 426104050 424759865 426727486 427560425 427276344 428918190
484.1 428918190 427119255 425629196 422507858 422599792 422356453 422533531 424573364 422876472 422091026
492.8 422091026 420372543 421861877 422499008 421859741 424480438 425042801 424247360 420577698 416183586
501.5 416183586 413535614 413938828 412703362 413589554 416480026 416804428 418968277 416498528 413861847
510.2 413861847 413774414 412712822 411554031 411334381 416123314 417170258 413783569 410878754 411215363
518.9 411215363 412492409 409738083 407801094 406414909 407899094 409718056 409622307 409057999 408755646
527.5 408755646 409975967 408924103 404918022 401723976 403176994 403877449 403994560 405477562 405816994
536.2D05816994J235237l91808l91273j528626j670570p74918k145958N04418M14390
544.9D01067886J990013J125832l086624j797295j98936q44345k694664j651535j239395
553.6C92670937k51809J342202J191787r05151j293259K79465l212662j886139J98899
562.3C88134270P2975J374359K284966K955741l003463l445740J347198m5814k147255
570.9C87527237l23715J908531q0338q7280N67932J292572K48223j614800j081238
579.6C88357124j766472q201J129532J656799J093597j501770j275100k05574o94924
588.3C86785011j286888J13754j024093j462212p38678r918J038895p35855o08902
597C82071114k201157j346855N1117q96302l48854j688957M47808J541786O00013j502189
$$ plain form
536.2 405816994 407052231 406660423 406269150 404740524 403069954 402295036 400149078 400653496 401067886
544.9 401067886 403057899 404183731 401097107 399299812 399100876 398256531 395561867 393910332 392670937
553.6 392670937 392419128 393761330 394953117 394047966 392754707 393034172 389821510 387935371 388134270
562.3 388134270 388207245 389581604 391866570 394822311 391818848 388373108 389720306 389674492 387527237
570.9 387527237 387203522 389112053 389031715 388944435 389512367 390804939 391053162 389438362 388357124
579.6 388357124 386590652 386582451 387711983 389368782 390462379 388960609 387685509 387479935 386785011
588.3 386785011 385498123 385611877 384587784 383125572 382386894 382376976 383415871 382680016 382071114
597 382071114 379869957 378523102 378574219 377677917 377329063 375640106 376087914 377629700 378229713 376727524
606.6C76727524k814865p37152p30820K8648m7722Q51632Q47854j77078M74892L8757
616.3C74461670R91554j70631j029740K30065J105270P44515J356773K662621J112976
624.9C81465073J154213N55191J26724O80580j27830K41966J249923K560578K656975
633.6C90563393K631149N98221r33647J30767k28881Q01353P35054j87263N07392K300873
643.3C96918411K550354R45168k06375o71120M53072j401825j151314J728859K204780
651.9D01370010K378083O49452K89993n50728n81665Q8311r53904K62070K57416R37614
661.6D04146652J588173J292343J539269J086311N23262p18727p51686Q35762M66385
670.3D10007744J275101K033920J575165J312332J651153l7346j4381l51219p84264
$$ plain form
606.6 376727524 373912659 373175507 372444687 372473335 372425613 373277245 374125099 373948021 374422913 374461670
616.3 374461670 375453224 375282593 374252853 374482918 375588188 376332703 377689476 380352097 381465073
624.9 381465073 382619286 383174477 383301201 383981781 383853951 384095917 385345840 387906418 390563393
633.6 390563393 393194542 393792763 392859116 392989883 392761002 393562355 394297409 394110146 394617538 396918411
643.3 396918411 399468765 400413933 400207558 399536438 399989510 398587685 397436371 399165230 401370010
651.9 401370010 403748093 404397545 404687538 404136810 403555145 403643456 402689552 402951622 403209038 404146652
661.6 404146652 405734825 407027168 408566437 409652748 410176010 409457283 408705597 409541359 410007744
670.3 410007744 411282845 413316765 414891930 416204262 417855415 417818069 417803688 417452469 416668205
678.9D16668205N79720P54356J203232K084198K524872l05290j269074k21558j109771
687.6D20908890L76549J116676P33566P58553J214790J150322l1319n19180n60188
696.3D25148659M60853K7504j66664Q15315J426621J619186L89977J72157N33943K63062
705.9D30690613j283608j916694o49376R47532K428284J977081K199746J159210q74405
714.6D34678383j020355r45702M05731R87320Q71124J527329K264061J102714O1646
723.3D39932251P58781K4567J54343K40097N073N26619R90029K234153J619835O82564
733D47168312N68619n29938j173363n24215n94101N19256L129425K675667J501465
741.6D52741127K49939m71649k91023o08139k7428M16450J136093J206170J964798
$$ plain form
678.9 416668205 417247925 418002281 419205513 421289711 423814583 423509293 422240219 422018661 420908890
687.6 420908890 421285439 422402115 423135681 423894234 425109024 426259346 426228027 425708847 425148659
696.3 425148659 425609512 425637016 425470352 426285667 427712288 429331474 429721451 429893608 430427551 430690613
705.9 430690613 429407005 427490311 426840935 427788467 430216751 432193832 434393578 435552788 434678383
714.6 434678383 433658028 432712326 433118057 434105377 434976501 436503830 438767891 439870605 439932251
723.3 439932251 440691032 440715599 440869942 441110039 441115112 441641731 442631760 444865913 446485748 447168312
733 447168312 447736931 447206993 446033630 445509415 444915314 445434570 448563995 451239662 452741127
741.6 452741127 452991066 452519417 452228394 451620255 451592827 452009277 453145370 454351540 456316338
750.3D56316338K178382J101304M0779j214218N99250L8033n60417J310463J756935
759D61566849K350769K50435j02043J264724O34880q7814l43742J09558m196J394233
768.6D67033653K118988J963616J541290L36189M34227K97203r8991j484833J08910
777.3D72250252J936149Q89244J946373J612168L70216K12898M12445m4403m42619
786D79142723K89154J063919K348213J559143J202012J060066j54419K89154K38800
794.7D87038765j24207N61219J885948J085281O73142J389847J156921P32765r57642
803.4D93442039K8000J201134O19736Q27370R49745J052856R25255J467514J073761
812E01587410P73926o4011p02171O88476O46248P75795Q75855J098900J553955J309890
$$ plain form
750.3 456316338 458494720 459596024 459636803 458422585 459021835 459059868 458499451 459809914 461566849
759 461566849 463917618 464168053 464066010 465330734 465965614 465877800 465534058 465643616 465639420 467033653
768.6 467033653 469152641 471116257 472657547 472993736 473427963 473725166 473626175 472141342 472250252
777.3 472250252 474186401 475075645 477022018 478634186 479004402 479217300 479629745 479585342 479142723
786 479142723 479431877 480495796 482844009 484403152 485605164 486665230 486510811 486799965 487038765
794.7 487038765 486914558 487475777 489361725 490447006 491120148 492509995 493666916 494399681 493442039
803.4 493442039 493470039 494671173 495290909 496118279 497068024 498120880 499046135 500513649 501587410
812 501587410 502361336 502297325 501595154 502283630 502929878 503705673 504581528 505680428 507234383 508544273
821.7E08544273O09284n35584n53894l08876M28505P95517J257324J528893J162224
830.4E12927666J010475N20553M1314j364861l04451J406098J695594J698456O09169
839E18240013M43154K99873J034813K289j364975n81170J54305J582222P71141P40051
848.7E21321716J238861L44468k61002r68514n34286q03947j274033n76782J102905
857.4E19589386Q80661L41911N92270m75387q2093j41678l05747o62003q58498J13526
867E18992348L73420J2017r21784m52804j353073k323800j963958j741791r76563r72824
876.7E08671188r99069j702843j322593k198525l634109k691193k311554k557754k693901
885.3D88559647j668320k478294k239876j273766k087402j535721j899948j744194
$$ plain form
821.7 508544273 509153557 508617973 508064079 507755203 508183708 508979225 510236549 511765442 512927666
830.4 512927666 513938141 514458694 514500008 513135147 512830696 514236794 515932388 517630844 518240013
839 518240013 518683167 518983040 520017853 520020142 518655167 518073997 518228302 519810524 520581665 521321716
848.7 521321716 522560577 522905045 522644043 521675529 521141243 520337296 519063263 518486481 519589386
857.4 519589386 520470047 520811958 521404228 520928841 520846748 520705070 520399323 519737320 518878822 518992348
867 518992348 519365768 519377785 518456001 518003197 516650124 514326324 512362366 510620575 509644012 508671188
876.7 508671188 507672119 505969276 504646683 502448158 498814049 496122856 493811302 491253548 488559647
885.3 488559647 486891327 484413033 482173157 480899391 478811989 477276268 475376320 473632126
893D73632126j341057j055107o61240m84810J97182N34783R94720J16043l20244j86920
902.7D71425476R6054P71637J052475J716957J280518R27086O94236J121827K30712
911.4D79316978j129226M50554M28848K49901l51181r69162m54407q11119r72672j753578
921D74004936j303177o62117n54084r73168j853294j567269p10716p34253k229843
929.7D63417015j710319j778870k125969j557007j822204j168290j504898j270523
937.4D50478935j298408k012787k377167k187042j435356k068024r45129k77863m37622
946.1D37439537O2332o22177j168861j217690q58764j455307j031876j22261n0545
954.8D30974388J81389q95805j534691j671486j357575j230812j767273j651344j294784
$$ plain form
893 473632126 472291069 471235962 470574722 470089912 470287094 470821877 471816597 471932640 471612396 471425476
902.7 471425476 471521530 472293167 473345642 475062599 476343117 477270203 477964439 479086266 479316978
911.4 479316978 478187752 478638306 479067154 479317055 478965874 477996712 477542305 476731186 475758514 474004936
921 474004936 472701759 472039642 471485558 470512390 468659096 467091827 466381111 465646858 463417015
929.7 463417015 461706696 459927826 457801857 456244850 454422646 453254356 451749458 450478935
937.4 450478935 449180527 447167740 444790573 442603531 441168175 439100151 438155022 437877159 437439537
946.1 437439537 437501869 436879692 435710831 434493141 433634377 432179070 431147194 431024933 430974388
954.8 430974388 431155777 430259972 428725281 427053795 425696220 424465408 422698135 421046791 419752007
963.4D19752007o67305p07741r55200j045647r50203j226502k011642r55887j54609
972.1D11077271j068039l98293O07033p8430k53067p51992j456604j000404p31888
980.8D05945587o57463r45778j082992p21016n78385q29734j221467j629905k006722
989.5C96272125j808357r98116m01229p23725l47786k82325k57988o6185j380272j489525
999.1C88516617j390572q87184J37787K98424K97203n10025o68488n43556n91774j162109
1008.8C83496323j299057j181260q59756O39954j70212l85208K1972j51786l90435
1017.5C79720535j774826j323509q14972o18896m31328K80685Q81615k19498q61282
1026.1C74838524j086502m78859j011048j125259k17857j62773M52613N31731O38619
$$ plain form
963.4 419752007 419084702 418376961 417421761 416376114 415425911 414199409 412187767 411231880 411077271
972.1 411077271 410009232 409610939 410217972 410139542 409886475 409134483 407677879 406677475 405945587
980.8 405945587 405288124 404342346 403259354 402538338 401959953 401130219 399908752 398278847 396272125
989.5 396272125 394463768 393465652 393064423 392340698 391992912 391710587 391452599 391386414 390006142 388516617
999.1 388516617 387126045 386238861 386376648 386675072 386972275 386462250 385793762 385250206 384658432 383496323
1008.8 383496323 382197266 381016006 380156250 380796204 380625992 380240784 380262756 380110970 379720535
1017.5 379720535 377945709 376622200 375807228 375188332 374757004 375037689 375919304 375699806 374838524
1026.1 374838524 373752022 373273163 372262115 371136856 370918999 370756226 371208839 371740570 372379189
1034.8C72379189j48316j057281p90406o4392o5117m37851K30828Q1215J48735J602
1044.5C70278206k12174p64122r81369l38478p85217n72929q10280M98695R27010J50337
1054.1C67389679N04646j008529j354523j430512o79473n19371p55578M67644K46658
1062.8C62860641M52576J62850N03120k81982j137581q43621j081504L92685L85932
1071.5C61413116M49906L46870J60027J60332l00637k49786j082497l89251m09432
1080.1C60098648q3122L66745K97050N63622l78151q6975n95055n20096r62639m53949
1089.8C58246078J265221O37436J261902J76239o65169m17518n82734m03785m60701
1098.5C59056969M79469L72887O64901L59116j80016j79901M9324M43955o45027q5450
$$ plain form
1034.8 372379189 372230873 371173592 370383186 370318794 370253677 369815826 370046654 370127869 370276604 370278206
1044.5 370278206 370066032 369301910 368320541 367982063 367196846 366623917 365813637 366312332 367239342 367389679
1054.1 367389679 367894325 366885796 365531273 364100761 363421288 362901917 362146339 362613983 362860641
1062.8 362860641 363313217 363476067 363979187 363697205 362559624 361716003 360634499 361027184 361413116
1071.5 361413116 361863022 362209892 362369919 362530251 362229614 361979828 360897331 360508080 360098648
1080.1 360098648 360015526 360382271 360679321 361242943 360864792 360777817 360182762 359662666 358700027 358246078
1089.8 358246078 359511299 360148735 361410637 361586876 360921707 360504189 359921455 359517670 359056969
1098.5 359056969 359536438 359909325 360574226 360933342 360753326 360573425 360622749 361066704 360421677 360336227
1108.1C60336227J06850k08282O86264J372642M77181m78135L14217J10664L1014m45404
1117.7C62303238j22376P34940N83382P04574L28675P52868k4261j74523q6898q79708
1127.4C64119911N951P18918J114769N55687J150246J242637K20375r0904n77507j6174
1137C68443909J07269P54814P05300O01615Q20885K86751R22508J36604k56500n43022
1146.7C71980133j178970J74370J192359R66340M69093M71611K18353k16484p47490
1155.4C73329315r2201j1864j91993J066703P84951J169014J153831P05338K39181
1164C78152275k12212O30990K82554O31294R53141J533508K154694K207679K291718
1172.7C88625641P00531J09062N32227J096840J000022J400605K442321J934052K274551
$$ plain form
1108.1 360336227 360443077 360234795 360921059 362293701 362770882 362292747 362606964 362717628 362748642 362303238
1117.7 362303238 362180862 362915802 363499184 364203758 364532433 365285301 365261040 365086517 364999619 364119911
1127.4 364119911 364125862 364844780 365959549 366515236 367665482 368908119 369128494 369037590 368460083 368443909
1137 368443909 368551178 369305992 370011292 370612907 371433792 371720543 372643051 372779655 372523155 371980133
1146.7 371980133 370801163 370975533 372167892 373134232 373603325 374074936 374293289 374076805 373329315
1155.4 373329315 373237114 373225250 373033257 374099960 374884911 376053925 377207756 377913094 378152275
1164 378152275 377940063 378571053 378853607 379484901 380438042 381971550 384126244 386333923 388625641
1172.7 388625641 389326172 389435234 389967461 391064301 392064323 393464928 395907249 397841301 400115852
1181.4D00115852K577362J951981J091461O95763P19833J511765K547722K305679K589455
1190.1D16106873K239265K255516K407494J343116P99065M23470J324844K338371K702370
1198.8D31940384K643509K040596K382583K111207J178741J100197J455116J000519
1206.5D45852852O35452K112351K684021K225494J901093J138305J009255Q35418R06029
1215.1D59300270J084480J247063J917114J990013K224617K491570J969604Q69942
1222.9D73094673R46236J432953O15501R21517J126976J143226J836319K201233J710854
1231.5D85029488N03120j10626q85773o68068j28860l5363P5798M09165J033707M36172
1241.2D85658760p2479q10471j283645j293221j280861m16603K87399O38733L14598
$$ plain form
1181.4 400115852 402693214 404645195 405736656 406432419 407152252 408664017 411211739 413517418 416106873
1190.1 416106873 418346138 420601654 423009148 424352264 425151329 425574799 426899643 429238014 431940384
1198.8 431940384 434583893 436624489 439007072 441118279 442297020 443397217 444852333 445852852
1206.5 445852852 446488304 448600655 451284676 453510170 455411263 456549568 457558823 458394241 459300270
1215.1 459300270 460384750 461631813 463548927 465538940 467763557 470255127 472224731 473094673
1222.9 473094673 474040909 475473862 476089363 477010880 478137856 479281082 481117401 483318634 485029488
1231.5 485029488 485532608 485421982 484536209 483868141 483739281 483703918 483779716 484188881 485222588 485658760
1241.2 485658760 485586281 484775810 483492165 482198944 480918083 480501480 480788879 481427612 481742210
1249.9D81742210N56641O8207j136399r12895q53958m86870J54877O60667J106110
1258.5D80898590J638756J598129Q95615P14912l4256j01509M35791J160164J706238
1267.2D88912430J886940K569465K374878K132187J337471N04113p782n2834R65538
1275.9E00622406J117706J867600J381340Q31756N93415r89647j657639k032356j805229
1284.6D99929352j886940j094628o02264r47952r45969j647835k276344k961960k782211
1293.3D84783249k983360k780304k036553j529464j004792j109962r25484j395760
1301D71017570j711997j957589k252502j547737n81513K63710L37220J45454L03078
1309.7D64015694k7581j233711j420631j143990j355896j73263O73751Q08564R48486
$$ plain form
1249.9 481742210 482298851 482367058 481230659 480317764 479463806 478976936 479131813 479792480 480898590
1258.5 480898590 482537346 484135475 485031090 485746002 485711746 485610237 486046028 487206192 488912430
1267.2 488912430 490799370 493368835 495743713 497875900 499213371 499717484 499709702 499656868 500622406
1275.9 500622406 501740112 503607712 504989052 505820808 506414223 505424576 503766937 501734581 499929352
1284.6 499929352 498042412 496947784 496345520 495397568 494451599 492803764 490527420 487565460 484783249
1293.3 484783249 481799889 479019585 476983032 475453568 474448776 473338814 472413330 471017570
1301 471017570 469305573 467347984 465095482 463547745 462966232 463229942 463567162 463712616 464015694
1309.7 464015694 463988113 462754402 461333771 460189781 458833885 458660622 459334373 460142937 461091423
1318.3D61091423O83594m0131m86755n99823q45261n33333K35253J244926J756287
1327D62506180J926689J988335J146774L80669K92053M53872K34948L13759J030197
1335.7D70273476J477966J790199J777115J478157M45213k92434n02243r09691k98882
1344.4D75238876K42958N98031M63485M87328L10516p75375j251374k006530j834717
1353.1D71473198j669731r71565k07520m8408K99720q29353j037331j723327k230950
1361.7D63054733k593651k967529q99772j181527o89811m07334n46303j249733k222595
1370.4D50296478k232971k257004k334518k378044n99060q2436K48413O22101L03535
1379.1D41586494r4184p71981n81855m71459J89972R92470J529274J992759K816735
$$ plain form
1318.3 461091423 461775017 461734886 461248131 460648308 459803047 459269714 459504967 460749893 462506180
1327 462506180 464432869 466421204 467567978 467948647 468240700 468694572 468929520 469243279 470273476
1335.7 470273476 471751442 473541641 475318756 476796913 477242126 476949692 476447449 475537758 475238876
1344.4 475238876 475481834 476079865 476543350 477030678 477341194 476565819 475314445 473307915 471473198
1353.1 471473198 469803467 468831902 468624382 468575974 468875694 468046341 467009010 465285683 463054733
1361.7 463054733 460461082 457493553 456593781 455412254 454722443 454315109 453768806 452519073 450296478
1370.4 450296478 448063507 445806503 443471985 441093941 440494881 440412445 440660858 441282959 441586494
1379.1 441586494 441492310 440720329 440138474 439667015 439856987 440849457 442378731 444371490 447188225
1387.8D47188225K350998J187401O33201M98314O18935R15985J366768J978378K053146
1396.4D58791351J911774J642990J267929J91117m23317o60401l58238n1003J46447
1405.1D62458649P87162P10030L84026j46981j037750j316910r82208o36749o67076
1413.8D59552193j14327R59549Q13065K31895j5220p48902l57551M1008j24207J90849
1423.4D60428352M89312R86900J278877P81403J005020N71251k37160k37427l10745
1432.1D64755783N20554P94639J097489J023368J974984K360420O02722K36740L9330
1440.8D73406029r4109l48129P8697P34139J178360J533279N98068J73569K56882l17879
1450.5D77198906n95322m23088K69547Q43773J545868J508903J856613J534729k62604
$$ plain form
1387.8 447188225 449539223 450726624 451359825 451858139 452477074 453393059 454759827 456738205 458791351
1396.4 458791351 460703125 462346115 463614044 463805161 463381844 462721443 462363205 462312202 462458649
1405.1 462458649 463245811 463955841 464339867 464192886 463155136 461838226 460856018 460219269 459552193
1413.8 459552193 459437866 460397415 461210480 461442375 461427155 460678253 460320702 460361710 460237503 460428352
1423.4 460428352 460917664 461904564 463183441 463964844 464969864 465541115 465303955 465066528 464755783
1432.1 464755783 465276337 466070976 467168465 468191833 470166817 472527237 473129959 473366699 473406029
1440.8 473406029 473311920 472963791 473042488 473776627 474954987 476488266 477086334 477259903 477516785 477198906
1450.5 477198906 476603584 476180496 476450043 477293816 478839684 480348587 482205200 483739929 483477325
1459.1D83477325o21147k71721N4322N68733J282806J355362K143135K272339J669731
1467.8D91930885J533966Q04711P94945Q34960P10755K553253J699829J897087K438507
1476.5E05198898J955948K55585n38597L03535n50499O6109n4893J94511L67126J04790
1486.1E07302513J63040j113968Q1787k621383k775269j726837j216659o87294j357804
1494.8D96048126p21206l305970l62663k911301l923034j501465k949906k132301k805099
1503.5D75435181p38526j859970m008560k140884l244095m72222l666992j328544k855988
1512.2D55119400j617928j327896j659431K21176k974777j233483j831436n12085k476196
1520.8D41707344l146591J1597j682740Q42858j747628j67961n21431r67750q67844
$$ plain form
1459.1 483477325 482856178 482584457 482638779 483207512 484490318 485845680 487988815 490261154 491930885
1467.8 491930885 493464851 494269562 495064507 495899467 496610222 499163475 500863304 502760391 505198898
1476.5 505198898 507154846 507410431 506871834 507175369 506624870 506690979 506636086 506830597 507197723 507302513
1486.1 507302513 507465553 506351585 506433372 503811989 501036720 499309883 498093224 497405930 496048126
1494.8 496048126 495326920 492020950 491658287 488746986 484823952 483322487 480372581 478240280 475435181
1503.5 475435181 474696655 472836685 468828125 466687241 463443146 462970924 459303932 457975388 455119400
1512.2 455119400 453501472 452173576 450514145 450735321 447760544 446527061 444695625 444183540 441707344
1520.8 441707344 438560753 438572350 436889610 437732468 435984840 435816879 435295448 434327698 433459854
1529.5D33459854j603889m5967j000939M40712p89299J88561O13365j02997Q53004
1538.2D32012405l447418O29730j48658O59294R9525j93748J198883L70903J244049
1546.9D32424965l9711M14886o70852n52597J202469J12266J799316J605225J037293
1555.6D37333260Q09173J641693M469567n956231J005517K90908R72786O60973Q50830
1564.2D42078476J170807J309814J333618K27852J306916n84603k38266P03354P63130
1572.9D48071098J026612L26652J614609L1204K10877J28173p2441J14060m37546M61273
1582.6D51474571R4452P99790L77616p5683k25105j124802n83649j330795l19672o71043
1592.2D48415680q50029k64626k62413j86233j313553q26492j742516j167679j113167
$$ plain form
1529.5 433459854 431855965 431809998 430809059 431249771 430460472 430649033 431262398 431159401 432012405
1538.2 432012405 428564987 429194717 429046059 429705353 429804878 429611130 430810013 431180916 432424965
1546.9 432424965 432385254 432800140 432129288 431576691 432779160 432891426 434690742 436295967 437333260
1555.6 437333260 438142433 439784126 444253693 438297462 439302979 439593887 440566673 441227646 442078476
1564.2 442078476 443249283 444559097 445892715 446120567 447427483 446842880 446604614 447307968 448071098
1572.9 448071098 449097710 449424362 451038971 451070175 451281052 451409225 451336784 451450844 451013298 451474571
1582.6 451474571 451569023 452368813 452746429 452670746 452445641 451320839 450737190 449406395 449086723 448415680
1592.2 448415680 447565651 447301025 447038612 446852379 445538826 444712334 442969818 441802139 440688972
1600.9D40688972j262626q36144j483650m53720j552963q56514j589775j679421j594848
1609.6D29379311k335587o08635j434479m99229j539841j069832j199646l919296J11809
1618.2D16884575j845055q81386j476020j99204o42776j897393j373j085853L21311
1626.9D09176826j417312o66733j093407p89795m4822p64923R53674l27721N93720
1635.6D05619507j617890P13234K28463l24822Q83598n09910Q32481J71509J483421
1644.3D07479591J160164O6948K396279p80869P88956l03650K030411J924896j066094
1653D13696632N03617J293564K827186R0408J511002R10111J017265J729507J849480
1661.6D25428772L013039N69686K559128J949387K813339K598038K783584M087525
$$ plain form
1600.9 440688972 439426346 438590202 437106552 436652832 435099869 434243355 432653580 430974159 429379311
1609.6 429379311 427043724 426435089 425000610 424501381 422961540 421891708 420692062 416772766 416884575
1618.2 416884575 415039520 414158134 412682114 412482910 411840134 409942741 409941368 408855515 409176826
1626.9 409176826 407759514 407092781 405999374 405209579 405164757 404399834 405353508 405025787 405619507
1635.6 405619507 404001617 404714851 404943314 404618492 405502090 404992180 405824661 405996170 407479591
1644.3 407479591 408639755 408706703 411102982 410322113 411111069 410807419 412837830 414762726 413696632
1653 413696632 414200249 415493813 418320999 418411407 419922409 420832520 421849785 423579292 425428772
1661.6 425428772 428441811 429011497 431570625 433520012 436333351 438931389 441714973 445802498
1669.4D45802498M7607L582726L220329L289452K913093M299546M374618K444534M211083
1678D74185486L218765M550247M881363M190216M655762O070404Q678093K37083L799172
1686.7E14466591M380264M175377L755417L817711M028244L968010M355774L916092
1694.4E46863480M176597M297371L082619L011703L793068M839554J227913K429543
1702.1E73721848K865066L285561K358627K479019K443543J884193J941948K249107
1709.9E93228912K152291J796875K297249K321014K606087K417106K728157J783142
1717.6F11330833q48693J856803K013817K118759J792183J959191J160393J227989
1725.3F22611275J576576J317368J563339J410408J493721Q21953K558975K733650
$$ plain form
1669.4 445802498 445850105 449432831 452653160 455942612 458855705 463155251 467529869 469974403 474185486
1678 474185486 477404251 481954498 486835861 491026077 495681839 501752243 510430336 510667419 514466591
1686.7 514466591 518846855 523022232 526777649 530595360 534623604 538591614 542947388 546863480
1694.4 546863480 551040077 555337448 558420067 561431770 565224838 570064392 571292305 573721848
1702.1 573721848 576586914 579872475 582231102 584710121 587153664 589037857 590979805 593228912
1709.9 593228912 595381203 597178078 599475327 601796341 604402428 606819534 609547691 611330833
1717.6 611330833 610482140 612338943 614352760 616471519 618263702 620222893 621383286 622611275
1725.3 622611275 624187851 625505219 627068558 628478966 629972687 630794640 633353615 636087265
1733F36087265n62744J62163J412696K241707J434365J961517P78809l78724K126847
1741.7F45263901J269607J236573M94613J181107Q27484Q90503J422424p5455J823426
1750.4F54334183j69525k51999J315994J006165J203308J202697J91651j84403J223526
1759F59871597O82602J166153N2796j64414J262131N02243J020431O64139Q99735q60291
1768.7F65097122N75562K252655O05621j7624j599960J694412J136627l17917N69916
1777.4F69996414L6774R33533L22265q0871J7242R12399J190873k43531j10092K51465
1787F73226471O15463m9438Q17718P26090p1030q75092q13751J916123P17087j37635
1796.7F76072006J8540O06537L79028o88553J046982l29895k2965L98865K95181L97797
$$ plain form
1733 636087265 635524521 635686684 637099380 639341087 640775452 642736969 643515778 643137054 645263901
1741.7 645263901 646533508 647770081 648264694 649445801 650273285 651163788 652586212 652510757 654334183
1750.4 654334183 654164658 653912659 655228653 656234818 657438126 658640823 658832474 658648071 659871597
1759 659871597 660554199 661720352 661773148 661608734 662870865 663373108 664393539 665057678 665957413 665097122
1768.7 665097122 665672684 667925339 668530960 668513336 666913376 668607788 669744415 669426498 669996414
1777.4 669996414 670033188 670966721 671288986 671208115 671225357 672137756 673328629 673085098 672975006 673226471
1787 673226471 673841934 673792496 674610214 675336304 675265274 674390182 673576431 675492554 676209641 676072006
1796.7 676072006 676090546 676697083 677076111 676387558 677434540 677104645 677081680 677480545 677775726 678173523
1806.3F78173523K03094M28162k14996M15039q10929j53808L19595J15738O85425j45645
1815.9F79015198O26907m31518j65635M08097j56784J77765n22843O40793P24030j58387
1825.6F80157623l4866M74243N02243j13983j189041j001816M68674P7972P49130O58265
1835.2F80748444R3078L73383p53403q7662m41818r1019L3722N70221R14460j476059
1844.9F79883347R83047K58026j44577n40085n16586J40457n49469K06299O8665K90298
1854.5F80079422K32239K22320j33972m95453P0725p17621Q2321j44272J13602L71628
1864.2F79680939k50473k8839o19812M07486p27768q35038K39334R5368K78549L8757
1873.8F78278503L19519n02319j89667o64978p89947Q087l41339K42996j9226L25317
$$ plain form
1806.3 678173523 678376617 678804779 678589783 679004822 678193893 678040085 678359680 678475418 679160843 679015198
1815.9 679015198 679642105 679210587 679044952 679453049 679296265 679474030 678951187 679591980 680316010 680157623
1825.6 680157623 680122757 680597000 681099243 680985260 679796219 678794403 679263077 679341049 680090179 680748444
1835.2 680748444 680841522 681214905 680461502 680373840 679932022 679841003 679874725 680444946 681359406 679883347
1844.9 679883347 680866394 681124420 680979843 680439758 679923172 680063629 679514160 679720459 679789124 680079422
1854.5 680079422 680311661 680533981 680400009 679904556 679975281 679257660 679339981 679195709 679309311 679680939
1864.2 679680939 679430466 679401627 678781815 679189301 678461533 677626495 677865829 677961197 678239746 678278503
1873.8 678278503 678598022 678095703 677906036 677241058 676451111 676459198 676117859 676360855 676341629 676666946
1883.4F76666946k0752k0217n3025r11331k29721q26721p77283m5318L00979J11923
1893.1F74195480Q3924J11541j027984m53644o54984m56390n06210n34210K72293M2190
1902.7F71072006L8376j79443r4834j077041j171341l89099p20444n24292j63651M83933
1912.4F67274170k3193N1956m06571r33304j90734j196595j034088n75638q3465K87399
1922F63169937J88446m75693n65414k45285j381378j073609q57009l82615m3029j42365
1931.7F58191986K66113n52749N1117n51148j254959r16672r61914p40967q05587M26635
1941.3F53151855N4245o85348k72675l38516p08694j220932n10559p97959m69131j09940
1951F48092346N341J96075m29687k77100q62656j254806j353378q43811m79889k30942
$$ plain form
1883.4 676666946 676646194 676625977 676572952 675661621 675431900 674605179 673827896 673782578 674083557 674195480
1893.1 674195480 674279404 674390945 673362961 672909317 672254333 671797943 671291733 670757523 671029816 671072006
1902.7 671072006 671110382 670930939 670836105 669759064 668587723 668198624 667478180 666953888 666790237 667274170
1912.4 667274170 667250977 667302933 666896362 665963058 665772324 664575729 663541641 662966003 662882538 663169937
1922 663169937 663358383 662882690 662317276 662071991 660690613 659617004 658759995 658377380 658334351 658191986
1931.7 658191986 658458099 657905350 657956467 657405319 656150360 655233688 654271774 653530807 652725220 653151855
1941.3 653151855 653206100 652520752 652248077 651909561 651200867 649979935 649469376 648671417 648202286 648092346
1951 648092346 648097687 648293762 647864075 647586975 646724319 645469513 644116135 643272324 642792435 642561493
1960.6F42561493N73578k3422k57111n83038o61087r17359j097221j078415j170693
1969.3F37346725K28806K50244Q7624j08338n15937o23360j021462o43196j139717
1978F33861389q27789k98348P7629K87247m20685l29704o80504q37364r53751j119270
1987.6F28758850r40895m51050N5771K39525K34718m98314m53376j099663j235199
1996.3F24610367j183663j308784k30293q2016J99890k8763k28348p31087j333389
2005F19683914r18197j227303o51169p62214n38254J92795L23333L21465p59201p17392
2014.6F14947777j090927j326752j027603o90956o3057l44353J22490J40648n2910
2023.3F10614357m24767j151771j436730j391181p82166m48341M49829N22041J56212
$$ plain form
1960.6 642561493 643135071 643111649 642854538 642271500 641610413 640693054 639595833 638517418 637346725
1969.3 637346725 637575531 637825775 637913399 637805061 637289124 636665764 635644302 635001106 633861389
1978 633861389 633033600 632735252 632812881 633100128 632679443 632349739 631669235 630831871 629878120 628758850
1987.6 628758850 627817955 627366905 627422676 627662201 627896919 627398605 626945229 625845566 624610367
1996.3 624610367 623426704 622117920 621887627 621805611 622005501 621976738 621748390 621017303 619683914
2005 619683914 618765717 617538414 616887245 616125031 615586777 615779572 616102905 616424370 615665169 614947777
2014.6 614947777 613856850 612530098 611502495 610811539 610748482 610404129 610526619 610667267 610614357
2023.3 610614357 610189590 609037819 607601089 606209908 605427742 604979401 605429230 605951271 606107483
2032F06107483p477k83508o24962j707916j402855p67403j38359J11313J63650N06173
2041.6F01956139r7962l48854r89075r75990j099510j188316j74332J0872L27568M58679
2051.2E97879219L18222k59857p01637p67289j143112r20181n01289J65901N75371
2059.9E94645348P10144J99623j35155k48528r57450o76575n47600n37758j97105L64456
2069.6E92619400N97343N52025M97818m58908o31332p84950q09060o36940n35698J66436
2079.2E90576134P99522J354141M11301l30086o23741q87909q75549r47876J23482
2087.9E89599419O98013J094665N55954P5417J77727o28395o63758r88845n89257n4550
2097.5E89276390K83585P56416P16743Q38204r5444n28908n76439k70080l61977r26666
$$ plain form
2032 606107483 606100006 605816498 605191536 603483620 602080765 601313362 601175003 601286316 601449966 601956139
2041.6 601956139 601858177 601509323 600520248 599544258 598444748 597256432 597082100 597092972 597420540 597879219
2051.2 597879219 598197441 597937584 597235947 596468658 595325546 594405365 593904076 594069977 594645348
2059.9 594645348 595355492 595555115 595419960 595171432 594213982 593537407 592989807 592452049 592254944 592619400
2069.6 592619400 593216743 593768768 594266586 593807678 593176346 592391396 591582336 590945396 590409698 590576134
2079.2 590576134 591375656 592729797 593141098 592811012 592187271 591299362 590423813 589475937 589599419
2087.9 589599419 590297432 591392097 591948051 592023468 592201195 591572800 590909042 589920197 589330940 589276390
2097.5 589276390 589559975 590316391 591033134 591871338 591775894 591246986 590670547 590400467 590038490 589111824
2107.2E89111824j3275O45637J063462P17506K84462o4430n31044n75981p49665j99585
2116.8E89688911K3804O22368R85718P32612M00124r5902j41868q99773p79342l37716
2126.5E90198936J12305O32248R05075J419640O70128o1493p27692o19698k33688k80151
2136.1E92015610o485k7542P21740R35250P98530K74277k69661m65813r47113m75120
2145.8E92553673n6954R08661R04656N96924R67979K62527j46293n26810l01590l09143
2155.4E94853630n2109N08194O71921R97238L36380N59693K04353m62036j60561l64570
2165E97092133l42484J29433R49974O95877O71081P76520J07422m60701q01964l72429
2174.7E98444862l11660L70254R75418Q67462P37992O04973N73501j80473m98200q52699
$$ plain form
2107.2 589111824 589098549 589744186 590807648 591525154 591809616 591745186 591214142 590638161 589888496 589688911
2116.8 589688911 589712715 590335083 591320801 592053413 592453537 592357635 592215767 591315994 590536652 590198936
2126.5 590198936 590311241 590943489 591848564 593268204 593938332 593876839 593149147 592529449 592295761 592015610
2136.1 592015610 592009125 591981583 592703323 593638573 594437103 594711380 594441719 593975906 593028793 592553673
2145.8 592553673 592496719 593405380 594310036 594906960 595874939 596137466 595991173 595464363 595162773 594853630
2155.4 594853630 594801521 595309715 595981636 596978874 597315254 597874947 598079300 597617264 597456703 597092133
2165 597092133 596749649 596879082 597829056 598524933 599196014 599972534 600079956 599619255 598817291 598444862
2174.7 598444862 598133202 598503456 599478874 600346336 601084328 601689301 602262802 602082329 601584129 600731430
2184.3F00731430m98848L4142K56500P42454L80783Q02613O50558j55830o01845o64520
2194F01677437m58756l92265N58586Q67272Q46595L43438j14861N0354j38779l27758
2203.6F02911263p60117j88255L3149M13781R67140M53720L34167O7063j63842o46324
2213.3F03421745m23393k63519j15013O69250M48151M45442K76871K78015k16408n71976
2222.9F03949165l76777o37360J31531K94418N09911M90684J50681L13797M1618k68593
2232.5F04599075p69615l40347k34375p8125L54957P32460Q34198m55894k73285j42670
2242.2F04226379o82945p35016j57318L70865m5319O64750M53071l3378o3935n02395
2251.8F03494759n10064m40063J06659j6518Q7624J67503K48337M11301j67046j41792
$$ plain form
2184.3 600731430 600232582 600266724 600523224 601265678 601646461 602449074 603099632 602943802 602341957 601677437
2194 601677437 601218681 600826416 601385002 602252274 603098869 603442307 603327446 603377800 603239021 602911263
2203.6 602911263 602151146 601962891 601996040 602409821 603376961 603830681 604164848 604231911 604068069 603421745
2213.3 603421745 602998352 602734833 602619820 603289070 603737221 604182663 604459534 604737549 604521141 603949165
2222.9 603949165 603572388 602935028 603066559 603360977 603870888 604361572 604512253 604826050 604867668 604599075
2232.5 604599075 603829460 603489113 603254738 603176613 603531570 604264030 605098228 604642334 604369049 604226379
2242.2 604226379 603543434 602808418 602651100 603021965 602976646 603641396 604094467 604061089 603997154 603494759
2251.8 603494759 602984695 602544632 602651291 602634773 602722397 602889900 603138237 603549538 603382492 603240700
2261.5F03240700m17366o37398o28014j6746M54445J64795J04789J2589J53961k20337
2271.1F02211418l01323o19278l97186l1319n72624L80631N79948J42822l25508n51491
2280.8F00516090j68266m13666n15251n55000J38626J18637n9051j16311k07672K02980
2290.4E98941116p73506p44667l47862l34625l06931j52626K70271m06417j87989j15623
2300E95841141l67127q21342r35097l74260p04689q2817J50108K4758n62287p18841
2309.7E91449547m04129q23822k10800j144066j095772j08948J65482M96139j28975
2318.4E88194656l14903j014099p72209o25038j89972J80397j092148j76392M52919
2327.1E84643211j50337o92787q40454j013260l00140j42403j218185j001664o60057
$$ plain form
2261.5 603240700 602823334 602185936 601557922 601541176 601995621 602160416 602265205 602277794 602431755 602211418
2271.1 602211418 601910095 601290817 600893631 600862312 600289688 600670319 601250267 601393089 601067581 600516090
2280.8 600516090 600347824 599934158 599418907 598863907 599002533 599121170 599062119 598945808 598738136 598941116
2290.4 598941116 598167610 597422943 597075081 596740456 596433525 596280899 596551170 596144753 595956764 595841141
2300 595841141 595474014 594652672 593717575 593343315 592638626 592555809 592705917 592730675 592168388 591449547
2309.7 591449547 591045418 590221596 590010796 588866730 587770958 587662010 587827492 588323631 588194656
2318.4 588194656 587879753 586865654 586093445 585468407 585278435 585458832 584366684 584190292 584643211
2327.1 584643211 584492874 583800087 582959633 581946373 581646233 581503830 580285645 579283981 578623924
2335.7E78623924J003189Q28820K11105M6234m50020p08656j413117j91001j459122
2344.4E76491356J4954J075897q33435M69627M0207j101761j442566o49490n70450
2353.1E73494339r02596o57806j509705K47536Q2588Q3466n35851j229972m654p57218
2362.7E68310127M30603j12419J66779k4720o15463l00522j063842j54343P6141l17573
2372.4E66394768o17905K24991j18256m44603N55535N9166k09275q32405o81266k59820
2382E64070930o12068l98521k70615m14963m81796O6567n39627r49212o35528q63609
2391.7E58971558k32888j48582m09584o76193l33443j63612r09844p52373n49965k12554
2401.3E54582520n39017r34258p60841m11377P3204n80063o72798m33846o76879j079903
$$ plain form
2335.7 578623924 579627113 580455933 580667038 580713272 580263252 579554596 578141479 577950478 576491356
2344.4 576491356 576506310 577582207 576748772 577218399 577258606 576156845 574714279 574064789 573494339
2353.1 573494339 572591743 571933937 570424232 570671768 570754356 570837822 570301971 569071999 569067345 568310127
2362.7 568310127 568740730 568628311 568795090 568770370 568154907 567854385 566790543 566636200 566712341 566394768
2372.4 566394768 565776863 566001854 565883598 565438995 565994530 566053696 565844421 565012016 564330750 564070930
2382 564070930 563458862 563060341 562789726 562374763 561892967 561959534 561419907 560470695 559835167 558971558
2391.7 558971558 558738670 558590088 558180504 557504311 557170868 557007256 556097412 555345039 554795074 554582520
2401.3 554582520 554043503 553109245 552348404 551937027 552010231 551430168 550757370 550323524 549646645 548566742
2410.9E48566742j094971n75447m95491l70674n16167m80461m55627m12941l86505
2419.6E43778458q98819r11904o65931o10276r66415o65932j12610j58233m97322o67115
2429.3E37623901l90281j003113j176643j086197p31736q6402n97573p39784o70395
2438E31141777n12199o60363p93724q68225j133308o92024o17333k26745l50495p10945
2447.6E24576416n48515q34160q87070r26628o42166o94351o44570n76667p00150l06778
2457.2E17815361o13022q03833o70814n48859q27179r46350o43768n63774m02756o80847
2466.9E11114159m68750p81021p73697k02790r27810q36487p51724q98896n50651l48969
2476.5E04573364j80359P1640j82876j198082j025391p62977p76596n45426n47485
$$ plain form
2410.9 548566742 547471771 546896324 546400833 546030159 545513992 545033531 544577904 544164963 543778458
2419.6 543778458 542879639 541967735 541301804 540691528 539725113 539059181 538946571 538788338 538291016 537623901
2429.3 537623901 537233620 536230507 535053864 533967667 533235931 533149529 532551956 531812172 531141777
2438 531141777 530629578 529969215 529175491 528307266 527173958 526481934 525864601 525637856 525287361 524576416
2447.6 524576416 524027901 523193741 522306671 521380043 520737877 520043526 519398956 518822289 518122139 517815361
2457.2 517815361 517202339 516398506 515727692 515178833 514351654 513405304 512761536 512197762 511795006 511114159
2466.9 511114159 510645409 509864388 509090691 508887901 507960091 507123604 506371880 505472984 504922333 504573364
2476.5 504573364 504393005 504464645 504281769 503083687 502058296 501295319 500518723 499973297 499425812
2485.2D99425812n6153o8245m53491m76150o18057j010323l12157m3411r08623m54330
2494.8D95024872j44882r8496k58369o98242l93258j50261n37033j115493n31617k35633
2504.5D90861588j84136M5700k70843o5766k17628m22974o12526o87065l28483j90392
2514.1D87927475m9629k23961j59683j05744j75018k03362m86412n96428o11038n58433
2523.8D84757767l15247j03874k33879K16217K83317l41873l54538o52923o53610l84484
2533.4D82216873l19099p7133J68991J03340j19515q6555n97420p29561j90696j10131
2543.1D80259094m81567m53949K11487M10881M9705o01310n50423l28903l39432j58501
2552.7D78017082l61099k84004k22893K79541L28064l71933m34837n48096l58429k39830
$$ plain form
2485.2 499425812 499369659 499301414 498847923 498371773 497753716 496743393 496431236 496387825 495479202 495024872
2494.8 495024872 494879990 494781494 494523125 493824883 493431625 493281364 492744331 491628838 491097221 490861588
2504.5 490861588 490677452 490723152 490452309 490386543 490168915 489745941 489133415 488446350 488117867 487927475
2514.1 487927475 487877846 487653885 487494202 487388458 487213440 487010078 486523666 485927238 485316200 484757767
2523.8 484757767 484442520 484338646 484104767 484320984 484604301 484262428 483907890 483254967 482601357 482216873
2533.4 482216873 481897774 481820641 481989632 482092972 481973457 481886902 481289482 480559921 480369225 480259094
2543.1 480259094 479777527 479323578 479535065 479945946 479995651 479394341 478843918 478515015 478175583 478017082
2552.7 478017082 477655983 477371979 477149086 477428627 477756691 477384758 476949921 476401825 476043396 475803566
2562.4D75803566j33476k70462l35121J26571J21308L5400m20494m48227l91426m41017
2572D73646622j40152j71738l9864r7656m4479j45645q049O9656m33769n16243o87904
2582.6D71430779k13967M1428J35498K95105N0392K14806m59671p68853n38025l80897
2592.2D69806595j69220j49193M45786L76777K0714k35939n56488l23906j82991m01268
2601.9D68630867o54678m24729j24359J12229K48107J09444R308j46980o04287p90290
2611.5D66364632l08152j40228M9896L2349j11008K01607k632m49219p00607l82347
2621.2D64554291l61519m39911O7711J66588K05192m9171k00806m24614o93893l26576
2630.8D62497292k78817j86615l67508n30052J06278K25525k19880k50549m19960p52907
$$ plain form
2562.4 475803566 475670090 475399628 475064507 475191078 475312386 475347786 474927292 474479065 474087639 473646622
2572 473646622 473506470 473334732 473294868 473197212 473152733 473007088 472999039 473068695 472634926 472118683 471430779
2582.6 471430779 471216812 471258240 471393738 471688843 471739235 471954041 471494370 470725517 470187492 469806595
2592.2 469806595 469637375 469488182 469933968 470310745 470331459 470095520 469539032 469215126 469032135 468630867
2601.9 468630867 467976189 467551460 467427101 467539330 467787437 467896881 467906189 467759209 467154922 466364632
2611.5 466364632 466056480 465916252 465966148 465998497 465887489 466089096 466086464 465637245 464936638 464554291
2621.2 464554291 464192772 463752861 463820572 463987160 464192352 464143181 463942375 463517761 462823868 462497292
2630.8 462497292 462218475 462031860 461664352 461134300 461240578 461466103 461246223 460995674 460575714 459822807
2640.5D59822807l96995m23889q47550m42962K21061K46887p2860m42772m55780j52130
2650.1D57055817n70794o38999k95983k70119k32048j6593M61006k938m83856n02930
2659.8D54502563m87785m64287n43670j04256l23868k54326n6839k56080J526n03464
2669.4D51509514n58891j76163m0245j9875l36227l97835j27487J77727k92397m38118
2679D49300003m43268n55534p6637j45111r0676K2125j45530k66686k26402K9144j44157
2689.6D47257271m55971o39114l53852j6555q7929j04141M8027Q7432j50222m22592
2699.3D45162354o47660k58140k8496k14386r5291K2545J51977j48811k53105l51487
2708.9D43339500o18057k03247j984j19743m06952l40118J98517J56288k27738k94494
$$ plain form
2640.5 459822807 459425812 459001923 458154373 457711411 457932472 458179359 458106499 457663727 457207947 457055817
2650.1 457055817 456485023 455846024 455550041 455279922 455047874 455031281 455492287 455489349 455005493 454502563
2659.8 454502563 454014778 453550491 453006821 452902565 452578697 452324371 452267532 452011452 452012978 451509514
2669.4 451509514 450950623 450774460 450734215 450714340 450378113 449980278 449852791 450030518 449738121 449300003
2679 449300003 448856735 448301201 448224564 448079453 447988777 448010902 447865372 447598686 447372284 447401428 447257271
2689.6 447257271 446801300 446162186 445808334 445791779 445703850 445599709 445647736 445735168 445584946 445162354
2699.3 445162354 444514694 444256554 444228058 444013672 443918381 443940926 444092903 443944092 443690987 443339500
2708.9 443339500 442721443 442518196 442516212 442396469 441989517 441649399 441847916 442004204 441776466 441481972
2718.6D41481972l8338j00822k89612j62049k44369j79825J79901j19362j74026J07689
2728.2D40461159m32434n40619k52190j33591M7036q4267j58653k38800j35117J61629
2737.9D38694153j20125m74167m05769l62663l8643K28576k46086l61824J2131K861
2747.5D36928444k39983k69203m60167m98771m6845l9978M196o4430m92058m54063
2757.2D34367142n0583O8588k58522l45650l39203P5798M693m34647J39351n4207n75829
2767.8D32596931m55398p4120j39198o48727j54038J95809j31264k76528j68342j67084
2777.4D30578041N4169J9226o40183m36020k76451Q5068M55971j03073j93138J5106
2787D29558716K23732k55470o27137j52778k57187o47354m05236J24970J10855O3057
$$ plain form
2718.6 441481972 441443634 441342812 441053200 440891151 440646782 440466957 440646858 440527496 440353470 440461159
2728.2 440461159 440028725 439488106 439235916 439102325 439149361 439065094 438906441 438667641 438532524 438694153
2737.9 438694153 438574028 438099861 437694092 437331429 437292786 437521362 437275276 436913452 436925583 436928444
2747.5 436928444 436688461 436419258 435959091 435460320 435413475 435373497 435377693 435313263 434821205 434367142
2757.2 434367142 434316559 434385147 434126625 433780975 433441772 433517570 433522263 433087616 433226967 433172760 432596931
2767.8 432596931 432141533 432067413 431928215 431279488 431125450 431321259 431189995 430913467 430745125 430578041
2777.4 430578041 430632210 430651436 430011253 429575233 429298782 429383850 429839821 429736748 429543610 429558716
2787 429558716 429782448 429526978 428899841 428747063 428489876 427842522 427437286 427562256 427673111 427736168
2796.7D27736168j06659l01094m40331q76503n42526K23160K91824l39203k60009J73187
2806.3D25558014M3220p1296l27568o11649r07936n45654j32294j144K46620N6152
2816D23306465O0234j22223k97432n94520p10221j48544q392k25563n88532k74048
2825.6D20397224k46086l42712N6000k93961m40483m48608l98789l27606R346O0425
2835.3D18024750n74074k43073j90391n07088o67076n41840j45721l84674l81584m78363
2844.9D13910866n73845l06893j73988n71365r98154m40407k39525m94766l48015j03035
2854.6D09660873l05j9035k71530l92227n4207j30997m17328m53644j07994m7340j71013
2865.2D07595253K81677K51236l24592p88842l56559K03933J1750k83661m07982p7706
$$ plain form
2796.7 427736168 427629509 427328415 426888084 426011581 425469055 425692215 425984039 425644836 425384827 425558014
2806.3 425558014 425601234 425529938 425202370 424590721 423682785 423137131 423004837 423003693 423250313 423306465
2816 423306465 423366699 423244476 422947044 422352524 421642303 421493759 421485367 421259804 420671272 420397224
2825.6 420397224 420151138 419808426 419864426 419570465 419129982 418681374 418282585 417954979 417964325 418024750
2835.3 418024750 417450676 417207603 417017212 416510124 415843048 415301208 415155487 414770813 414389229 413910866
2844.9 413910866 413337021 413030128 412856140 412284775 411286621 410846214 410606689 410111923 409763908 409660873
2854.6 409660873 409660568 409641533 409370003 408977776 408923569 408792572 408375244 407921600 407813606 407766266 407595253
2865.2 407595253 407876930 408128166 407803574 407014732 406658173 406862106 406873856 406590195 406182213 406104507
2874.8D06104507N6305J23520n2910k37922j1292k56767m51317j54495K85797m2534
2884.4D05362892j56250K42310J50299j12686n92804j32904q5221m73480L96538N91774
2894.1D05190468J03836j40801j0452J87416p4157n24674l29895J50528q3466k3841
2903.7D04444962P8964j65634m6540J83029p9002l67126l51601l46069k2126r9830
2913.4D03229027n1766j53656m52270j07231m28315l41644j00555k54555k76642m1389
2923D01021004M87823O4507R5520J54686m97933l94592K05193J54686l87421p9651
2932.7D00823822J96533J52245p9041L7308N34325L71894K18812j27717J33973O59141
2942.3D02921295M21601O5498L7422J96762m38080m36744n3635N2299L46642q9989
$$ plain form
2874.8 406104507 406160812 406284332 406231422 405993500 405982208 405725441 405274124 405119629 405405426 405362892
2884.4 405362892 405206642 405448952 405599251 405486565 404893761 404760857 404675636 404202156 404598694 405190468
2894.1 405190468 405294304 405153503 405143051 405330467 405256310 404731636 404401741 404552269 404468803 404444962
2903.7 404444962 404523926 404358292 404311752 404494781 404415779 404048653 403697052 403350983 403328857 403229027
2913.4 403229027 403177261 403023605 402571335 402464104 402035789 401694145 401593590 401339035 401062393 401021004
2923 401021004 401508827 401573334 401668854 401823540 401325607 400931015 401136208 401290894 400903473 400823822
2932.7 400823822 401020355 401172600 401093559 401130867 401665192 402037086 402255898 402128181 402262154 402921295
2942.3 402921295 403342896 403408394 403445816 403642578 403204498 402767754 402714119 402766418 403113060 403023071
2952D03023071N188L47748J16768J06354J82647R2316p6408j84098J12877O27632L27797
2962.6D04681892J54534M46358J14212k81296n9967R9907k14806j57623K22015M22554
2972.2D05427780K72522K76032J56326j36070M42390M97894k70042p07970k79464L94706
2981.8D06074104L25966J54839J37710l1776o68373k37656N84374K97393K23847M1618
2991.5D06902046J87569j6060n67589k82478m5014K54288j61934o48117J55487P47605
3001.1D06525803J56898j99699q4496k92549j73378k29416j28822K25830k6093m26788
3010.8D05347290k90337K46125J96342R1973k17324m99992l03345j52740K38342j69830
3020.4D04486504n50843N6572L33481p2555l80021n17807n87616q7051K26173N04303
$$ plain form
2952 403023071 403028259 403376007 403492775 403599129 403781776 403874092 403797684 403613586 403726463 404354095 404681892
2962.6 404681892 404836426 405282784 405396996 405115700 405055733 405155640 404940834 404783211 405005226 405427780
2972.2 405427780 405700302 405976334 406132660 405996590 406438980 406936874 406666832 405958862 405679398 406074104
2981.8 406074104 406400070 406554909 406692619 406660843 405992470 405754814 406339188 406636581 406860428 406902046
2991.5 406902046 407089615 407073555 406505966 406223488 406178474 406432762 406270828 405622711 405778198 406525803
3001.1 406525803 406682701 406483002 406398506 406105957 405932579 405703163 405574341 405800171 405774078 405347290
3010.8 405347290 405056953 405303078 405499420 405591393 405374069 404874077 404570732 404417992 404656334 404486504
3020.4 404486504 403935661 403992233 404325714 404253159 403873138 403355331 402767715 402680664 402906837 403411140
3030.1D03411140K71416m13132j24740n074k31209k52151j76163m73556m14810R3383
3039.7D01685104l395J36528K45247L8414n12237p94716l70255l89633l04985P1220
3049.4C99801292K41661J27182o7596r3918o2256l43361p66601l33557R7885J5793
3059C98616524k8763l5248j65062j79596j02653m70581l01667J20278j28937n22041
3068.6C96802254j21422M89082M0398n63469m49219K61383J38741m62837n43709k12403
3078.3C95378799L94745k5749J68266L33825m53225m05082m55056m02603k83622j93863
3087.9C94056435J46103N12771K06261n15709l05977m13895m15992r9450J38817L14408
3097.6C93623772k54021l96881j32485N6420O5918r1477o60705q58727J79100O53954
$$ plain form
3030.1 403411140 403682556 403269424 403144684 403139610 402908401 402656250 402480087 402006531 401591721 401685104
3039.7 401685104 401681709 401818237 402063484 402101898 401589661 400794945 400424690 400035057 399730072 399801292
3049.4 399801292 400042953 400170135 400102539 400008621 399946365 399603004 398836403 398502846 398600731 398616524
3059 398616524 398587761 398552513 398387451 398207855 398105202 397634621 397332954 397453232 397324295 396802254
3068.6 396802254 396680832 397169914 397210312 396646843 396197624 396459007 396597748 396134911 395591202 395378799
3078.3 395378799 395773544 395747795 395916061 396249886 395796661 395391579 394936523 394533920 394250298 394056435
3087.9 394056435 394202538 394715309 394921570 394405861 394099884 393685989 393269997 393170547 393309364 393623772
3097.6 393623772 393369751 392972870 392840385 392896805 392962723 392871246 392210541 391351814 391530914 392184868
3107.2C92184868P1754k83470K79732J09825j86119m3755n86395k74429k50931l24707
3116.9C90696373J7700J39771K71454l68958j88217M9744n59845p38945k57912L22914
3126.5C89384079K36893L15017J13182l12156n16739l85780J4495k81753m24843k11906
3136.1C87930489r5902q9798O10L03994Q6059o24962m95452q6632m32663l80287l47481
3146.8C85767975R15K83852J1787K93122k76299n56068m5624l3455l61442n09301K39983
3157.4C84815445L24440l51334p46307n30357m16146p19909k26250L33671K68364k10723
3167C82540894M3449K13966m64897n22575m82674N2223J40038q49266p70035k02675
3176.6C79698448q9569L64609O62651l7766n99823l75480k48070n98450n10330j26305
$$ plain form
3107.2 392184868 392256622 391973152 392252884 392362709 392176590 392132835 391546440 391272011 391021080 390696373
3116.9 390696373 390714073 390853844 391125298 390756340 390568123 390617867 390058022 389319077 389061165 389384079
3126.5 389384079 389620972 389935989 390049171 389737015 389220276 388834496 388848991 388567238 388142395 387930489
3136.1 387930489 387834587 387744789 387745399 388049393 388135452 387510490 387015038 386928406 386495743 386115456 385767975
3146.8 385767975 385768890 386052742 386064529 386357651 386081352 385525284 385479660 385446205 385084763 384575462 384815445
3157.4 384815445 385139885 384788551 384042244 383511887 383095741 382375832 382149582 382483253 382751617 382540894
3167 382540894 382584343 382798309 382333412 381810837 381328163 381380386 381520424 380671158 379901123 379698448
3176.6 379698448 379608879 379973488 380636139 380598373 379998550 379623070 379375000 378776550 378266220 378139915
3186.3C78139915r5329J36757j717k82249m7111k6093o56776m69437L74679j33247
3195.9C76939392m72069k14576k47422k74353j28669j83144n54199j03760k67410n23720
3205.6C73970070J39313j7167m08058m55475l31726j7700L07045l16009p42150j4229
3215.2C72113914J7357m20417m89541J5259q8615l35045k82364n27916l22876j38702
3224.9C69541054L71475j01204m57420J30996k71148j16387k90870l55645o5383l64419
3234.5C68021049k32505m94309m69742K8649J03798k24305j57356k29378q31451k11868
3244.2C65302582L68919n2223l18527l03040l29132j00212n8823m69894k62222J2169
3253.8C63789597L87458K58141m81873o28738m14734k58903o18287m66613j04218M769
$$ plain form
3186.3 378139915 378044586 378181343 378179626 377897377 377850266 377824173 377167397 376697960 377072639 376939392
3195.9 376939392 376467323 376252747 376005325 375730972 375602303 375419159 374864960 374761200 374493790 373970070
3205.6 373970070 374109383 374092216 373684158 373228683 372896957 372879257 373186302 372870293 372128143 372113914
3215.2 372113914 372131271 371710854 371221313 371236572 371147957 370812912 370530548 370002632 369679756 369541054
3224.9 369541054 369912529 369811325 369353905 369484901 369213753 369097366 368806496 368450851 368385468 368021049
3234.5 368021049 367788544 367294235 366824493 366853142 366956940 366732635 366575279 366345901 365514450 365302582
3244.2 365302582 365671501 365619278 365300751 364997711 364668579 364568367 364509544 364039650 363777428 363789597
3253.8 363789597 364177055 364435196 363953323 363324585 362909851 362650948 362032661 361566048 361461830 361466599
3263.4C61466599J84745N9014L81546J17645p17926o29692j63193k87285m28657j35460
3273.1C59847336J64032L02810k53181o14967m29345K7237M03214m27361r27505K1477
3282.7C58113747L65524n64575j67465M07028k75078j13411K26669l14102q18825l471
3292.4C56856041K62070n29671m70924k34032K19726L9406m40368n20287l42483J78680
3302C55018158k05078m36516j74484k05040n68733m31214J59302j87111o06193m74206
3311.7C51888885R232l38325o12183J78795L09334l31612j006737m43382K6703l05939
3321.3C49374771o1722l5972o95534p88574J67007l72467j100769l20816k8458r4184
3330.9C46043282n56946q70934m55475J67847r6435o25649j69449l15056o79969o12908
$$ plain form
3263.4 361466599 361651344 361710358 362091904 362209549 361491623 360861931 360698738 360411453 359982796 359847336
3273.1 359847336 360011368 360314178 360060997 359446030 359016685 359043922 359447136 359019775 358092270 358113747
3282.7 358113747 358479271 357914696 357747231 358154259 357879181 357765770 357992439 357678337 356859512 356856041
3292.4 356856041 357118111 356588440 356117516 355883484 356103210 356142616 355702248 355181961 354839478 355018158
3302 355018158 354813080 354376564 354202080 353997040 353428307 352997093 353156395 352969284 352363091 351888885
3311.7 351888885 351898117 351559792 350947609 351126404 351435738 351104126 350097389 349654007 349680710 349374771
3321.3 349374771 349313049 349277077 348581543 347792969 347959976 347587509 346486740 346165924 346137466 346043282
3330.9 346043282 345486336 344615402 344159927 344327774 344231339 343605690 343436241 343121185 342441216 341828308
3340.6C41828308n41344n34629m75197k84348m29230o39114o36024l83568n30739m62685
3350.2C36911430j26648m07142n33867n24597l61138n23719l87879l11470j071625
3358.9C32663345p88765o48918o05583K26402N6000k42653l28827j350479r97963K36168
3368.6C28218727q07495j240273m28085l5019K74925j73034n16281q09594o99882p07016
3378.2C23076973r22852k21824m86069m23775K14272J45378j03378q59185p56588j27964
3387.8C19534988j92813l20511j35689k40402m17385j46904l81184n11551m73728o26469
3397.5C16088352k00271N2986l49770m04968K54764K92893j92947m72126o37646l43056
3407.1C14088211l36552o00814k60373m6596j80111j71871n6744L4638k49882n63412
$$ plain form
3340.6 341828308 341286964 340752335 340277138 339992790 339563560 338924446 338288422 337904854 337374115 336911430
3350.2 336911430 336784782 336377640 335843773 335319176 334958038 334434319 334046440 333734970 332663345
3358.9 332663345 331874580 331225662 330620079 330846481 330902481 330659828 330331001 328980522 327982559 328218727
3368.6 328218727 327411232 326170959 325742874 325707855 325982780 325809746 325293465 324483871 323783989 323076973
3378.2 323076973 322154121 321932297 321446228 321022453 321236725 321382103 321278725 320419540 319662952 319534988
3387.8 319534988 319342175 319021664 318885975 318645573 318228188 318081284 317700100 317188549 316714821 316088352
3397.5 316088352 315888081 315941067 315591297 315186329 315441093 315733986 315541039 315068913 314431267 314088211
3407.1 314088211 313751659 313150845 312890472 312843876 312663765 312491894 312435150 312469788 312219906 311656494
3416.8C11656494m88014k70844m1389k30866j27315L10116K45399k2602k52495p5111
3426.4C10703373k09656j19152K4700o78482l13625J30272M17366Q20083k69031r20429
3436.1C09585419l59536K22207J05590j16043M39587N80654Q755k03533J44195j9111
3445.7C10388184j5068N51090M71706J64204l28713j30062M58451M89234L45269j26667
3455.3C12267628m44527k17075M63772N37529K75573K51007j20086K44712O94829N92250
3465C14545612J03894j10245N15156L18451J58062J61209J46217O18496N65281L80096
3474.6C17402229k99606m40731N48878P83291O79950P24583J37882o08311L07217J077576
3484.3C20312958K82364M68940N21241m75083j50299M99573Q80318J028099M15725
$$ plain form
3416.8 311656494 311168480 310897636 310856247 310625381 310498066 310808182 311053581 311030979 310778484 310703373
3426.4 310703373 310493717 310374565 310399265 309720783 309407158 309537430 309954796 310774879 310505848 309585419
3436.1 309585419 309225883 309448090 309553680 309437637 309877224 310457878 310466633 310263100 310407295 310388184
3445.7 310388184 310373116 310924206 311395912 311560116 311231403 311101341 311559792 312049026 312394295 312267628
3455.3 312267628 311823101 311606026 312069798 312607327 312882900 313133907 313013821 313258533 313953362 314545612
3465 314545612 314649506 314539261 315054417 315372868 315530930 315692139 315838356 316456852 317022133 317402229
3474.6 317402229 317102623 316661892 317210770 317994061 318674011 319398594 319536476 318928165 319235382 320312958
3484.3 320312958 320595322 321064262 321585503 321110420 320960121 321459694 322340012 323368111 323783836
3493C23783836L94211P33795M11568J19896J60599j0300L79372J129226P81823M27093
3502.6C28311119p2517n10102N60532R44176L79409l204L66173J110268P14607P49130
3512.2C32549591O51283J82877O49071O98700M72145l0938l17916O76727J073875J222992
3521.9C37828407R43528j36834J97411M92859N60264P46994N87120N21889L89137P75795
3531.5C42906570R54056M59862M09088R08127O57272k51693L02276J029625R86557
3540.2C48361740J005135J191673J031342P54394R42688O98395Q8425j78452L98102
3548.9C54293442J080017J284370R28726O20957R51958K59094K45514J073646R66111
3557.6C61703835Q87565J108093J338387N98373J041794J808090N43480R39713R19342
$$ plain form
3493 323783836 324178047 324911842 325323410 325443306 325603905 325593605 325972977 327102203 327884026 328311119
3502.6 328311119 328238602 327728500 328289032 329233208 329612617 329609413 329975586 331085854 331800461 332549591
3512.2 332549591 333200874 333383751 334032822 334731522 335203667 335172729 334854813 335531540 336605415 337828407
3521.9 337828407 338771935 338635101 338832512 339325371 339885635 340632629 341219749 341741638 342130775 342906570
3531.5 342906570 343860626 344320488 344729576 345637703 346294975 346043282 346345558 347375183 348361740
3540.2 348361740 349366875 350558548 351589890 352344284 353286972 353985367 354073792 353895340 354293442
3548.9 354293442 355373459 356657829 357586555 358207512 359159470 359418564 359664078 360737724 361703835
3557.6 361703835 362591400 363699493 365037880 365636253 366678047 368486137 369029617 369969330 370888672
3566.2C70888672M29573J191788L16391J406059J520958N73234Q30193Q48427P17888
3574.9C78723183J155815J602936J706924J529427J285781P48559Q13713J403389J511840
3583.6C90481567J284638J372795J498451J606140J445465Q61016J193313J433411
3591.3D01176796J607285J719741J052056J034355J281128J845512J873665J701393
3599D13291931K631035J913681Q30154J096154J398925J602135K203064L237610J136284
3607.7D29340973J720505K080421J7052K870445L102036J586837K080078N00069J784592
3616.4D45083008L267135K974511J625785J314011J771011K190934K334098K550927
3624.1D63111420L495102L230590K521058L452110L799743j243858J124687K834854
$$ plain form
3566.2 370888672 371318245 372510033 372826424 374232483 375753441 376326675 377156868 378005295 378723183
3574.9 378723183 379878998 381481934 383188858 384718285 386004066 386752625 387566338 388969727 390481567
3583.6 390481567 391766205 393139000 394637451 396243591 397689056 398550072 399743385 401176796
3591.3 401176796 402784081 404503822 405555878 406590233 407871361 409716873 411590538 413291931
3599 413291931 415922966 417836647 418666801 419762955 421161880 422764015 424967079 428204689 429340973
3607.7 429340973 431061478 433141899 433158951 436029396 439131432 440718269 442798347 443298416 445083008
3616.4 445083008 448350143 451324654 452950439 454264450 456035461 458226395 460560493 463111420
3624.1 463111420 466606522 469837112 472358170 475810280 479610023 478366165 479490852 482325706
3631.8D82325706L465043L253898J476975K035675K566414K602768K481727K218399
3639.5E02426605K720909L163300L364448K982407K773361K659760M122009M326515
3647.3E28539314J206360M634018N694847J233444k181053K705689M023781L257598
3655E49113998N095864l7461J637001L724366K995491L368759J621551K347413K470054
3663.6E72337036K979431K663613J803856L543396L172073L808861J348419j807900
3671.4E89848785L021660M963722O306458L620377m763184J39694L632393L504524
3679.1F10274429L51563O72951K528457K830239J887359J466179J201630K703972M479942
3687.8F28396721j595421m00276M968490j25808K28157K670059M29153J405373J073265
$$ plain form
3631.8 482325706 485790749 489044647 490521622 492557297 495123711 497726479 500208206 502426605
3639.5 502426605 505147514 508310814 511675262 514657669 517431030 520090790 524212799 528539314
3647.3 528539314 529745674 534379692 540074539 541307983 539126930 541832619 545856400 549113998
3655 549113998 554209862 554172401 555809402 559533768 562529259 565898018 567519569 569866982 572337036
3663.6 572337036 575316467 577980080 579783936 583327332 586499405 590308266 591656685 589848785
3671.4 589848785 592870445 597834167 604140625 607761002 602997818 603137512 606769905 610274429
3679.1 610274429 610625992 611298943 613827400 616657639 618544998 620011177 621212807 623916779 628396721
3687.8 628396721 626801300 626401024 631369514 631243706 631471863 634141922 634571075 635976448 637049713
3696.4F37049713O98052K496070O54145J316299K681809j417160m96445L037567J744156
3705.1F47764206M65088N96542J544190L253860j556167K200317L664474o191177K210236
3713.8F53951569K196807N26886Q32749J163559J367264k113572j3198L442154k15226
3722.5F61138992j503830K908097J144867l3875n97992k87094J936951R97390L473435
3731.2F69176941l58963l379135O829834L307266n577850k225724P83158J13067O80542
3739.8F69349136K754441j634369J080398O465531o691742p193299O628952L125992
3747.5F73885040L451691j150055o584091P108917j739426n095672L087997K428055
3755.3F75392456J973419k841034K116700M218826m315186j831436J337204M97360
$$ plain form
3696.4 637049713 637747765 640243835 640897980 642214279 644896088 643478928 642982483 646020050 647764206
3705.1 647764206 648229294 648825836 650370026 653623886 652067719 654268036 657932510 651741333 653951569
3713.8 653951569 656148376 656675262 657508011 658671570 660038834 657925262 657912064 661354218 661138992
3722.5 661138992 659635162 662543259 663688126 663654251 663056259 662769165 664706116 665703506 669176941
3731.2 669176941 668817978 665438843 672268677 675575943 669998093 667772369 668555527 668668594 669349136
3739.8 669349136 672103577 670469208 671549606 678015137 671323395 664130096 670759048 673885040
3747.5 673885040 677336731 676186676 669602585 676711502 674972076 669876404 672964401 675392456
3755.3 675392456 677365875 674524841 676641541 680860367 676545181 674713745 676050949 676548309
3763F76548309J49918K678451k58560l028488J237183K371750J355362l793259Q52280
3771.7F78112946J935882k0370L45535n38101L53393L56751K107086J356811m554672
3780.3F79455261L01819Q42362O83975J940841r16595j318054J02615P54471P50122
3789F82596817L34854K92359M7607K41241l88259N14221J770477j342545j574096M69589
3798.7F82962265J974106L313446m271698n462341K107849J975326K959442K947464
3806.4F88505859n572891k706756L232574J725998N39780L65600j37787Q35419L475647
3815.1F90263443N1804r037934K225266L749923K634736K221298r332962p75223K665329
3823.7F84665680J069488J222992O24009j664353n30548P51572J609955J035995m572754
$$ plain form
3763 676548309 676698227 679376678 679118118 676089630 677326813 679698563 681053925 677260666 678112946
3771.7 678112946 680048828 680028458 680373993 679835892 680189285 680546036 682653122 684009933 679455261
3780.3 679455261 679757080 680599442 681283417 683224258 682307663 680989609 681092224 681846695 682596817
3789 682596817 682931671 683224030 683271637 683512878 683124619 683638840 685409317 684066772 682492676 682962265
3798.7 682962265 684936371 688249817 683978119 678515778 680623627 682598953 685558395 688505859
3806.4 688505859 682932968 680226212 683458786 685184784 685724564 686090164 685952377 686787796 690263443
3815.1 690263443 690315247 681277313 683502579 687252502 689887238 692108536 682775574 682000351 684665680
3823.7 684665680 685735168 686958160 687582169 685917816 685387268 686138840 687748795 688784790 684212036
3832.4F84212036J389618N017090l046799j389847L750153n875626k218856N603637
3840.1F87441406k011566p78122L485565j748199k184219J513824L75595j6785J226426
3848.8F87303925k89154J513443L901062k359772q3695r989624N61447N733643L6011
3857.5F86327286j162873k35519J442871K513123k705078m36326L434525k626343m068451
3866.2F82483215J759796L104096L792496l960572o769485J379013K948608K211457
3873.9F86948624m459610J13144K022323P8201J455765J893235l476258l782348L730697
3882.6F84523773J887512J449280K678833q529129r918K244110L43552K610321j64795
3891.2F87033539m349289N7983J452103o80008R4681O87561K257309R60006n593643
$$ plain form
3832.4 684212036 685601654 690618744 687571945 686182098 689932251 684056625 681837769 687441406
3840.1 687441406 685429840 684651718 688137283 686389084 684204865 685718689 686094284 686077499 687303925
3848.8 687303925 687014771 688528214 692429276 690069504 689985809 679996185 680557632 686291275 686327286
3857.5 686327286 685164413 684928894 686371765 688884888 686179810 685743484 689178009 686551666 682483215
3866.2 682483215 684243011 687347107 691139603 687179031 680409546 681788559 684737167 686948624
3873.9 686948624 682489014 682602158 684624481 684702682 686158447 688051682 684575424 680793076 684523773
3882.6 684523773 686411285 687860565 690539398 682010269 682000351 684244461 684588013 687198334 687033539
3891.2 687033539 682684250 682742233 684194336 683514328 683609009 684296570 686553879 687513885 681920242
3899.9F81920242K790680k12555l421020K848816k552719p78275M71191j93557J120758
3908.6F81993561Q13598M18778l81928k38113m56085o06384Q23364J880646k027436
3917.3F82220001k192459K571793k48719j386489R61914M6081N00946j434250j331863
3926F79706955J088562L84445P24869J34430k51923K24381k723007j095429J266708
3934.6F79459991l43856J41601R61533K47116l09982q27561P56302J137390k610550
3943.3F78611984j386261P50122R74121Q98362j289368J22986Q88519j108398J83715
3952F78645782j82189q03681k46353R0332J44882n10635K50778J1978j6937N37796
3961.6F77921753n17197j15890L24554P5226K4796o2333M21677l72314j130600K64740
$$ plain form
3899.9 681920242 684710922 684498367 681077347 683926163 681373444 680595169 681066360 680872803 681993561
3908.6 681993561 682807159 683225937 682844009 682605896 682149811 681543427 682366791 684247437 682220001
3917.3 682220001 680027542 682599335 682350616 680964127 681926041 681972122 682473068 681038818 679706955
3926 679706955 680795517 681179962 681904831 682039261 681787338 682011719 679288712 678193283 679459991
3934.6 679459991 679116135 679257736 680219269 680466385 680156403 679328842 680085144 681222534 678611984
3943.3 678611984 677225723 677975845 678949966 679848328 678558960 678681946 679570465 678462067 678645782
3952 678645782 678463593 677659912 677413559 677503891 677648773 677138138 677388916 677400894 677383957 677921753
3961.6 677921753 677404556 677288666 677613220 677688446 677713242 677650909 678072586 677700272 676569672 676834412
3971.3F76834412P49588j297l59650j74942J9226m44870m05884k2278L40805J28708
3980.9F76663818k18658q1177k02255N86243K71453n77850j49460p7972N52368J77383
3990.6F76943893j002807n09262K26288k61002m92630O28433M25797l52936K73437
3999.2F75879211N03312
4000.2F76382523
$$ plain form
3971.3 676834412 677584000 677582703 677223053 677048111 677067337 676622467 676216583 676194305 676535110 676663818
3980.9 676663818 676445160 676363983 676161728 676747971 677019424 676441574 676292114 676214142 676766510 676943893
3990.6 676943893 675941086 675431824 675658112 675397110 674904480 675532913 675958710 675605774 675879211
3999.2 675879211 676382523
4000.2 676382523
##END=$$ End of the data block
