##TITLE=$$ Begin of the data block
##JCAMP-DX=5.00 $$ ACD/SpecManager v 10.08
##SPECTROMETER/DATA SYSTEM=Varian
##DATE=21 Jan 2013 16:11:58
##DATA TYPE=INFRARED SPECTRUM
##DATA CLASS=XYDATA
##ORIGIN=
##OWNER=
##NPOINTS=3735
##FIRSTX=399.26403809
##LASTX=4000.35498047
##MAXX=4000.35498047
##MINX=399.26403809
##MAXY=66.32458496
##MINY=37.07402039
##XFACTOR=1.0000000000
##YFACTOR=0.000000100000000
##FIRSTY=55.83474350
##DELTAX=0.96440572
##XUNITS=1/CM
##YUNITS=TRANSMITTANCE
##XYDATA=(X++(Y..Y))
$$ plain form
399.3 558347435 579092598 573060608 562146530 555881729 563218384 567220383 561510811 558609428
407 558609428 553076591 560329819 566515045 564545097 563305664 567357521 570533409 565503922 560891609
415.7 560891609 553703423 553721657 561624451 562098732 561709824 561199570 562064590 562422104 565231438
424.3 565231438 560759048 558255653 560764275 561166344 557908554 552872887 559115906 562264328 558223038
433 558223038 552877388 554457664 564169273 565247498 563372078 560751152 560846405 559575272 558089104
441.7 558089104 560958405 558563728 557281761 554221420 553573303 556778221 560789185 561740799 555943642
450.4 555943642 555432854 557233925 559314766 557422218 553531075 552277985 552313919 555482407 554568138
459.1 554568138 557780724 558248367 556364479 558311119 555840721 553690224 552209053 553597221 558824272
$$ packed form
399.3E58347435K0745163o031990j0914078o264801P336655M001999n709572k901383
407E58609428n532837P253228O185226j969948j239433M051857L175888n029487m612313
415.7E60891609p188186J8234P902794M74281l88908n10254Q65020L57514K809334
424.3E65231438m472390k503395K508622M02069l257790n035667O243019L148422m041290
433E58223038n345650J580276R711609J078225j875420k620926R5253j271133j486168
441.7E58089104K869301k394677j281967l060341o48117L204918M010964R51614n797157
450.4E55943642n10788J801071K080841j892548l891143j253090L5934L168488r14269
459.1E54568138L212586M67643j883888J946640k470398k150497j481171J388168N227051
$$ plain form
467.7 558824272 561197701 557749405 554911804 557622566 557816696 552305336 552989120 561640472 562332649
476.4 562332649 555854530 555500374 553499641 549759827 548987770 551247826 553188972 552353287 551978149
485.1 551978149 551146469 548211517 548210487 549555817 547677383 548041573 550866127 551899605 549875908
493.8 549875908 548704605 548506546 544414825 542519569 541848869 541444778 545364151 548284531 546202202
502.5 546202202 545006676 547380447 546956940 542407532 538689384 541413269 544075546 544273453 544420776
511.1 544420776 540620270 538421059 538810120 540801201 543840027 542877235 541700249 539938622 537578316
519.8 537578316 536041031 535322456 535647621 535444565 536529770 536012535 532746506 530847206 531249352
528.5 531249352 534436188 535616646 533444405 531694565 531672516 532373009 533357925 533798599 532243347
$$ packed form
467.7E58824272K373429l448296k837601K710762J94130n511360O83784Q651352O92177
476.4E62332649o478119l54156k000733l739814p72057K260056J941146q35685l75138
485.1E51978149q31680k934952j030J345330j878434L64190K824554J033478k023697
493.8E49875908j171303j98059m091721j895256o70700m04091L919373K920380k082329
502.5E46202202j195526K373771m23507m549408l718148K723885K662277J97907J47323
511.1E44420776l800506k199211L89061J991081L038826r62792j176986j761627k360306
519.8E37578316j537285p18575L25165k03056J085205n17235l266029j899300M02146
528.5E31249352L186836J180458k172241j749840k2049P00493R84916M40674j555252
$$ plain form
537.2 532243347 529099236 527583122 528796120 528671150 526914406 526956139 527967339 528152695 527908401
545.9 527908401 527861481 528484879 527617569 525499840 524002304 521501694 520682335 520674324 520488853 522589417
555.5 522589417 524021111 524811172 523906097 520426674 518760338 519377594 519179649 518849449 519917221
564.2 519917221 520821648 520663795 519458809 520302620 520695763 518232155 518016777 518352585 519107819
572.9 519107819 519508934 518850899 519657249 519617538 519733810 519875526 518795662 517605362 517214394 516676331
582.5 516676331 515878372 516343842 516486053 517357712 517914505 516932297 516240158 515845222 515800781 513690338
592.1 513690338 512270622 513720245 514990311 514706459 514268074 514426155 513157310 511024857 509147987
600.8 509147987 508704300 509060364 508941154 509347763 509321556 509176674 508634109 508192787 508075943 506789436
$$ packed form
537.2E32243347l144111j516114J212998j24970j756744M1733J011200J85356k44294
545.9E27908401m6920O23398q67310k117729j497536k500610q19359q011j85471K100564
555.5E22589417J431694P90061r05075l479423j666336O17256j97945l30200J067772
564.2E19917221R04427j57853j204986Q43811L93143k463608k15378L35808P55234
572.9E19107819M01115o58035Q06350l9711J16272J41716j079864j190300l90968n38063
582.5E16676331p97959M65470J42211Q71659N56793r82208o92139l94936m4441k110443
592.1E13690338j419716J449623J270066k83852m38385J58081j268845k132453j876870
600.8E09147987m43687L56064j19210M06609k6207j44882n42565m41322j16844j286507
$$ plain form
610.5 506789436 506019135 505254707 504246216 503737907 504311295 506284904 507246666 508168030 509344063
619.2 509344063 509647102 509880409 509126625 507849884 507907524 508068314 508654366 511092186 513128052
627.8 513128052 514285088 515287628 516091499 517128792 517408943 516658478 515577545 514634895 514473610
636.5 514473610 516589813 519498558 520357056 521102448 522555580 523598518 523427429 522184448 520727005
645.2 520727005 519628410 519446487 520497055 522606316 523971710 524928360 526027832 526496391 527325020
653.9 527325020 527389450 525530930 523728981 523968925 524447556 524575653 525992699 527822380 528795166
662.5 528795166 529390831 530014153 529926605 530713654 531967239 527146416 527453346 529212990 530527496
671.2 530527496 531906967 533646927 534888878 535345001 535882416 534969139 533456917 532881165 533845444
$$ packed form
610.5E06789436p70301p64428j008491n08309N73388J973609R61762R21364J176033
619.2E09344063L03039K33307p53784j276741N7640J60790N86052K437820K035866
627.8E13128052J157036J002540Q03871J037293K80151p50465j080933r42650j61285
636.5E14473610K116203K908745Q58498P45392J453132J042938j71089j242981j457443
645.2E20727005j098595j81923J050568K109261J365394R56650J099472M68559Q28629
653.9E27325020O4430j858520j801949K39944M78631J28097J417046J829681R72786
662.5E28795166N95665O23322q7548P87049J253585m820823L06930J759644J314506
671.2E30527496J379471J739960J241951M56123N37415r13277j512222n75752R64279
$$ plain form
679.9 533845444 534865494 534823914 536313744 538527222 539201775 538400230 537681999 537287865 537235756 537778664
689.6 537778664 537510567 536888580 537082367 537862625 538319321 539567108 541084099 540828705 540126762
698.2 540126762 539356384 539231796 539736099 539623756 539737206 540106773 540265884 540563011 540784607 540835419
707.9 540835419 541542358 542210732 542400017 542309074 542483978 543674355 544633179 545445671 544990196 543820229
717.5 543820229 543995171 543752670 543906708 545342407 546734505 547131233 547145958 548781509 550862465
726.2 550862465 551587105 550726738 549832039 549857254 549826813 549784851 550675697 551762085 552597771 554666786
735.8 554666786 555763588 554909477 554509277 553729973 552825470 552928810 553211823 553952065 555194244
744.5 555194244 556970100 559176674 559656754 559067726 559278755 559319191 559198685 558841896 558671684 560014343
$$ packed form
679.9E33845444J020050m1580J489830K213478O74553q01545p18231l94134n2109N42908
689.6E37778664k68097o21987J93787P80258M56696J247787J516991k55394p01943
698.2E40126762p70378j24588N04303j12343J13450L69567J59111K97127K21596N0812
707.9E40835419P06939O68374J89285r0943J74904J190377R58824Q12492m55475j169967
717.5E43820229J74942k42501J54038J435699J392098L96728J4725J635551K080956
726.2E50862465P24640q60367q94699K5215l0441m1962Q90846J086388Q35686K069015
735.8E54666786J096802q54111m00200p79304r04503J03340K83013P40242J242179
744.5E55194244J775856K206574M80080n89028K11029M0436j20506l56789j70212J342659
$$ plain form
754.2 560014343 561549110 561616096 561707573 562752762 563669891 563823128 563210487 563391991 563358459 562368584
763.8 562368584 562929726 564406471 565241737 566244698 568063126 568773460 568349724 568269577 568175697 567793350
773.5 567793350 566787186 566887970 567916794 568967628 570258484 571056480 571661453 571650963 571793442
782.1 571793442 571811752 571612091 572113037 572620621 572815361 572326622 573239059 575164108 576017914 576384697
791.8 576384697 576213150 575716743 574926796 574889908 576228943 577217560 577352028 578194389 579084740 579515114
801.4 579515114 580207405 580551338 581289673 581136436 580318298 580293236 581198235 583139229 583765602 584038239
811.1 584038239 584844856 585838966 586605988 586269569 585774956 584871826 584588394 585192947 586043129 586728706
820.7 586728706 587722435 589398766 590186234 590322647 589827614 589246674 588526917 588392334 589513359
$$ packed form
754.2E60014343J534767O6986R1477J045189R17129J53237o12641J81504l3532r89875
763.8E62368584N61142J476745Q35266J002961J818428P10334m23736q0147r3880l82347
773.5E67793350j006164J00784J028824J050834J290856P97996O04973j0490J42479
782.1E71793442J8310j99661N00946N07584J94740m88739R12437J925049Q53806L66783
791.8E76384697j71547m96407p89947l6888J339035R88617J34468Q42361Q90351M30374
801.4E79515114O92291L43933P38335j53237q18138k5062R04999J940994O26373K72637
811.1E84038239Q06617R94110P67022l36419m94613r03130k83432O04553Q50182O85577
820.7E86728706R93729J676331P87468J36413m95033n80940p19757j34583J121025
$$ plain form
829.4 589513359 590791359 592708893 593698578 593848877 594630699 595496864 595646591 595222664 594570847
838.1 594570847 593939590 594256821 594584846 595797386 597197456 597827682 598250923 597598114 597383995
846.8 597383995 597223396 597062721 596782150 596382446 597211189 598369064 598798637 599011002 599966469 599296722
856.4 599296722 598279610 598101463 597545090 597088585 595718613 595441399 595754356 596304054 597886887
865.1 597886887 598965874 599097214 597983932 597350044 596572418 595375099 594695473 594513206 594198799
873.8 594198799 593535919 593747711 593654518 592807350 590620728 588936882 588046532 585995178 584459686
882.4 584459686 582703743 580830345 578814240 577219009 577575417 578095894 576825600 574527359 573001366
891.1 573001366 571567574 570648346 569779625 569167023 569774132 569597702 569407883 570225449 570725479 570222740
$$ packed form
829.4E89513359J278000J917534R89685J50299P81822Q66165J49727m23927o51817
838.1E94570847o31257L17231L28025J212540J400070O30226M23241o52809k14119
846.8E97383995j60599j60675k80571l99704Q28743J157875M29573K12365R55467o69747
856.4E99296722j017112j78147n56373m56505j369972k77214L12957N49698J582833
865.1E97886887J078987J31340j113282o33888p77626j197319o79626j82267l14407
873.8E94198799o62880K11792r3193q47168k186622j683846q90350k051354j535492
882.4E84459686j755943j873398k016105j595231L56408N20477j270294k298241j525993
891.1E73001366j433792r19228q68721o12602O07109j76430j89819Q17566N00030n02739
$$ plain form
900.8 570222740 569877243 569522934 568889580 569093895 569891586 571580391 572891426 573357658 573692474
909.4 573692474 573883057 574108086 573764076 573192863 572803764 573089790 572850189 572314491 572402306 572166939
919.1 572166939 571896400 570809631 569102478 567648048 566681023 565399857 564877777 565539322 565190735
927.8 565190735 564539871 563281174 562623596 562317543 560760193 558564529 556172523 555332642 553964958
936.4 553964958 552459450 552197113 551918221 551476860 550350418 549480362 548071594 546413231 545278053
945.1 545278053 544834366 544428520 543251877 543380127 543514519 543496780 543364525 542457275 541809921 540407944
954.8 540407944 538888245 537518806 537040291 537037697 536387749 536341019 536112747 535547600 534573708 532922211
964.4 532922211 531400452 530355377 529473801 528211975 527239685 527192917 527581558 527624321 527637177 527590446
$$ packed form
900.8E70222740l45497l54309o33354K04315P97691J688805J311035M66232L34816
909.4E73692474J90583K25029l44010n71213l89099K86026k39601n35698Q7815k35367
919.1E72166939k70539j086769j707153j454430r67025j281166n22080O61545l48587
927.8E65190735o50864j258697o57578l06053j557350k195664k392006q39881j367684
936.4E53964958j505508k62337k78892m41361j126442q70056j408768j658363j135178
945.1E45278053m43687m05846j176643J28250J34392j7739j32255r07250o47354j401977
954.8E40407944j519699j369439m78515k594o49948m6730k28272n65147r73892j651497
964.4E32922211j521759j045075q81576j261826r72290m6768L88641M2763J2856m6731
$$ plain form
974.1 527590446 527091217 526119881 524233780 522571487 521591682 521219292 521580353 521553383 521145096 520809975
983.7 520809975 520392532 519639549 518333473 516369095 514133301 512306709 511259270 511196213 511316071
992.4 511316071 511371078 511433563 510758400 510096550 509101143 507338867 505996284 505457344 505077591 503908195
1002 503908195 503592262 504227829 504550285 505040932 505013123 504648056 503254013 501104965 499794083 499103241
1011.7 499103241 498858757 498719482 499411430 500034943 499593239 498762283 497971230 497076874 495582161
1020.3 495582161 494718437 494292526 493877487 493385849 493416290 494334984 494781952 495304184 494773254 493499298
1030 493499298 492486382 491265793 490798531 490971603 491565628 491636391 491644897 491948204 492594452 492834435
1039.6 492834435 491620827 490747795 489782028 489450912 489283676 488837166 489674988 490210876 490565681
$$ packed form
974.1E27590446m99229r71336j886101j662293r79805l72390L61061k6970m08287l35121
983.7E20809975m17443p52983j306076j964378k235794j826592j047439o3057J19858
992.4E11316071N5007O2485o75163o61850r95407j762276j342583n38940l79753j169396
1002E03908195l15933O35567L22456M90647k7809l65067j394043k149048j310882o90842
1011.7D99103241k44484j39275O91948O23513m41704q30956p91053q94356j494713
1020.3D95582161q63724m25911m15039m91638L0441R18694M46968N22232n30930j273956
1030D93499298j012916j220589m67262J73072N94025P0763Q506L03307O46248K39983
1039.6D92834435j213608q73032r65767l31116j67236m46510Q37822N35888L54805
$$ plain form
1048.3 490565681 490300751 489634285 489276199 488733978 488002663 486602898 485573387 485460701 486256180
1057 486256180 486782761 487130356 486837425 485704231 486094322 486031837 484915161 483908577 482755127
1065.7 482755127 481704826 481737671 483547821 484586601 484339828 483884888 483097458 482712669 482889633
1074.4 482889633 482205544 480903320 480874214 481615524 482469673 483044815 483014221 482697296 482264595 481601524
1084 481601524 481344566 481425514 480844650 481186676 481509666 481280937 481941299 482253532 481987534 481289864
1093.6 481289864 481076622 480570641 479166908 479657745 480701065 480292397 480879440 482619095 483706131
1102.3 483706131 483566780 481999435 481973686 482829285 482174263 482072830 482355194 483103638 483861847 484119225
1112 484119225 484955597 486217117 487172050 486982079 486470642 485764999 484745941 484103928 484659386 485643921
$$ packed form
1048.3D90565681k64930o66466l58086n42221p31315j399765j029511j12686P95479
1057D86256180N26581L47595k92931j133194L90091o2485j116676j006584j153450
1065.7D82755127j050301L2845J810150J038780k46773m54940p87430l84789J76964
1074.4D82889633o84089j302224k9106P41310Q54149N75142l0594l16925m32701o63071
1084D81601524k56958Q0948n80864L42026L22990k28729O60362L12233k65998o97670
1093.6D81289864k13242n05981j403733M90837J043320m08668N87043J739655J087036
1102.3D83706131j39351j567345k5749Q55599o55022j01433K82364P48444P58209K57378
1112D84119225Q36372J261520R54933j89971n11437p05643j019058o42013N55458R84535
$$ plain form
1121.6 485643921 486372185 488130913 488970413 489159851 489248695 488489876 487943268 487173271 487156372 487974701
1131.2 487974701 489308128 490508804 491468353 492771873 493170319 493317795 492640839 491515732 491287689
1139.9 491287689 491350670 491929703 492237816 493027687 494576302 495387154 495811729 495824661 495111084 494309006
1149.6 494309006 493546562 493214684 493333855 493278732 493751259 494537277 495649071 496552238 496931877 497596779
1159.2 497596779 497165794 496593132 496567535 496653366 497487450 498473320 500142403 501810379 502606697 503047905
1168.9 503047905 503137932 503300171 503623314 503951340 504916229 506243210 506911926 507833061 509422531
1177.5 509422531 511244507 512781715 513684425 514328156 514588966 515229607 516109962 516956367 518571014
1186.2 518571014 520234756 521728401 522958412 523846474 524911423 525784340 526197433 526740112 528216171
$$ packed form
1121.6D85643921P28264J758728Q39500J89438Q8844p58819n46608p69997j6899Q18329
1131.2D87974701J333427J200676R59549J303520L98446J47476o76956j125107k28043
1139.9D91287689O2981N79033L08113P89871J548615Q10852M24575J2932p13577q02078
1149.6D94309006p62444l31878J19171n5123M72527P86018J111794R03167L79639O64902
1159.2D97596779m30985n72662k5597Q5831Q34084R85870J669083J667976P96318M41208
1168.9E03047905R0027J62239L23143L28026R64889J326981O68716R21135J589470
1177.5E09422531J821976J537208R02710O43731K60810O40641Q80355Q46405J614647
1186.2E18571014J663742J493645J230011Q88062J064949Q72917M13093N42679J476059
$$ plain form
1194.9 528216171 529846992 531146393 532592888 533871231 535465698 536732521 537062416 537725143 538602715
1203.6 538602715 539234924 539710045 540584984 542045135 543455429 544907341 546544075 547609482 547658081
1212.3 547658081 547348785 547201691 547629929 548333130 549318733 550982666 553102760 554829674 555408478
1220.9 555408478 556146126 556803207 557166595 557645836 557551613 557900429 558381348 559183540 560497780 561803589
1230.6 561803589 562601204 562505417 562881012 562805748 562059288 561369858 561045074 561120720 561071854 561466751
1240.2 561466751 561882553 562382278 562538223 562272263 561923256 560876503 559680138 558385506 557678185
1248.9 557678185 557962189 558544197 559214859 559732208 559826012 559841766 559840927 559328079 558618431 558011475
1258.5 558011475 558147011 558866959 559930534 560954704 561686440 562809792 563603554 564335747 564555969
$$ packed form
1194.9E28216171J630821J299401J446495J278343J594467J266823L29895O62727Q77572
1203.6E38602715O32209M75121Q74939J460151J410294J451912J636734J065407M8599
1212.3E47658081l09296j47094M28238P03201R85603J663933K120094J726914N78804
1220.9E55408478P37648O57081L63388M79241r4223L48816M80919Q02192J314240J305809
1230.6E61803589P97615r5787L75595p5264p46460o89430l24784P5646m8866L94897
1240.2E61466751M15802M99725J55945k65960l49007j046753j196365j294632p07321
1248.9E57678185K84004N82008O70662N17349R3804J5754q39n12848p09648o06956
1258.5E58011475J35536P19948J063575J024170P31736J123352P93762P32193K20222
$$ plain form
1267.2 564555969 564410133 564609604 564504013 565290947 566129951 567326012 568932724 569871597 570528717
1275.9 570528717 570466499 570600891 570536346 570260010 569733734 569222031 568994408 568350563 568538551 568798637
1285.5 568798637 568766670 568020096 566886864 565735855 564162102 563014221 561211624 559872665 559213715
1294.2 559213715 558707428 558206367 557271957 556336670 554999542 553902512 551979446 550054092 549460907
1302.9 549460907 549189072 549139442 548869400 548504562 548346024 548276978 547522240 546676102 546029243 545131111
1312.5 545131111 545012207 545200157 545464935 545331993 544929543 545381317 546041565 545497093 544355087
1321.2 544355087 544149933 543948746 543799896 544222984 544872665 545528908 546024055 547037468 547463379
1329.9 547463379 547077637 546969490 547237434 547178764 547144165 548085365 548873100 549508972 550071297 550430908
$$ packed form
1267.2E64555969j45836J99471j05591P86934Q39004J196061J606712R38873O57120
1275.9E70528717o2218J34392o4545k76336n26276n11703k27623o43845J87988K60086
1285.5E68798637l1967p46574j133232j151009j573753j147881j802597j338959o58950
1294.2E59213715n06287n01061r34410r35287j337128j097030j923066j925354n93185
1302.9E49460907k71835m9630k70042l64838j58538o9046p54738q46138o46859q98132
1312.5E45131111j18904J87950K64778j32942m02450M51774O60248n44472j142006
1321.2E44355087k05154k01187j48850M23088O49681O56243M95147J013413M25911
1329.9E47463379l85742j08147K67944n8670l4599R41200P87735O35872N62325L59611
$$ plain form
1339.6 550430908 550381851 550154877 550305367 549495277 548757744 548254623 547893410 548163986 548434601 548655510
1349.2 548655510 548443832 548212471 547135887 545851212 545077705 543882256 542491035 541660118 541619225
1357.9 541619225 541101418 540666084 540060921 539509964 539144402 536824188 535700188 535146561 534201889
1366.6 534201889 533132324 531326752 529999962 529694977 528980484 528185043 527970390 527072296 525701256
1375.2 525701256 524832344 524356499 523373756 522714233 522541885 522048645 522065620 521821938 521911392 522028999
1384.9 522028999 522454109 523524971 522953224 523082390 524063797 524993935 525807228 526825447 527928810
1393.6 527928810 527930527 527917099 528605995 529407272 529938469 529365082 529324188 530135345 530444870 530520020
1403.2 530520020 531439056 531328659 531067352 531747971 531829185 531865616 531693077 531689301 531926651 532209206
$$ packed form
1339.6E50430908m9057k26974J50490q10090p37533n03121l61213K70576K70615K20909
1349.2E48655510k11678k31361j076584j284675p73507j195449j391221q30917m0893
1357.9E41619225n17807m35334o05163n50957l65562k320214j124000n53627r44672
1366.6E34201889j069565j805572j326790l04985p14493p95441k14653q98094j371040
1375.2E25701256q68912m75845r82743o59523j72348m93240J6975k43682Q9454J17607
1384.9E22028999M25110J070862n71747J29166R81407R30138Q13293J018219J103363
1393.6E27928810J717j3428O88896Q01277N31197n73387m0894Q11157L09525P5150
1403.2E30520020R19036j10397k61307O80619Q1214L6431j72539l776K37350K82555
$$ plain form
1412.8 532209206 532515297 532484970 532956505 533116074 533438377 534466286 532360916 532348404 533890457
1421.5 533890457 534673805 535543594 535804367 536182365 537060242 536765137 537007751 537749252 537515564 537947998
1431.2 537947998 538968773 540028038 540296669 541163940 542616234 540710068 540744400 542518806 543435173
1439.8 543435173 543253708 543208923 543751945 544494133 545155907 545676537 546408806 546485748 545534019 545708122
1449.5 545708122 546302567 546011696 545424538 545817337 546617737 547519341 547867470 546484413 545630646
1458.2 545630646 546692200 547995071 549396172 550087967 550148926 551429634 551155510 550973015 552937279
1466.8 552937279 554412804 555613327 556467514 558100853 558710709 556197929 555447121 557002907 560165482
1475.5 560165482 560334396 560531387 562336349 563167229 564052887 563604050 563239975 563322105 563434715 563246651
$$ packed form
1412.8E32209206L06091l0327M71535J59569L22303J027909k105370j2512J542053
1421.5E33890457P83348Q69789K60773L77998Q77877k95105K42614P41501k33688M32434
1431.2E37947998J020775J059265K68631Q67271J452294j906166L4332J774406R16367
1439.8E43435173j81465m4785N43022P42188O61774N20630P32269P6942r51729J74103
1449.5E45708122N94445k90871n87158L92799Q00400R01604L48129j383057q53767
1458.2E45630646J061554J302871J401101O91795O0959J280708k74124j82495J964264
1466.8E52937279J475525J200523Q54187J633339O09856k512780p50808J555786L162575
1475.5E60165482J68914J96991J804962Q30880Q85658m48837l64075Q2130J12610j88064
$$ plain form
1485.2 563246651 563009872 562010803 559937134 560881996 559604263 558170395 558616943 558501167 557580414
1493.8 557580414 556458893 556190491 551450577 552010880 551658554 548693085 548866272 547649460 546197701
1502.5 546197701 545196190 546174774 547066422 541983223 534368858 533828354 535148506 533181763 533703117
1511.2 533703117 532437134 530474167 530977821 530594673 530174522 526950493 523829803 524961815 527019310
1519.9 527019310 524807549 520182228 520531769 521217918 522798309 519970589 519332619 519517593 517781105
1528.6 517781105 517526588 517752800 518398590 518530159 518254204 515139694 515855103 516280823 516114082
1537.2 516114082 517833710 516731110 513160591 512447853 513639832 513179932 514292908 515395088 513202133
1545.9 513202133 514622688 515095215 515716476 515377274 513692131 515173225 516423569 517994728 515162392
$$ packed form
1485.2E63246651k36779r99069k073669R44862j277733j433868M46548j15776r20753
1493.8E57580414j121521k68402m739914N60303l52326k965469J73187j216812j451759
1502.5E46197701j001511R78584Q91648n083199p614365n40504J320152j966743N21354
1511.2E33703117j265983j962967N03654l83148m20151l224029l120690J132012K057495
1519.9E27019310k211761m625321L49541O86149J580391k827720o37970J84974j736488
1528.6E17781105k54517K26212O45790J31569k75955l114510P15409M25720j66741
1537.2E16114082J719628j102600l570519p12738J191979m59900J112976J102180k192955
1545.9E13202133J420555M72527O21261l39202j685143J481094J250344J571159k832336
$$ plain form
1554.6 515162392 514312134 517188873 520269737 518789101 511680336 512723389 513569336 515448418 516959000
1563.3 516959000 518174515 517851067 517451973 518143196 518754272 520138321 515737762 515735931 517216225
1572 517216225 517105675 517443237 518478622 519349747 513652382 515250816 516577263 516489487 516549683 515648460
1581.6 515648460 515446968 515066986 515420341 515135956 514849968 514899063 514249344 514300690 513282318 512966728
1591.2 512966728 512256622 511753426 511705894 511010551 510641289 509453506 509560051 509305344 508883858 507909584
1600.9 507909584 506770630 506570969 505170860 504448280 503701591 503650856 502915802 502509041 501999741
1609.6 501999741 500378685 500419807 499435081 499142570 498335075 498875198 500271072 494032593 494217262
1618.2 494217262 494373856 494725342 493951149 494244080 494217873 489543495 489977608 490533485 491733475
$$ packed form
1554.6E15162392q50258K876739L080864j480636p108765J043053Q45947J879082J510582
1563.3E16959000J215515l23448l99094O91223O11076J384049m400559j831J480294
1572E17216225j10550L37562J035385Q71125n697365J598434J326447q7776O0196r01223
1581.6E15648460k01492l79982L53355k84385k85988M9095o49719N1346j018372l15590
1591.2E12966728p10106n03196m7532o95343l69262j187783J06545k54707m21486r74274
1600.9E07909584j138954j99661j400109p22580p46689n0735p35054m06761n09300
1609.6E01999741j621056M1122r84726k92511q07495N40123J395874o238479J84669
1618.2D94217262J56594L51486p74193K92931k6207m674378M34113N55877J199990
$$ plain form
1626.9 491733475 490604439 489230194 489712105 489509506 489551582 488845100 489763641 491267853 487081566
1635.6 487081566 485132713 487288666 487984962 488473473 489561729 489380951 490202065 489814796 490493927
1644.3 490493927 492159271 489934120 489359665 488363113 489733925 491491165 494195824 498260078 498602295
1653 498602295 490251617 491930695 494827232 496194038 496872902 497449799 498673820 500272141 501531219
1661.6 501531219 502136612 501756897 503981857 505427780 506104736 507786560 510320358 510491447 509932594
1670.3 509932594 512663116 513773766 516201859 519656219 520184822 519602470 522360077 525076866 527090759
1679 527090759 529035873 529668579 532457352 537286339 541169014 537265892 537492599 541589661 544672318
1687.7 544672318 546134033 548294220 549599152 550946693 552653046 554300156 557147331 559461555
$$ packed form
1626.9D91733475j129036j374245M81911k02599M2076p06482R18541J504212m186287
1635.6D87081566j948853K155953O96296M88511J088256j80778Q21114l87269O79131
1644.3D90493927J665344k225151n74455r96552J370812J757240K704659M064254L42217
1653D98602295q350678J679078K896537J366806O78864N76897J224021J598321J259078
1661.6E01531219O05393l79715K224960J445923O76956J681824K533798J71089n58853
1670.3E09932594K730522J110650K428093L454360N28603n82352K757607K716789K013893
1679E27090759J945114O32706K788773M828987L882675l903122K26707M097062L082657
1687.7E44672318J461715K160187J304932J347541J706353J647110K847175K314224
$$ plain form
1695.4 559461555 556011047 557768097 561264610 565388947 566253548 560063782 564222298 567549095
1703.1 567549095 569276505 570140419 571323967 570982513 572109756 574650917 575492897 575087547 576065788
1711.8 576065788 577545471 578883286 579115715 579094925 582087517 584247437 578957214 581427803 584613914
1720.5 584613914 586124802 587101212 587183342 587356911 588889656 590168457 590999260 592346992 594132042
1729.1 594132042 593927536 593585854 596229858 598890991 598122787 593894196 596677551 599566078 600540848
1737.8 600540848 602761955 602753639 600392113 602955246 604689484 603941460 603860092 605481377 606298409
1746.5 606298409 606739922 607086105 606519165 608248863 607349510 606100693 608245773 608924446 609419441
1755.2 609419441 610642776 609384384 609209328 610391960 611473122 613392067 612014160 611046906 612584267
$$ packed form
1695.4E59461555l450508J757050L496513M124337Q64601o189766M158516L326797
1703.1E67549095J727410Q63914J183548l41454J127243K541161Q41980m05350R78241
1711.8E76065788J479683J337815K32429k0790K992592K159920n290223K470589L186111
1720.5E84613914J510888R76410Q2130J73569J532745J278801Q30803J347732J785050
1729.1E94132042k04506l41682K644004K661133p68204m228591K783355K888527R74770
1737.8F00540848K221107q316k361526K563133J734238p48024q1368J621285Q17032
1746.5F06298409M41513L46183n66940J729698q99353j248817K145080O78673M94995
1755.2F09419441J223335j258392j75056J182632J081162J918945j377907r67254J537361
$$ plain form
1763.9 612584267 612949257 613266563 614274597 615295372 613613052 614665375 617529449 618591690 617369118
1772.5 617369118 615580635 618319893 620047340 619397507 620731544 621793480 623142090 624079781 623949089
1781.2 623949089 625097313 626991959 628837662 628984985 629226074 630757713 631817970 632770386 634605560
1789.9 634605560 636037292 637454491 637458839 637216301 639739723 640872040 640884781 642258148 643940201
1798.6 643940201 644572678 644576950 646523209 647331924 648364716 650127106 651084061 652108002 652662582
1807.3 652662582 653139801 653909149 654798355 653949509 653922882 655279312 655888062 656995239 657763062
1815.9 657763062 658841324 659212570 659062347 659542770 659071045 659178619 659119339 659823914 660926743
1824.6 660926743 659659119 659866867 661099625 662329102 662382050 659332581 659643021 661229858 661459808
$$ packed form
1763.9F12584267L64990L17306J008034J020775j682320J052323K864074J062241j222572
1772.5F17369118j788483K739258J727447o49833J334037J061936J348610R37691j30692
1781.2F23949089J148224J894646J845703J47323K41089J531639J060257R52416J835174
1789.9F34605560J431732J417199M348k42538K523422J132317J2741J373367J682053
1798.6F43940201O32477M272J946259Q08715J032792J762390R56955J023941N54580
1807.3F52662582M77219P69348Q89206q48846k6627J356430O08750J107177P67823
1815.9F57763062J078262L71246j50223M80423m71725J07574n9280P04575J102829
1824.6F60926743j267624K07748J232758J229477N2948l049469L10440J586837K29950
$$ plain form
1833.3 661459808 661584549 661406479 661423874 661820984 661680069 662515182 662718811 662339935 662050323 662807922
1842.9 662807922 663245850 659055939 660077515 661811752 661635208 661457977 661885452 662605591 662394714
1851.6 662394714 662257843 662029190 661752014 661581573 661637878 662136307 662086868 662251205 662151794 662006149
1861.3 662006149 661934814 661777496 661586914 661221619 661213837 660945969 661167603 660529327 659760590 660425034
1870.9 660425034 660854111 661066360 660811081 660765457 660502014 660134888 659960785 659661255 659391937 659099197
1880.6 659099197 659567642 659786224 659596786 659019852 658344345 658259583 658162766 658648834 658243103 657037125
1890.2 657037125 657608871 658244781 658098373 658185577 657809525 656700287 656684418 656104202 655260239 655308456
1899.8 655308456 655542145 655689697 655575790 655729065 655359268 654954758 654948502 654558716 654214935 654062042
$$ packed form
1833.3F61459808J24741j78070J7395L97110j40915Q35113K03629l78876k89612P57599
1842.9F62807922M37928m189911J021576J734237j76544j77231M27475P20139k10877
1851.6F62394714j36871k28653k77176j70441N6305M98429m9439J64337r9411j45645
1861.3F62006149p1335j57318j90582l65295p782k67868K21634o38276p68737O64444
1870.9F60425034M29077K12249k55279m5624k63443l67126j74103k99530k69318k92740
1880.6F59099197M68445K18582j89438n76934o75507q4762r6817M86068m05731j205978
1890.2F57037125N71746O35910j46408Q7204l76052j109238j5869n80216q43963M8217
1899.8F55308456K33689J47552j13907J53275l69797m04510o256l89786l43781j52893
$$ plain form
1909.5 654062042 653543472 652984314 653218842 653041763 652878876 652616882 652256470 652730255 651122131
1918.2 651122131 649891052 650264282 650317917 650501480 649734726 648923569 649186096 649508591 649281006 649096527
1927.8 649096527 648682022 647903824 647647095 647588425 647235031 646439667 646148911 645942383 645747986 645814819
1937.5 645814819 645437622 645207748 644736252 644910049 644603653 642567139 642588654 643035812 642900238 642782135
1947.1 642782135 642596817 642326431 641747971 641260681 640675354 640242004 640163040 639769745 639355965 639272652
1956.7 639272652 639202728 638949051 638800392 638763046 638184891 637359619 636729507 636292381 636615829 637037697
1966.4 637037697 636281853 635196877 635133781 635385933 635116920 634464035 633733368 633627014 633639336 633450508
1976 633450508 633310432 632920418 632567787 631994667 631597137 631434860 631118431 630767059 630197334 629829369
$$ packed form
1909.5F54062042n18570n59158K34528j77079j62887k61994l60412M73785j608124
1918.2F51122131j231079L73230N3635J83563p66754q11157K62527L22495k27585j84479
1927.8F49096527m14505p78198k56729n8670l53394p95364k90756k06528j94397O6833
1937.5F45814819l77197k29874m71496J73797l06396k036514K1515M47158j35574j18103
1947.1F42782135j85318k70386n78460m87290n85327m33350p8964l93295m13780q3313
1956.7F39272652o9924k53677j48659l7346n78155q25272o30112m37126L23448M21868
1966.4F37037697p55844j084976o3096K52152k69013o52885p30667j06354J2322j88828
1976F33450508j40076l90014l52631n73120l97530j62277l16429l51372n69725l67965
$$ plain form
1985.7 629829369 629567490 629388275 628967705 628415184 628596115 628666420 627548218 626507301 626714058
1994.3 626714058 626804848 626270943 625911407 625705986 625446358 625065460 624830208 624257507 623757286 623500099
2004 623500099 622831192 622335014 622094078 621836128 621447754 621266975 621172218 620820045 620445709 620042763
2013.6 620042763 619723167 619404182 619027672 618339958 617773972 617539406 617534637 617775383 617517357 617189674
2023.3 617189674 616862907 616430893 616162224 615693130 615074310 614384346 614103470 614142494 614217644 614151459
2032.9 614151459 613863220 613596497 613287163 613113365 612519264 611789436 611571732 611259422 610780640 610804062
2042.6 610804062 611125107 610762558 610208244 610044632 609948349 609677811 609415092 609324989 608904457 608547440
2052.2 608547440 608445740 608257332 608083496 608210449 608419647 607950668 607308807 607030220 606619263 606082077
$$ packed form
1985.7F29829369k61879j79215m20570n52521J80931P0305j118202j040917K06757
1994.3F26714058R0790n33905l59536k05421k59628l80898k35252n72701n00221k57187
2004F23500099o68907m96178k40936k57950l88374j80779r4757l52173l74336m02946
2013.6F20042763l19596l18985l76510o87714n65986k34566m769K40746k58026l27683
2023.3F17189674l26767m32014k68669m69094o18820o89964k80876L9024P5150o6185
2032.9F14151459k88239k66723l09334j73798n94101p29828k17704l12310m78782K3422
2042.6F10804062L21045l62549n54314j63612r6283k70538k62719r0103m20532l57017
2052.2F08547440j01700j88408j73836J26953K09198m68979o41861k78587m10957n37186
$$ plain form
2061.9 606082077 606076241 606278381 606377106 606439590 606181450 606047974 605843887 605578423 605458794 605289803
2071.5 605289803 605109138 604880295 605009613 605108910 605101547 605095100 604866943 604519844 604177246 604328499
2081.1 604328499 604390182 604130745 603871689 603803635 604011993 603992538 603734818 603490181 603527336 603472214
2090.8 603472214 603463364 603418312 603358688 603874130 603899231 603558044 603277473 603071976 603036690 602808304 602728500
2101.4 602728500 602641449 602642555 602687340 602659988 602685661 602716370 602845573 602884865 602907677 602677612 602442551
2112 602442551 602500839 602613525 602543335 602457619 602638321 602574463 602621155 602744217 602791328 602786446 602655182
2122.6 602655182 602815552 602723274 602721558 602921982 602948036 603037491 603174973 603162575 602770004 602591705 602591209
2133.2 602591209 602835579 602989044 602709579 602809639 602934036 602996178 603121338 603281021 603343315 603319397
$$ packed form
2061.9F06082077n836K02140R8725O2484k58140j33476k04087k65464j19629j68991
2071.5F05289803j80665k28843J29318R9297p363o447k28157l47099l42598J51253
2081.1F04328499O1683k59437k59056o8054K08358j9455k57720k44637L7155n5122
2090.8F03472214q850m5052n9624N15442K5101l41187k80571k05497l5286k28386p9804
2101.4F02728500q7051J106M4785k7352K5673L0709J29203L9292K2812k30065k35061
2112F02442551N8288J12686p0190q5716J80702o3858M6692J23062M7111m882j31264
2122.6F02655182J60370r2278j716K00424K6054Q9455J37482j2398l92571j78299m96
2133.2F02591209K44370J53465k79465J00060J24397O2142J25160J59683O2294k3918
$$ plain form
2142.9 603319397 603456879 603408813 603183403 602815819 602948723 603433647 603727341 604040680 604000854 603918839
2152.5 603918839 603794479 603294983 603196564 603782959 604039574 604054260 604293175 604349136 604536171 604705772
2162.1 604705772 604778976 604773674 604447899 604293671 604552994 604589424 604403763 604735641 604953613 605106583
2171.8 605106583 605306320 605453911 605798378 605667191 605319176 604588203 604300880 604919052 605327759 605575676
2181.4 605575676 605508690 605593529 605599136 605427475 605477409 605472412 605593414 605442505 605164070 605079880 605295143
2192 605295143 605495338 605677643 605939064 605857506 605963936 605796204 605336456 605093842 605139580 605518341
2201.7 605518341 605761185 605947418 606070671 606247711 606010132 605527153 605451279 605401001 605186043 604782829
2211.3 604782829 604937477 605380096 605607719 605792885 605868263 605769157 605358009 605257607 604993858 604455605
$$ packed form
2142.9F03319397J37482m8066k25410l67584J32904M84924K93694L13339l9826q2015
2152.5F03918839j24360m99496r8419N86395K56615J4686K38915N5961J87035J69601
2162.1F04705772P3204n302l25775j54228K59323L6430j85661L31878K17972J52970
2171.8F05106583J99737J47591L44467j31187l48015p30973k87323O18172M08707K47917
2181.4F05575676o6986Q4839N607j71661M9934m997J21002j50909k78435q4190K15263
2192F05295143K00195J82305K61421q1558J06430j67732m59748k42614M5738L78761
2201.7F05518341K42844J86233J23253J77040k37579m82979p5874n0278k14958m03214
2211.3F04782829J54648M42619K27623J85166P5378r9106m11148j00402k63749n38253
$$ plain form
2221 604455605 604359665 604467468 604557076 604647217 604818687 604924049 605193062 605194778 604981346 604818230 604259987
2231.6 604259987 603970032 603880539 603720665 603846436 604442406 604686050 604241867 604153824 604233284 604132462
2241.2 604132462 603897629 603616905 603263817 603215179 603431969 603366547 603507195 603591042 603565674 603343735
2250.9 603343735 603017349 602847710 602412186 602165565 602173500 602394638 602456207 602547913 602717590 602306213
2260.5 602306213 602151031 602325478 602099571 601396599 601150665 601160774 600960503 600954437 600973854 601467247
2270.2 601467247 601758537 601797142 601638870 600843315 600231781 599809418 599610100 599439774 599506721 599634361
2279.8 599634361 599767647 599993248 599694176 599355011 598793182 598573761 598587952 598306274 597918320 597554817
2289.4 597554817 598053894 598147430 598090782 598155251 597600060 597166824 596682777 596527977 596085701 595603333
$$ packed form
2221F04455605r5940J07803Q9608R0141J71470J05362K69013J716k13432j63116n58243
2231.6F04259987k89955q9493j59874J25771N95970K43644m44183q8043P9460j00822
2241.2F04132462k34833k80724l53088m8638K16790o5422J40648Q3847k5368k21939
2250.9F03343735l26386j69639m35524k46621P935K21138O1569R1706J69677m11377
2260.5F02306213j55182J74447k25907p02972k45934J0109k00271o066J9417M93393
2270.2F01467247K91290L8605j58272p95555o11534m22363j99318j70326O6947J27640
2279.8E99634361J33286K25601k99072l39165n61829k19421J4191k81678l87954l63503
2289.4E97554817M99077R3536n6648O4469n55191m33236m84047j54800m42276m82368
$$ plain form
2299.1 595603333 595628128 595789909 596229630 596216965 596077042 596189003 596289520 595322418 593904953 593471794
2308.7 593471794 593290329 593526115 593566246 593724136 593855133 593340950 593217964 592688141 592005920 591727066
2318.4 591727066 591525269 591289864 591382332 591328506 590819550 590864716 590528069 590400238 590213814 590130844
2328 590130844 590746613 590394821 590607147 590408936 589665833 589129982 588191872 588891029 589226761 588795280
2337.7 588795280 589055595 589456711 589685326 588243637 587559052 587468872 586178246 585531654 584894218
2346.3 584894218 583958321 583783646 584651604 585692253 585275116 584320717 583953705 583828011 584316711
2355 584316711 584578209 583178215 582043152 582105255 581487083 581501083 581571426 581323967 580934219 580140991
2364.7 580140991 579656792 578764648 579085770 579243622 578827782 578951035 578057747 577563667 577392349 576667900
$$ packed form
2299.1E95603333K4795J61781M39721j2665j39923J11961J00517r67102j417465m33159
2308.7E93471794j81465K35786M0131J57890J30997n14183j22986n29823o82221k78854
2318.4E91727066k01797k35405R2468n3826n08956M5166l36647j27831j86424q2970
2328E90130844O15769l51792K12326j98211p43103n35851r38110O99157L35732m31481
2337.7E88795280K60315M01116K28615j441689o84585r0180j290626o46592o37436
2346.3E84894218r35897j74675Q67958J040649m17137r54399l67012j25694M88700
2355E84316711K61498j399994j135063O2103o18172J4000P0343k47459l89748p93228
2364.7E80140991m84199q92144L21122J57852m15840J23253q93288m94080j71318p24449
$$ plain form
2374.3 576667900 575995293 575823708 576059341 575883179 575455627 574967461 574681129 574355011 573452415 572582703
2383.9 572582703 572130508 571649857 571046295 570975304 571364098 571423759 570844421 570348473 570125122 569536171
2393.6 569536171 568986359 568409004 567870293 567650032 567330399 567112312 566910591 566626015 566448059 566151199
2403.2 566151199 565584068 565085373 564482002 563777771 563628273 563403587 563014374 562967758 562921906 562806129
2412.9 562806129 562621193 561960297 560909386 560292625 559717560 559173126 559124985 558834572 558482018 558447876
2422.5 558447876 558295555 557643051 557139778 556974602 556352348 555696640 555159874 554701004 554603691 554367790
2432.2 554367790 553774948 553352509 553036346 552359734 551944466 551550369 550509224 549807472 549737396 549600716
2441.8 549600716 549187393 548634300 548221169 547975388 547767830 547578888 547102432 546395111 545745544 545066338
$$ packed form
2374.3E76667900o72607j71585K35633j76162m27552m88166k86332l26118r02596q69712
2383.9E72582703m52195m80651o03562p0991L88794N9661n79338m95948k23351n88951
2393.6E69536171n49812n77355n38711k20261l19633k18087k01721k84576j77956k96860
2403.2E66151199n67131m98695o03371p04231j49498k24686l89213m6616m5852j15777
2412.9E62806129j84936o60896j050911o16761n75065n44434m8141k90413l52554l4142
2422.5E58447876j52321o52504n03273j65176o22254o55708n36766m58870r7313k35901
2432.2E54367790n92842m22439l16163o76612m15268l94097j041145p01752p0076j36680
2441.8E49600716m13323n53093m13131k45781k07558j88942m76456p07321o49567o79206
$$ plain form
2451.5 545066338 544605293 544407082 544117928 543795471 543742294 543464508 542532616 541766396 541586990 541424408
2461.1 541424408 540794754 540189781 539809761 539227638 538833389 538584862 538093147 537732468 537791595 537610016
2470.7 537610016 536804199 536022377 535581207 535330620 535071983 534990311 534881516 534549332 534267502 533616982
2480.4 533616982 532964821 532750854 532462425 531881447 531383362 531342812 531195984 530751152 530505066 530444756
2490 530444756 530108566 529608345 529449768 529186478 528548889 527832565 527372322 527347260 527092247 526713181
2499.7 526713181 526848564 526661530 526038513 525757256 525423470 525088615 525035858 524927330 524644585 524389343
2509.3 524389343 524312401 524094353 523887520 523787956 523708305 523569298 522994957 522632561 522513695 522174187
2519 522174187 522253723 522414131 521892776 521419601 521315804 520925446 520601578 520573845 520462799 520325432
$$ packed form
2451.5E45066338m61045j98211k89154l22457n3177k77786r31892p66220j79406j62582
2461.1E41424408o29654o04973l80020n82123l94249k48527m91715l60679N9127j81579
2470.7E37610016q05817p81822m41170k50587k58637q1672j08795l32184k81830o50520
2480.4E33616982o52161k13967k88429n80978m98085m0550j46828m44832k46086o0310
2490E30444756l36190n00221j58577k63290o37589p16324m60243k5062k55013l79066
2499.7E26713181J35383j87034o23017k81257l33786l34855n2757j08528k82745k55242
2509.3E24389343p6942k18048k06833r9564p9651j39007n74341l62396j18866l39508
2519E22174187P9536J60408n21355m73175j03797l90358l23868k7733j11046j37367
$$ plain form
2528.6 520325432 520230446 520214005 520100861 519907227 519793549 519614182 519496536 519468040 519133339 518724670
2538.2 518724670 518697243 518620186 518232727 518059731 518033485 517339439 516645546 516662140 516653938 516698914 516799278
2548.9 516799278 516701241 516465569 516239586 516077118 515633507 515354881 515145073 514975319 515157013 515061035
2558.5 515061035 514924583 514940605 514728432 514418297 514433746 514278412 513511162 513128433 512998619 512809410
2568.1 512809410 513076210 513412895 513345604 512915306 512657890 512555275 512129059 511966743 511973686 511507072
2577.8 511507072 511196404 511148491 511249084 511374512 511056900 510845528 510590248 510023422 509619675 509474831
2587.4 509474831 509751282 509957466 509616241 509401360 509680023 509702950 509319115 508990860 508909416 508939743
2597.1 508939743 508635902 508389320 508242531 508064156 507938995 507865524 508184509 508118896 507785378 507789497
$$ packed form
2528.6E20325432r4986j6441j13144j93634j13678j79367j17646k8496l34701m08669
2538.2E18724670k7427p7057l87459j72996k6246o94046o93893J6594q202M4976J00364
2548.9E16799278r8037k35672k25983j62468m43611k78626k09808j69754J81694r5978
2558.5E15061035j36452J6022k12173l10135J5449j55334p67250l82729j29814j89209
2568.1E12809410K66800L36685o7291m30298k57416j02615m26216j62316O943m66614
2577.8E11507072l10668m7913J00593J25428l17612k11372k55280n66826m03747j44844
2587.4E09474831K76451K06184l41225k14881K78663K2927l83835l28255q1444L0327
2597.1E08939743l03841k46582j46789j78375j25161p3471L18985o5613l33518M119
$$ plain form
2606.7 507789497 507646751 507340775 506997490 506606674 506228485 506313133 506483879 506555290 506619225 506169853
2616.4 506169853 506026230 506131325 505858536 505349503 504959297 505103035 505032120 504690056 504398956 504113274
2626 504113274 504140244 504157562 503953400 503569031 502980385 502697411 502790871 502497025 502163277 502450256
2635.6 502450256 502514725 501988182 501671791 501488113 501058655 500870667 500709534 500339699 500248375 500325317
2645.3 500325317 500118599 499686928 499483452 499402351 499268417 498921852 498450012 498188095 497927971 497945747
2654.9 497945747 498206520 498087158 497445755 496814766 496732292 497049675 497129784 496636963 496400223 496243401
2664.6 496243401 495935745 495863647 495781441 495884285 495553169 495039558 494902802 494702339 494418755 494014015
2674.2 494014015 493820190 493483009 493209572 493153801 493015823 493060493 492850761 492708244 492388382 492073784
$$ packed form
2606.7E07789497j42746l05976l43285l90816l78189Q4648J70746P1411O3935m49372
2616.4E06169853j43623J05095k72789n09033l90206J43738p0915l42064k91100k85682
2626E04113274K6970J7318k04162l84369n88646k82974R3460k93846l33748K86979
2635.6E02450256O4469n26543l16391j83678m29458j87988j61133l69835r1324P6942
2645.3E00325317k06718m31671k03476q1101j33934l46565m71840k61917k60124J7776
2654.9D97945747K60773j19362o41403o30989q2474L17383Q0109m92821k36740j56822
2664.6D96243401l07656p2098q2206J02844l31116n13611j36756k00463k83584m04740
2674.2D94014015j93825l37181k73437n5771j37978M4670k09732j42517l19862l14598
$$ plain form
2683.9 492073784 492120514 491810341 491614456 491422462 491278801 491224899 491070900 491137772 491011581 490555267
2693.5 490555267 490095406 490033112 489996872 489840736 489812355 489779167 489604530 489126167 489033279 489048004 488855019
2704.1 488855019 488760986 488560028 488370552 488025627 487805367 487579079 487475586 487578583 487512245 487888794
2713.8 487888794 487780838 487241211 487080498 486889000 486768913 486337776 486064491 486131821 486270714 486506386
2723.4 486506386 486316528 485980911 485427361 484997673 484955978 484781418 484577904 484253731 484110222 484096298
2733 484096298 484013443 483973923 483976822 484139481 483965569 483670158 483288422 482744675 482518845 482431297 482552719
2743.7 482552719 482592545 482682114 482823219 482606621 482420921 481932182 481484413 481373405 481179008 480874138
2753.3 480874138 480308990 479957047 480005684 480283852 480314407 479929276 479728622 479413528 478905106 478605461
$$ packed form
2683.9D92073784M6730l10173j95885j91994j43661n3902j53999O6872j26191m56314
2693.5D90555267m59861o2294l6240j56136k8381l3188j74637m78363r2888J4725j92985
2704.1D88855019r4033k00958j89476l44925k20260k26288j03493J02997o6338L76549
2713.8D87888794j07956n39627j60713j91498j20087m31137k73285O7330J38893K35672
2723.4D86506386j89858l35617n53550m29688m1695j74560k03514l24173j43509j3924
2733D84096298q2855l9520K899J62659j73912k95411l81736n43747k25830q7548J21422
2743.7D82552719L9826Q9569J41105k16598j85700m88739m47769j11008j94397l04870
2753.3D80874138n65148l51943M8637K78168L0555l85131k00654l15094n08422k99645
$$ plain form
2762.9 478605461 478512535 478316650 478164139 478420219 478573914 478450661 478112755 477576408 477297287 477311287
2772.6 477311287 477092743 476821938 476914673 476700821 476358223 476508675 476620789 476384087 475769539 474983559
2782.2 474983559 474719582 475120239 475384712 475105247 474828186 474915657 474929161 474784126 474994507 474940147
2791.9 474940147 474281425 473859138 473612633 473205376 473077354 473239594 473035316 472806282 473072395 473306732
2801.5 473306732 473160591 472647629 472098007 471830864 471910210 471813850 471037979 470731468 470899620 470584908
2811.2 470584908 470441628 470394897 470051117 469675255 469507141 469381409 468921661 468855667 468862343 468382492
2820.8 468382492 468266487 468392982 468395081 468107300 467541924 466934280 466505775 466499062 466361313 466141739
2830.4 466141739 466100349 465811691 465344620 465093460 465056000 464911308 464773941 464402122 463655128 463287315
$$ packed form
2762.9D78605461r2926j95885j52511K56080J53695j23253l37906n36347k79121J4000
2772.6D77311287k18544k70805R2735k13852l42598J50452J12114k36702o14548p85980
2782.2D74983559k63977M00657K64473k79465k77061Q7471J3504j45035K10381n4360
2791.9D74940147o58722m22287k46505m07257j28022J62240k04278k29034K66113K34337
2801.5D73306732j46141n12962n49622k67143P9346r6360p75871l06511J68152l14712
2811.2D70584908j43280m6731l43780l75862j68114j25732m59748o5994O676m79851
2820.8D68382492j16005J26495K099k87781n65376o07644m28505o713j37749k19574
2830.4D66141739m1390k88658m67071k51160l7460j44692j37367l71819p46994l67813
$$ plain form
2840.1 463287315 463204765 462735863 462221413 462236137 462456093 462454643 462149506 461680107 460904732 459831696
2849.7 459831696 459098091 458657112 458409233 458381996 458437958 458458824 458332863 458393478 458426247 458115768
2859.4 458115768 457813034 457821617 457750931 457492561 457477608 457508392 457425499 457026291 456635857 456556435 456330109
2870 456330109 456044579 455670471 455205727 455007439 455360565 455599136 455305214 455318298 455341339 454961357
2879.6 454961357 454498177 454024162 453716431 453704567 453691978 453462181 453308716 453505707 454039803 454083672
2889.3 454083672 453525887 453182716 452982941 452722244 452605019 452818451 452838211 452522278 452174950 452088394
2898.9 452088394 452248116 452051353 451994781 451828117 451586227 451844254 451761360 451332970 450719109 450574799
2908.6 450574799 450970573 451077957 451203613 451184654 451001053 450776024 450349464 449903030 449630432 449253540
$$ packed form
2840.1D63287315q2550m68902n14450J4724K19956j450l05137m69399p75375j073036
2849.7D59831696p33605m40979k47879k7237N5962K0866j25961O0615L2769l10479
2859.4D58115768l02734Q583p0686k58370j4953L0784q2893l99208l90434p9422k26326
2870D56330109k85530l74108m64744j98288L53126K38571k93922J3084K3041l79982
2879.6D54961357m63180m74015l07731j1864j2589k29797j53465J96991N34096M3869
2889.3D54083672n57785l43171j99775k60697j17225K13432J9760l15933l47328q6556
2898.9D52088394J59722j96763n6572j66664k41890K58027q2894m28390o13861j44310
2908.6D50574799L95774J07384J25656j8959j83601k25029m26560m46434k72598l76892
$$ plain form
2918.2 449253540 448667641 448528633 448483849 448280830 448273239 448086929 447523804 447188721 447473488 447813835
2927.8 447813835 447988014 448032646 447919769 447698021 447503128 447381134 447084808 447073288 447436523 447567825
2937.5 447567825 447388153 447334557 447474442 447499733 447585220 447676277 447954178 448285713 448056412 447839661
2947.1 447839661 447950134 448180656 448295517 448268471 448313828 448063774 447932892 447960434 447542686 447207985
2956.8 447207985 447297974 447499084 447238197 447109756 447389259 447343063 447724152 448120689 447862549 447520370
2966.4 447520370 447368355 447621613 447661591 447691307 447829552 447632027 447640953 447834320 448010788 447968903
2976.1 447968903 447734871 447571373 447621574 447703896 447395859 447274818 447569771 447922058 447905884 447637291
2985.7 447637291 447755699 447864838 447916870 447914085 447525177 447384567 447618561 447551384 447281876 447196770
$$ packed form
2918.2D49253540n85899j39008m4784k03019p591j86310n63125l35083K84767L40347
2927.8D47813835J74179M4632j12877k21748j94893j21994k96326j1520L63235J31302
2937.5D47567825j79672n3596J39885K5291Q5487R1057K77901L31535k29301k16751
2947.1D47839661J10473K30522J14861k7046M5357k50054j30882K7542m17748l34701
2956.8D47207985Q9989K01110k60887j28441K79503m6196L81089L96537k58140l42179
2966.4D47520370j52015K53258L9978K9716J38245j97525Q926J93367J76468m1885
2976.1D47968903k34032j63498N0201Q2322l08037j21041K94953L52287j6174k68593
2985.7D47637291J18408J09139N2032k785l88908j40610K33994o7177k69508q5106
$$ plain form
2995.3 447196770 447300224 447626839 447901573 447562027 446862679 446848145 446962013 446414337 446171074 446319618
3005 446319618 446303329 446107864 446180954 446595230 446501045 446094933 446165848 446321335 446104889 445876732 445401840
3015.6 445401840 445018921 445295639 445550003 445544930 445300407 445076561 444755173 444492989 444667091 444514427
3025.2 444514427 444171257 443832016 443482323 443247261 443321838 443906822 444083786 443875847 443759384 443465691
3034.9 443465691 443096581 442750549 442435112 442534370 442593346 442439384 442832298 442739792 442116432 441977196
3044.5 441977196 441955833 441512108 440965843 441133270 441231880 441113586 440974998 440962410 441226006 440720444
3054.2 440720444 440333366 440296135 440144615 440099411 439893990 439569130 439120674 439115486 439276123 439283028 438990135
3064.8 438990135 438764458 438730965 438062859 438114014 438464355 438177032 437973251 438051262 438248405 437859077
$$ packed form
2995.3D47196770J03454L26615K74734l39546o99348j4534J13868n47676k43263J48544
3005D46319618j6289j95465P3090M14276r4185m06112P0915J55487k16446k28157m74892
3015.6D45401840l82919K76718K54364n073k44523k23846l21388k62184J74102j52664
3025.2D44514427l43170l39241l49693k35062P4577N84984J76964k07939j16463k93693
3034.9D43465691l69110l46032l15437R9258N8976j53962L92914r2506o23360j39236
3044.5D41977196k1363m43725n46265J67427R8610j18294j38588j2588K63596n05562
3054.2D40720444l87078l7231j51520m5204k05421l24860m48456n188J60637O905k92893
3064.8D38990135k25677l3493o68106N1155L50341k87323k03781P8011J97143l89328
$$ plain form
3074.4 437859077 437619591 437530060 437156563 436971741 436606674 436194115 436213684 436283073 435989075 436038933
3084.1 436038933 436233559 436485901 436644211 436109581 435716171 435213547 434840736 434699783 434425392 434301109
3093.7 434301109 434299240 434883537 434889412 434573479 434579887 434103165 434014893 433911133 433663864 433731651 433552437
3104.3 433552437 433228493 432751999 432602539 432939873 432929344 432565727 432105293 431779594 432063370 432467842
3114 432467842 432532501 432276306 431728477 431745262 431987190 431465378 431217422 431232719 430520897 430226822
3123.6 430226822 430459442 430239830 429982147 430115166 430398636 430102005 429349060 428886070 428832169 428559608
3133.3 428559608 428199463 428544769 428892136 429288826 429576035 429518929 429521828 428853149 428184280 427625656
3142.9 427625656 427013817 426863213 426689415 426622505 426703911 426841393 426735611 426531868 426510239 426330757
$$ packed form
3074.4D37859077k39486q9531l73497j84822l65067m12559J9569O9389k93998M9858
3084.1D36038933J94626K52342J58310n34630l93410n02624l72811j40953k74391j24283
3093.7D34301109j869N84297N875l15933O408m76722q8272j03760k47269O7787j79214
3104.3D33552437l23944m76494j49460L37334j0529l63617m60434l25699K83776M04472
3114D32467842O4659k56195n47829J6785K41928n21812k47956J5297p11822k94075
3123.6D30226822K32620k19612k57683J33019K83470k96631p52945m62990n3901k72561
3133.3D28559608l60145L45306L47367L96690K87209n7106K899o68679o68869n58624
3142.9D27625656o11839j50604j73798o6910Q1406J37482j05782k03743k1629j79482
$$ plain form
3152.5 426330757 426162453 425948830 425690956 425206490 424661369 424477959 424427719 424329338 424092140 423988190
3162.2 423988190 424104843 424114265 423697472 423221397 423001289 422932510 423058739 422984276 422749939 422702789
3171.8 422702789 422875366 422752571 422330551 421984901 421525764 421326103 421060791 420783730 420710258 420232315
3181.5 420232315 420136375 420440788 420163651 419655609 419329910 419198570 419343681 419391975 419258194 418965111
3191.1 418965111 418825073 418858032 418454132 418114128 417673912 417546082 417725029 417495613 417526627 416873894
3200.8 416873894 416316986 416354637 416168251 416299438 416143494 416044350 415639305 415121651 415133362 414480247
3210.4 414480247 413871231 413856964 414148064 414501724 414601631 414159508 413474960 413383713 413296547 412989845
3220 412989845 412691879 412700806 412941208 412614365 412281723 412460022 412542839 412328873 412171478 411839371
$$ packed form
3152.5D26330757j68304k13623k57874m84466n45121j83410n0240r8381k37198j03950
3162.2D23988190J16653R422m16793m76075k20108o8779J26229p4463k34337m7150
3171.8D22702789J72577j22795m22020l45650m59137j99661k65312k77061p3472m77943
3181.5D20232315r5940L04413k77137n08042l25699j31340J45111M8294j33781k93083
3191.1D18965111j40038L2959m03900l40004m40216j27830J78947k29416L1014o52733
3200.8D16873894n56908L7651j86386J31187j55944r9144m05045n17654J1711o53115
3210.4D14480247o09016j4267K91100L53660R9907m42123o84548r1247q7166l06702
3220D12989845k97966Q927K40402l26843l32642J78299Q2817k13966j57395l32107
$$ plain form
3229.7 411839371 411567764 411888962 411921997 411235504 410665665 410243797 409845123 410015488 410085182 409520874
3239.3 409520874 409009552 409094391 409038429 408267975 407947464 408028908 408175583 408430672 408285751 407899895
3249 407899895 407635956 407635994 407261009 406837425 406603889 406398506 406751022 406847763 406246452 405656967 405882874
3259.6 405882874 405834694 405209999 405294609 405074806 404914284 405236931 405033035 404609413 404549217 404950943
3269.2 404950943 405117950 404928589 404633904 404043808 403334923 403327599 403538094 402968979 402748375 403013458
3278.9 403013458 402949982 402790184 402700195 402448311 402103806 401959648 401557198 401317215 401539764 401406212
3288.5 401406212 401305923 401376076 401398239 401772423 401790352 401293335 400951233 400771446 400593414 399922752
3298.2 399922752 399673996 400062294 399850998 399664268 399769592 399636955 399132462 398677902 398518867 398551331
$$ packed form
3229.7D11839371k71607L21198L3035o86493n69839m21868l98674J70365O9694n64308
3239.3D09520874n11322Q4839n5962p70454l20511Q1444J46675K55089j44921l85856
3249D07899895k63939L8l74985m23584k33536k05383L52516R6741o01311n89485K25907
3259.6D05882874m8180o24695Q4610k19803j60522L22647k03896m23622o0196M01726
3269.2D04950943J67007j89361k94685n90096p08885p324K10495n69115k20604K65083
3278.9D03013458o3476j59798q9989k51884l44505j44158m02450k39983K22549j33552
3288.5D01406212j00289P0153K2163L74184J7929m97017l42102j79787j78032o70662
3298.2C99922752k48756L88298k11296j86730J05324j32637n04493m54560j59035L2464
$$ plain form
3307.8 398551331 398575974 397987938 397588120 397379150 397208176 397299538 396825943 396308060 396322060 396282005
3317.4 396282005 395520668 395162811 395503769 395450783 395232887 395050926 395379181 395299950 394540520 393994713
3327.1 393994713 393726006 393643265 392714119 392197342 392685814 392812958 392507286 392189255 392102432 391426620
3336.7 391426620 390965919 391014633 390508995 390066757 390240059 390674133 390396461 389595146 389051018 388964615
3346.4 388964615 388978539 388576889 387902489 387237549 387157402 387474136 387656174 387459450 387063675 386793098
3356 386793098 386475334 386219635 385817146 385382271 385045853 384643173 384185371 384215660 384734955 384202576
3365.7 384202576 383565636 383711243 383596420 383346558 382818375 382201080 381805725 381513672 381304665 380893021
3375.3 380893021 380744133 381083183 381140633 380887260 380732307 380388489 379746284 379402580 379349213 378795319
$$ packed form
3307.8C98551331K4643n88036l99818k08970j70974R1362m73595n17883J4000m0055
3317.4C96282005p61337l57857L40958n2986k17896j81961L28255p9231p59430n45807
3327.1C93994713k68707q2741r29146n16777M88472J27144l05672l18031q6823o75812
3336.7C91426620m60701M8714n05638m42238J73302M34074k77672q01315n44128q6403
3346.4C88964615J3924m01650o74400o64940q0147L16734J82038j96724l95775k70577
3356C86793098l17764k55699m02489m34875l36418m02680m57802L0289N19295n32379
3365.7C84202576o36940J45607j14823k49862n28183o17295l95355k92053k09007m11644
3375.3C80893021j48888L39050N7450k53373j54953l43818o42205l43704n3367n53894
$$ plain form
3384.9 378795319 378363190 378513680 378708420 378891029 378358574 377695580 377775497 377773666 377569504 377400551
3394.6 377400551 376868286 376338577 376748924 376982613 376297951 375409012 374537926 374749565 375750885
3403.3 375750885 375846138 375130844 374802094 375345383 375760460 375241470 374580154 374350204 374148216 373746719
3412.9 373746719 373415413 373614082 373777695 373544464 373424606 373423424 373338966 373032188 372952728 372670441
3422.6 372670441 372185783 372239456 372122841 371878662 372006721 371962051 371406937 371316643 371494446 371558838
3432.2 371558838 372032089 371789627 371250496 371345177 371652679 371565857 371413116 371552315 371521225 371931915
3441.8 371931915 371536903 370988770 371189232 371402855 372275047 371544113 370740204 371160355 371112442 371335678
3451.5 371335678 371792259 372164764 371999245 371911736 371699409 371277313 371358986 371341019 371726379 371759148
$$ packed form
3384.9C78795319m32129J50490J94740J82609n32455o62994P9917j831k04162j68953
3394.6C77400551n32265n29709M10347K33689o84662q88939q71086K11639J001320
3403.3C75750885R5253p15294l28750N43289M15077n18990o61316k29950k01988m01497
3412.9C73746719l31306J98669J63613k33231j19858j182q4458l06778p9460k82287
3422.6C72670441m84658N3673j16615k44179J28059m4670n55114r0294J77803O4392
3432.2C71558838M73251k42462n39131R4681L07502q6822j52741J39199l1090M10690
3441.8C71931915l95012n48133K00462K13623Q72192p30934q03909M20151m7913K23236
3451.5C71335678M56581L72505j65519q7509k12327m22096Q1673j7967L85360L2769
$$ plain form
3461.1 371759148 371450386 371389465 371821899 372591286 372559280 372437820 372259407 372607040 373253288 373269196
3470.8 373269196 373345146 373209152 372966957 372660942 372902031 373702240 374093513 374054832 373867340 374253426
3480.4 374253426 374809914 374395561 373483620 373638840 374190063 374530945 375037842 374959068 375168190 375978470
3490.1 375978470 376301880 376321220 376561737 376549911 376476364 376674881 376461182 376591110 376749954 376703682
3499.7 376703682 377271423 378392220 378905869 377546310 377086487 377888947 378098869 378562660 379787140
3508.4 379787140 379900093 378899918 379358482 379827118 379914703 379902802 379885979 380498619 380846710 381607552
3518 381607552 382144318 382117043 382409286 383199539 383792496 382578087 382327309 383154564 383507690 384205933
3527.7 384205933 384885864 384888954 384621811 384525948 384789314 385598259 385990372 386958618 387758141 386830368
$$ packed form
3461.1C71759148l08762o0921M32434P69387l2006j21460j78413L47633O46248J5908
3470.8C73269196P5950j35994k42195l06015K41089Q00209L91273l8681j87492L86086
3480.4C74253426N56488m14353r11941J55220N51223L40882N06897p8774K09122Q10280
3490.1C75978470L23410J9340K40517j1826p3547J98517k13699J29928J58844m6272
3499.7C76703682N67741J120797N13649j359559m59823Q02460K09922M63791J224480
3508.4C79787140J12953j000175M58564M68636Q7585j1901j6823O12640L48091P60842
3518C81607552N36766k7275K92243P90253N92957j214409k50778Q27255L53126O98243
3527.7C84205933O79931L090k67143r5863K63366Q08945L92113R68246P99523r27773
$$ plain form
3537.3 386830368 387088547 387566757 387537613 387776604 388465996 389379425 390161552 390804634 390821724 391073837
3547 391073837 390038376 390202866 391668739 392510262 393214531 392121887 393106499 394352608 394236107
3555.6 394236107 394893761 395179863 396337280 396608353 396185837 396305199 397377510 398255997 398387680
3564.3 398387680 401556168 401303177 399153290 399471359 398221779 400089149 401411591 402195549 402794189
3573 402794189 403149223 403500214 404431152 406212349 405484047 405935516 406462364 406942749 408695908 409050217
3582.6 409050217 409359398 409628716 412922287 414281807 411433983 411960602 410547142 413017578 415431862
3591.3 415431862 417226868 417995148 416818657 419078751 418094711 419245529 422142410 422010269 423806038
3600 423806038 423814850 423057632 423633080 424484863 425678673 427724419 429990311 429696236 432768059 431718864
$$ packed form
3537.3C86830368K58179M78210k9144K38991O89392R13429P82127O43082J7090K52113
3547C91073837j035461J64490J465873Q41523P04269j092644R84612J246109j16501
3555.6C94236107O57654K86102J157417K71073m22516J19362J072311Q78487J31683
3564.3C98387680L168488k52991k149887L18069j249580J867370J322442P83958N98640
3573D02794189L55034L50991R30938J781197p28302M51469N26848M80385J753159L54309
3582.6D09050217L09181K69318L293571J359520k847824N26619j413460K470436K414284
3591.3D15431862J795006P68280j176491K260094r84040J150818K896881j32141J795769
3600D23806038Q812p57218N75448Q51783J193810K045746K265892k94075L071823j049195
$$ plain form
3609.6 431718864 429199829 434852142 436413956 433613396 436544533 436123161 438408661 442694931
3617.4 442694931 442590828 443359566 441769867 440789909 444318314 447399979 448724670 450180740 452134933
3626 452134933 454254112 460437317 463022842 451143074 453086891 457172623 461824570 463812065
3633.8 463812065 462860031 464772415 467076149 469118538 469592209 470672607 473033829 475634613 476460686
3642.4 476460686 475972672 478035583 481627769 488332405 489487953 486224060 492841682 493579369 489742088
3651.1 489742088 486308250 490214958 495109444 499293594 504498024 497106285 498073158 503751945
3658.8 503751945 505614586 506982613 507620354 509866829 511221313 513204765 515349045 515716400 519211922
3667.5 519211922 522205200 524213486 526426697 519753990 519479637 526298790 536088066 540865173
$$ packed form
3609.6D31718864k519035N652313J561814k800560K931137m21372K285500M286270
3617.4D42694931j04103P68738j589699r79958L528405L081665J324691J456070J954193
3626D52134933K119179O183205K585525j1879768J943817M085732M651947J987495
3633.8D63812065r52034J912384K303734K042389M73671J080398K361222K600784Q26073
3642.4D76460686m88014K062911L592186O704636J155548l263893O617622P37687l837281
3651.1D89742088l433838L906708M894486M184150N204430p391739R66873N678787
3658.8E03751945J862641J368027O37741K246475J354484J983452K144280L67355L495522
3667.5E19211922K993278K008286K213211o672707k74353O819153R789276M777107
$$ plain form
3675.2 540865173 525363808 523399200 529019966 534050980 532607231 531668015 534008141 536072121
3682.9 536072121 537583466 537511406 537722435 542546921 550700378 544360733 537665176 545353203 541368408
3691.6 541368408 539168472 544654694 546131210 547713852 548172340 547620049 548856010 549005623 550847969
3700.3 550847969 554029312 550460701 547538147 551854248 553530617 553313141 553671455 555011826 558803406
3709 558803406 552149391 554842834 561160393 548252220 551176529 556171646 556922684 556799927 558569450
3717.7 558569450 560208778 556036530 556158943 562492981 560991859 555454865 559513855 560724678
3725.4 560724678 559996567 558258057 558014793 561666183 562213058 566869278 566255913 558739738 566715317
3734 566715317 570077209 561309929 558949776 560003967 559519653 561654320 565517616 561381683 562238693
$$ packed form
3675.2E40865173j5501365j964608N620766N031014j443749r39216K340126K063980
3682.9E36072121J511345p2060K11029M824486Q153457o339645o695557P688027l984795
3691.6E41368408k199936N486222J476516J582642M58488n52291J235961J49613J842346
3700.3E50847969L181343l568611k922554M316101J676369k17476L58314J340371L791580
3709E58803406o654015K693443O317559j2908173K924309M995117P51038j22757J769523
3717.7E58569450J639328m172248J22413O334038j501122n536994M058990J210823
3725.4E60724678p28111j738510k43264L651390N46875M656220o13365p516175P975579
3734E66715317L361892q767280k360153J054191m84314K134667L863296m135933Q57010
$$ plain form
3742.7 562238693 573611298 569445839 550123024 558082848 563268242 568945923 568088341 556754990
3750.4 556754990 567693977 565539703 555368881 559647484 564310036 568397560 562900085 563371277
3758.2 563371277 569474487 563643723 560516243 563731041 565013542 565495911 569571648 567496033
3765.9 567496033 561808205 564210587 569655266 571534309 562453880 562859573 565271988 564714279 565449982
3774.5 565449982 565617523 566635513 566955452 569579697 570278206 562331314 563930473 566051483 566133575
3783.2 566133575 568002815 565746727 564775734 565984879 566442528 566553078 565494690 565814476 566285591
3791.9 566285591 566391525 566207848 567328377 570844040 567422638 562173843 563527641 567868004 574995041
3800.6 574995041 570469170 558332977 560680046 563206291 567733307 575384102 567706490 560037575
$$ packed form
3742.7E62238693J1372605m165459j9322815P959824N185394N677681q57582j1333351
3750.4E56754990J0938987k154274j0170822M278603M662552M087524n497475M71192
3758.2E63371277O103210n830764l127480L214798J282501M82369M075737k075615
3765.9E67496033n687828K402382N444679J879043r080429M05693K412415n57709P35703
3774.5E65449982J67541J017990L19939K624245O98509p946892J599159K121010Q2092
3783.2E66133575J869240k256088r70993J209145M57649J10550j058388L19786M71115
3791.9E66285591J05934j83677J120529L515663l421402n248795J353798M340363P127037
3800.6E74995041m525871j2136193K347069K526245M527016P650795p677612p668915
$$ plain form
3808.3 560037575 563403740 565721855 567304039 568002396 567069016 566984634 572732277 575325394 559651489
3817 559651489 561574173 566748810 571544952 575126076 558838310 558833466 563466034 565035934 567243080
3825.7 567243080 567841949 563514137 562872353 564791565 567691841 569633331 561041260 562669487 570740166
3834.3 570740166 566255989 564422531 572324677 565554047 558816757 566640892 562730026 560688515
3842.1 560688515 567784576 566711617 561799545 563945045 565218620 563865547 565134354 564559822
3849.8 564559822 565912285 571955910 565863647 567458725 556651573 554209137 563141747 562111359
3857.5 562111359 559773178 561800385 564220619 566888046 561685982 561409721 569385948 565068512
3865.2 565068512 556787834 559198723 564546356 572484283 566157188 554483871 557200699 563092651
$$ packed form
3808.3E60037575L366165K318115J582184O98357r33380q4382N747643K593117j5673905
3817E59651489J922684N174637M796142L581124j6287766m844M632568J569900K207146
3825.7E67243080N98869m327812o41784J919212K900276J941490q592071J628227Q070679
3834.3E70740166m484177j833458P902146o770630o737290P824135l910866k041511
3842.1E60688515P096061j072959m912072K145500J273575j353073J268807n74532
3849.8E64559822J352463O043625o092263J595078j0807152k442436Q932610j030388
3857.5E62111359k338181K027207K420234K667427n202064k76261P976227m317436
3865.2E65068512q280678K410889N347633P937927o327095j1673317K716828N891952
$$ plain form
3872.9 563092651 567604485 558229332 557699242 562092133 562307968 563816185 568840446 564928780 555200653
3881.6 555200653 559752121 561345558 563296776 569763908 557249870 555827675 559666100 561119080
3889.3 561119080 565621071 566195374 557482491 557143936 561111145 559593735 559705849 560933228 563508301
3898 563508301 566594238 556688271 560093613 563093681 556382332 559804192 557466354 555631599 556596680
3906.7 556596680 557063522 559404907 559768791 559169273 558547478 558856392 558467102 557160721 558648376
3915.3 558648376 561581879 559092789 554666405 558340263 559462929 555099258 556760292 558417969
3923.1 558417969 559308853 558224068 554928818 555588379 555979271 557094574 557406387 556357384 557968826
3931.7 557968826 556326218 554409904 555242233 555389900 555628662 555658760 555586014 555924072 555558815 556121902
$$ packed form
3872.9E63092651M511834r375153n30090M392891K15835J508217N024261l911666r728127
3881.6E55200653M551468J593437J951218O467132j2514038j422195L838425J452980
3889.3E61119080M501991N74303q712883l38555L967209j517410J12114J227379K575073
3898E63508301L085937r905967L405342L000068o711349L421860k337838j834755R65081
3906.7E56596680M66842K341385L63884n99518o21795L08914l89290j306381J487655
3915.3E58648376K933503k489090m426384L673858J122666m363671J661034J657677
3923.1E58417969Q90884j084785l295250O59561L90892J115303L11813j049003J611442
3931.7E57968826j642608j916314Q32329J47667K38762L0098p2746L38058l65257N63087
$$ plain form
3941.4 556121902 556585999 553077240 553003578 554665833 555780869 557447739 554112167 553653336 555157852
3950.1 555157852 552726402 553368683 553448906 552366447 552562866 553198166 553588791 552735252 552892113
3958.7 552892113 553119926 553158340 553132515 552129021 551967163 552662926 552985992 552528992 552503738 553398628
3968.4 553398628 553343201 551978188 551975098 552455978 552014313 552301559 552779083 552515640 551466026 551234818
3978 551234818 551641617 551317825 551471519 551736794 551250648 550956841 551219635 550892258 550954895 551224098
3987.7 551224098 550758324 551064034 550695343 549823761 549720459 550330963 551258125 550486832 549279327
3996.3 549279327 549472275 550118408 549945793 549784126
4000.2 549784126
$$ packed form
3941.4E56121902M64097l508759p3662J662255J115036J666870l335572m58831J504516
3950.1E55157852k431450O42281Q0223j082459J96419O35300L90625q53539J56861
3958.7E52892113K27813L8414k5825j003494j61858O95763L23066m57000k5254Q94890
3968.4E53398628n5427j365013l090M80880m41665K87246M77524k63443j049614k31208
3978E51234818M06799l23792J53694K65275m86146k93807K62794l27377O2637K69203
3987.7E51224098m65774L05710l68691q71582j03302O10504R27162p71293j207505
3996.3E49279327J92948O46133j72615j61667
4000.2E49784126
##END=$$ End of the data block
