##TITLE=$$ Begin of the data block
##JCAMP-DX=5.00 $$ ACD/SpecManager v 10.08
##SPECTROMETER/DATA SYSTEM=Varian
##DATE=21 Jan 2013 15:48:10
##DATA TYPE=INFRARED SPECTRUM
##DATA CLASS=XYDATA
##ORIGIN=
##OWNER=
##NPOINTS=3735
##FIRSTX=399.26403809
##LASTX=4000.35498047
##MAXX=4000.35498047
##MINX=399.26403809
##MAXY=77.73434448
##MINY=34.05542755
##XFACTOR=1.0000000000
##YFACTOR=0.000000100000000
##FIRSTY=57.29704285
##DELTAX=0.96440572
##XUNITS=1/CM
##YUNITS=TRANSMITTANCE
##XYDATA=(X++(Y..Y))
399.3E72970428M677544j1811409r115944n600624M907036O340523k442284l173332
$$ 572970428 577647972 565836563 556720619 551119995 556027031 562367554 559925270 556751938
407E56751938J249237j529465p050781j2859001o730156P648277L051262M652100N548896
$$ 556751938 558001175 556471710 549420929 536561928 529831772 537480049 540531311 545183411 550732307
415.7E50732307M345742M554939j3684311n040398k160377J825714K469101o164970
$$ 550732307 555078049 559632988 545948677 540908279 538747902 540573616 543042717 536877747
423.4E36877747j800995M54750N913353J388092P75909O634598k328148q460007k345924
$$ 536877747 535076752 535531502 541444855 542832947 543608856 550243454 547915306 539455299 537109375
432.1E37109375J697960P07168J605073N61370k58712L724289M258956k792472m214096
$$ 537109375 538807335 539514503 541119576 541680946 541422234 545146523 549405479 546613007 542398911
440.7E42398911K224388j207466j924782j555138n937920p273254J215096J0466117
$$ 542398911 544623299 543415833 541491051 539935913 533997993 526724739 527939835 538405952
448.4E38405952N639458R60922N81704j617852m634208k491379l53966m615593l571853
$$ 538405952 544045410 545006332 545588036 543970184 539335976 536844597 536490631 531875038 528303185
457.1E28303185l678818L943405O647262J671792K528648K109413k068901l968315
$$ 528303185 524624367 528567772 535215034 536886826 539415474 541524887 539455986 535487671
464.8E35487671m905815m772072L822708O123543r60770M767685j0033o908607K467194
$$ 535487671 530581856 525809784 529632492 535756035 534795265 539562950 539552917 532644310 535111504
473.5E35111504N84564N91812j201248o938744q646965j339836K953682N28374M509353
$$ 535111504 535696068 536287880 535086632 528147888 519500923 518161087 521114769 521643143 526152496
482.2E26152496N600777K391930m74701k991143l030204l139954m011459k372971l28865
$$ 526152496 531753273 534145203 533670502 530679359 527649155 524509201 520497742 518124771 517795906
490.9E17795906J248665L519134K721291M78325J768036M16374k045555r00650k120438
$$ 517795906 519044571 522563705 525284996 525763321 527531357 527947731 525902176 525001526 522881088
499.6E22881088K165413M111061o486358m664498J870613K129593j02768K23618L75709
$$ 522881088 525046501 529157562 522671204 518006706 519877319 522006912 521904144 522127762 522503471
508.2E22503471m504242l750839k116928j799354M68215K802849J745797k415467k19841
$$ 522503471 517999229 514248390 512131462 510332108 510800323 513603172 515348969 512933502 512713661
516.9E12713661k64892k16217k32964l810959j390457p27005j080894P33985J867409
$$ 512713661 512448769 512232552 511999588 508188629 506798172 506071167 504990273 505724258 507591667
525.6E07591667J480408R86938o31828j680565l6735M96559Q16612m0779K60849j917496
$$ 507591667 509072075 510059013 509427185 507746620 507709885 508206444 509023056 508982277 509243126 507325630
535.2E07325630l455696R29909J655083J790962O14319j10550L38211j485291j543045
$$ 507325630 503869934 504799843 506454926 508245888 508860207 508749657 509087868 507602577 506059532
543.9E06059532j618614j356468k803765k369880k80762O40068J073723l02010k1515
$$ 506059532 504440918 503084450 500280685 497910805 497630043 498270111 499343834 499041824 499020309
552.6D99020309j073837j121864j988907l045807j123962o30722J111793J044846O16188
$$ 499020309 497946472 496824608 494835701 491789894 490665932 490035210 491147003 492191849 492808037
561.3D92808037p0114j756287m14734P30286j23940k119827j714973p88346M33846
$$ 492808037 492737923 490981636 490566902 491297188 491173248 489053421 487338448 486550102 486983948
570D86983948J571159Q31795J35994L38859P85790o97823p24067L0746o80008j581535
$$ 486983948 488555107 489386902 489522896 489861755 490647545 489949722 489225655 489256401 488576393 486994858
579.6D86994858j489601N24673Q90694J752510K138443J703682l37334j709213m44679
$$ 486994858 485505257 486029930 486920624 488673134 490811577 492515259 492177925 490468712 490024033
588.3D90024033j395264q07152l34129l94554J059951J192513J238747J029281N89142
$$ 490024033 488628769 487821617 487487488 487092934 488152885 489345398 490584145 491613426 492202568
597D92202568j086922k18658R08432p44171j474724j169395Q2702J38207l52173m56162
$$ 492202568 491115646 490896988 491805420 491061249 489586525 488417130 488499832 488638039 488285866 487829704
606.6D87829704J631508J589928q06618r36394j573181O97365J273308M63486J031799
$$ 487829704 489461212 491051140 490244522 489308128 487734947 488432312 489705620 490169106 491200905
615.3D91200905N3749J95503L05138K871208J914558m63028J173516m9477n57442l57894
$$ 491200905 491254654 491450157 491755295 494626503 496541061 496078033 497251549 497202072 496644630 496286736
624.9D96286736K69813J519089J075744R21631J750603K925835J028671m53453L47252
$$ 496286736 496556549 498075638 499151382 500073013 501823616 504749451 505778122 505324669 505671921
633.6E05671921K21557k95868q17375l1891J026192J509476J679802K095871J884956
$$ 505671921 505893478 505597610 504780235 504748344 505774536 507284012 508963814 511059685 512944641
642.3E12944641J30730L32565J401215M14161m63867j141128j091195J033249J580582
$$ 512944641 513075371 513407936 514809151 515223312 514759445 513618317 512527122 513560371 515140953
651E15140953J113396J065254P2365L31344j86424k063141k294693j839027j451149
$$ 515140953 516254349 517319603 517391968 517723312 517536888 515473747 513179054 511340027 509888878
659.7E09888878j196327q29354p85103J002503J889152J677094J838417j47667l713646
$$ 509888878 508692551 507863197 507078094 508080597 509969749 511646843 513485260 513337593 509623947
668.3E09623947K560234L230210K087898Q04443J482964K552414L094368L414688M295387
$$ 509623947 512184181 515414391 517502289 518306732 519789696 522342110 525436478 528851166 533146553
677E33146553L533363K892533K935066J060867L91655k4223L51524J115303J170197
$$ 533146553 536679916 539572449 542507515 543568382 543960037 543935814 544287338 545402641 546572838
685.7E46572838J403999J247559J550674O24809R16481Q67386k90336P47833j59416
$$ 546572838 547976837 549224396 550775070 551399879 552316360 553183746 552893410 553641243 553481827
694.4E53481827n39131N18417M69513J079712J257896J041069Q51097K51236M90113
$$ 553481827 552942696 553461113 553930626 555010338 556268234 557309303 558160400 558411636 558901749
703.1E58901749Q35685p98034j801796m56505J059952Q74634o0807P85904K125473
$$ 558901749 559737434 558939400 557137604 556681099 557741051 558615685 558554878 559340782 561466255
711.7E61466255K030258J076775J374130K37999j259651L00179O44836R96323P80143
$$ 561466255 563496513 564573288 565947418 566185417 564925766 565225945 565870781 566867104 567647247
720.4E67647247O49567J926079K106933K447091R33074K40632j83106j114769n30472
$$ 567647247 568296814 570222893 572329826 574776917 575709991 575950623 575767517 574652748 574122276
729.1E74122276k67715J286507R93690O27937J240235J277084J649246M51699k80037
$$ 574122276 573854561 575141068 576134758 576762695 578002930 579280014 580929260 581380959 581100922
737.8E81100922k03667R10263J37291j065636m4098L08342R55506O03981J277389J660385
$$ 581100922 580897255 581807518 581944809 580879173 580835075 581143417 582098923 582702904 583980293 585640678
747.4E85640678N95475J37710o7177M02337o38772m83627J16615M08745N66368N10025
$$ 585640678 586236153 586373863 586306686 586709023 586070251 585586624 585703239 586111984 586678352 587188377
757.1E87188377K230988J622200N38063K41737p8430m349M7684J22299L9940R38874
$$ 587188377 589419365 591041565 591579628 591821365 591742935 591738586 591786270 591908569 591948509 592887383
766.7E92887383k24801L80249J945038P11403Q50525J54724p20291r3040O36329k05078
$$ 592887383 592662582 593042831 594987869 595699272 596549797 596704521 595984230 595891190 596527519 596322441
776.4E96322441l94325P13768M46434N60875J33934O85730J369057J068191M86527
$$ 596322441 595928116 596641884 597088318 597649193 597783127 598468857 599837914 600906105 601392632
785F01392632r90715m24042M31823L75939k29759R5062N14984l34320R5215J040726
$$ 601392632 600401917 599977875 600409698 600785637 600555878 600650940 601165924 600831604 600926819 601967545
794.7F01967545J532669J10473o47201q1978k13966j63231k30332M57497O30379Q57543
$$ 601967545 603500214 603610687 602963486 602881508 602667542 602504311 602273979 602731476 603361855 604219398
804.3F04219398J070786r6168q70286p1411M82865k15721K01034L82271r0561p74345
$$ 604219398 605290184 605194016 604323730 604252319 604735184 604519463 604720497 605102768 605012207 604237862
814F04237862m01650J85356q3008R75228L36571m37203o79054j038704r16786j336403
$$ 604237862 603836212 604021568 603938560 604913788 605250359 604813156 604134102 603095398 602178612 600842209
823.6F00842209J48849J077347k20566p78618R12209P44782o05431k93350j396179
$$ 600842209 600991058 602068405 601847839 601069221 601981430 602726212 602120781 601827431 600431252
832.3F00431252r93462j61476k68288P7744J28173o2599n86090m64973q14018j336
$$ 600431252 599437790 599276314 599008026 599085770 599213943 599151344 598565254 598100281 597286263 597284927
841.9E97284927L81966n74989p34368r54284o89164r49058q55866n24826L02430J02500
$$ 597284927 597666893 597091904 596357536 595403252 594714088 593765030 592909164 592384338 592686768 592789268
851.6E92789268j350708p29560k93999p05338j777458j540909j194419j509400r15451
$$ 592789268 591438560 590709000 590415001 589709663 587932205 586391296 585196877 583687477 582772026
860.3E82772026j129494K7695k3003j476135j023292o73447j510086j970329j420632
$$ 582772026 581642532 581670227 581647224 580171089 579147797 578474350 576964264 574993935 573573303
868.9E73573303j860428j728515j604500j734696j620674k539444k574157k048531
$$ 573573303 571712875 569984360 568379860 566645164 565024490 562485046 559910889 557862358
876.7E57862358j314201j932450l815384l519058k853737l313064l218765l222390
$$ 557862358 556548157 554615707 550800323 547281265 544427528 541114464 537895699 534673309
884.4E34673309k488022j428833k126655k812348k649688j580773j433868j952324
$$ 534673309 532185287 530756454 528629799 525817451 523167763 521586990 520153122 518200798
892.1E18200798j785583j745339j167869m33503J33362K33078N93262O98929R34219
$$ 518200798 516415215 514669876 513502007 513068504 513201866 513434944 514028206 514727135 515661354
900.8E15661354J402931J093254J091118J081505J193123M34570O03714J795883J491433
$$ 515661354 517064285 518157539 519248657 520330162 521523285 521957855 522561569 524357452 525848885
909.4E25848885J538162J506195J705246J182632l7727l06816o86722n46722j059571
$$ 525848885 527387047 528893242 530598488 531781120 531743393 531436577 530749855 530203133 529143562
918.1E29143562j320877r91325o84014o34307j639367j008377n35125j316338j740723
$$ 529143562 527822685 526831360 526147346 525513039 523873672 522865295 522330170 521013832 519273109
926.8E19273109j449050j308518j587982j521759k184868k216721k083549j645470
$$ 519273109 517824059 516515541 514927559 513405800 511220932 509004211 506920662 505275192
934.5E05275192r09767n88989q26416j705322j251412j218643r91440j400680k368737
$$ 505275192 504365425 503776436 502950020 501244698 499993286 498774643 497783203 496382523 494013786
943.2D94013786j100731L60680M21600q18138m37698R7999j54266m41818q30307k78626
$$ 494013786 492913055 493273735 493695335 492877197 492439499 492537498 492383232 491941414 491111107 490832481
952.8D90832481r38377j018600o71235m69551m15382q68988k94457o19239l64113m58718
$$ 490832481 489894104 488875504 488204269 487734718 487319336 486450348 486155891 485536652 485172539 484713821
962.5D84713821j579666j985283k478294k165947j880226j821518j768570k079773
$$ 484713821 483134155 481148872 478670578 476504631 474624405 472802887 471034317 468954544
970.2D68954544k810440k385559j725540k403565k935714l198624l107185l734131
$$ 468954544 466144104 463758545 462033005 459629440 456693726 453495102 450387917 446653786
977.9D46653786l615303l329316l107452k513809k729874k788811l010215j550980
$$ 446653786 443038483 439709167 436601715 434087906 431358032 428569221 425559006 424008026
985.6D24008026j625214j648178j549797k959327j936798j986771j030006m72565n67627
$$ 424008026 422382812 420734634 419184837 416225510 414288712 412301941 411271935 410799370 410231743
994.3D10231743j21651p39479O4964k55737j76468l15590j311836j755218j310578
$$ 410231743 410110092 409370613 409435577 409179840 409003372 408687782 407375946 405620728 404310150
1003D04310150q39691j409950r77822j557579r51538o52694q93212j039963k072868
$$ 404310150 403470459 402060509 401082687 399525108 398573570 397920876 397027664 395987701 393914833
1011.7C93914833j522789k036323j395875k011032k216529r76944j773606j450996
$$ 393914833 392392044 390355721 388959846 386948814 384732285 383755341 381981735 380530739
1019.4C80530739j583748q50410r10302p70836j087684j984520j437645j728935p34215
$$ 380530739 378946991 378096581 377186279 376415443 375327759 373343239 371905594 370176659 369442444
1028.1C69442444j291046n35660j49307n10254M40864k13127L77693O8589N97305M65736
$$ 369442444 368151398 367615738 367466431 366956177 367397041 367183914 367561607 367630196 368227501 368693237
1037.7C68693237L80211K23618j95084J320610M55971Q04329K77176Q278J43356j27258
$$ 368693237 369073448 369297066 369101982 370422592 370878563 371682892 371960068 371968346 372111702 371984444
1047.4C71984444K89879q99735n45273j982498j043129l1052j600532j771546j548156
$$ 371984444 372274323 371374588 370829315 368846817 367803688 367772636 366172104 364400558 362852402
1056C62852402l86009j450120o10504j069526j405640r45282j222725l49960j870079
$$ 362852402 362466393 361016273 360405769 359336243 357930603 356985321 355762596 355412636 353542557
1064.7C53542557K66990j94778m54826K02217r52759L9139j357765k10038k13775j9951
$$ 353542557 353809547 353614769 353159943 353362160 352409401 352448540 351090775 350880737 350666962 350647011
1074.4C50647011o50826n39398J438866J69906J448441O0348K95029K96745k93693
$$ 350647011 349996185 349456787 350895653 351065559 352514000 352574348 352869377 353166122 352872429
1083C52872429Q40340O8016O42585k97355K080116J340294l66593R50509Q04443J258545
$$ 352872429 353712769 353780785 354423370 354126015 356206131 357546425 357179832 358130341 358934784 360193329
1092.7C60193329j65215R34067O28090P20978R67026J044082K044335L07426J565437
$$ 360193329 360028114 360962181 361590271 362311249 363278275 364322357 366366692 366674118 368239555
1101.4C68239555J400071K342414K017899M77142J414528J650620K810173J276931
$$ 368239555 369639626 371982040 373999939 374477081 375891609 377542229 380352402 381629333
1109.1C81629333K064667J933975J312561J991730J031380J949921J361236J659546
$$ 381629333 383694000 385627975 386940536 388932266 389963646 391913567 393274803 394934349
1116.8C94934349J098862J436844J454353Q09975K812996J697616J900063K526207
$$ 394934349 396033211 397470055 398924408 399734383 402547379 404244995 406145058 408671265
1124.5D08671265K544212J930466J806640L069458K385140K279510J736336K178955
$$ 408671265 411215477 413145943 414952583 418022041 420407181 422686691 424423027 426601982
1132.2D26601982J801376J752663K436066K145881K707825O77109j31416J53579j74827
$$ 426601982 428403358 430156021 432592087 434737968 437445793 438122902 437991486 438145065 437970238
1140.9D37970238j327782k435150j672211k244835j753997k055779j669769r58748
$$ 437970238 436642456 434207306 432535095 430290260 428536263 426480484 424810715 423851967
1148.6D23851967j208763r63745k290802j178360m12865k82860l29246K99949J225662
$$ 423851967 422643204 421679459 419388657 418210297 417797432 417514572 417185326 417485275 418710937
1157.3D18710937R23996K314835K689018L222580K523575K803116L113289K689209
$$ 418710937 419634933 421949768 424638786 427861366 430384941 433188057 436301346 438990555
1165D38990555L874054L308754M317894M762611N266342N456658N233764O528054N408058
$$ 438990555 442864609 446173363 450491257 455253868 460520210 465976868 471210632 477738686 483146744
1173.7D83146744M847183M924812M516297M124756L984603M713784M838943M708595
$$ 483146744 487993927 492918739 497435036 501559792 505544395 510258179 515097122 519805717
1181.4E19805717M613724M400902M273453M083786L285599K336730J826745J561813
$$ 519805717 524419441 528820343 533093796 537177582 540463181 542799911 544626656 546188469
1189.1E46188469R21936N01327Q76427J327439J493492J446762J445732J495170R77478
$$ 546188469 547110405 547611732 548488159 549815598 551309090 552755852 554201584 555696754 556674232
1197.8E56674232N73617R59129J289863J281090J200981J623726K156830K645035K987251
$$ 556674232 557247849 558206978 559496841 560777931 561978912 563602638 565759468 568404503 571391754
1206.5E71391754K400665K353096K178612J461029J558075J102829L01666k00004P18613
$$ 571391754 573792419 576145515 578324127 579785156 581343231 582446060 582747726 582547722 583266335
1215.1E83266335R49592K71607P79419Q03527Q06084M16374M5128o16798q45833m91448
$$ 583266335 584215927 584487534 585266953 586070480 586876564 587292938 587338066 586721268 585875435 585383987
1224.8E85383987q44307n66482n35164J82877N94329R73320J176110L22532J8731q12531
$$ 585383987 584539680 583973198 583438034 583620911 584215240 585188560 586364670 586687202 586705933 585893402
1234.4E85893402p67212j177978j190873o42471l34549L19329p51877l701M99611j32904
$$ 585893402 585126190 583948212 582757339 582114868 581780319 582099648 581347771 581344070 581843681 581710777
1244.1E81710777l89747j465607j329002j808548j998063j277542j027526j035233
$$ 581710777 581321030 579855423 578526421 576717873 574719810 573442268 572414742 571379509
1251.8E71379509n21812R3307k46696l51906n14260q94050j381149j128274j027870
$$ 571379509 570857697 570951004 570704308 570352402 569838142 568944092 567562943 566434669 565406799
1260.5E65406799j052589P9193P56683J373139J219673J150551J651611Q93364K02637
$$ 565406799 564354210 564433403 565190086 566563225 567782898 568933449 570585060 571478424 571681061
1269.2E71681061o9161K26212q6899J793N52292K94647M08783N46875P99942k32887
$$ 571681061 571611900 571838112 571751213 571753006 572305298 572599945 573008728 573555603 574355545 574122658
1278.8E74122658j271210j500969j864052k224350k746086k417183k086677j249390
$$ 574122658 572851448 571350479 569486427 567262077 564515991 562098808 560012131 558762741
1286.5E58762741r98573j488495j640091j855774k109833l031273l535041l414040
$$ 558762741 557764168 556275673 554635582 552779808 550669975 547638702 544103661 540689621
1294.2E40689621l154449k993393k292328j676445j089783o05812o83632n89561p67289
$$ 540689621 537535172 534541779 532249451 530573006 529483223 528877411 528193779 527604218 526836929
1302.9E26836929j103973j782837j937981j394500j028176r73167l65067P97539O42395
$$ 526836929 525732956 523950119 522012138 520617638 519589462 518616295 518251228 519048767 519691162
1311.6E19691162K03018j71051j64947l04833j000709j483383j159287o7367J04141
$$ 519691162 519894180 519723129 519558182 519253349 518252640 516769257 515609970 515542603 515646744
1320.3E15646744M90494Q96911J538963J676407J217995J451378J079483R00726R9335
$$ 515646744 516137238 517034149 518573112 520249519 521467514 522918892 523998375 524899101 524998436
1328.9E24998436m0894P37305J238632K077637K003899K316932K239876J776199J290513
$$ 524998436 524957542 525694847 526933479 529011116 531015015 533331947 535571823 537348022 538638535
1337.6E38638535L34663j31874q70323M539N59769n4093J83983L66402P66144J056099
$$ 538638535 538973198 538841324 537971001 537975540 538535309 538481216 538665199 539031601 539797745 540853844
1347.3E40853844R12399M77676n15098j105957j735077j922798j652756j207199p01943
$$ 540853844 541766243 542243919 541728821 540622864 538887787 536964989 535312233 534105034 533403091
1355.9E33403091l55300m53911m97666o01806j931153k466163l630791n480232k951889
$$ 533403091 533047791 532593880 532096214 531494408 529563255 527097092 523466301 517986069 515034180
1364.6E15034180k672539l541985l072853k883835k805404j524735j595421j394271
$$ 515034180 512361641 508819656 505746803 502862968 500057564 498532829 496937408 495543137
1372.3D95543137j886559l591843k720375j727066n74684n90477P12090J362495J447296
$$ 495543137 493656578 490064735 487344360 485617294 485042610 484452133 485164223 486526718 487974014
1381D87974014K011833J893425K144700J654434K112427J415023R10263K079697K789879
$$ 487974014 489985847 491879272 494023972 495678406 497790833 499205856 500116119 502195816 504985695
1389.7E04985695L418541K804108L499832L850364L832131K719421K785530K157097
$$ 504985695 508404236 511208344 514708176 518558540 522390671 525110092 527895622 530052719
1397.4E30052719P65877n90897J66321J002083j82228Q58192Q39081n64804m2953n3063
$$ 530052719 530818596 530227699 530394020 531396103 531213875 532072067 532911148 532346344 532303391 532250328
1407.1E32250328n38864j877403k063828k255936k420845j673774j491814q26302o3896
$$ 532250328 531711464 529834061 527770233 525514297 523093452 521419678 519927864 519101562 519037666
1415.7E19037666L62931M20150Q33359k186127j063308J019172j68647L32183j049575
$$ 519037666 519400597 519820747 520654106 518467979 517404671 518423843 518255196 518587379 517537804
1424.4E17537804O96296K087746Q94966K003746J610642J426468J795349K033615Q76121
$$ 517537804 518234100 520321846 521216812 523220558 524831200 526257668 528053017 530086632 530962753
1433.1E30962753L51410J920929K70004j432838K379227M055137K893563J884269K649155
$$ 530962753 531314163 533235092 533505096 532072258 534451485 538506622 541400185 543284454 545933609
1441.8E45933609J385460J033745L09677O50329P75986K42348k4567J335602K622528
$$ 545933609 547319069 548352814 548662491 549312820 550088806 550331154 550306587 551642189 554264717
1450.5E54264717J214447J598816J184921J665612J774520p22236k021980k024765
$$ 554264717 555479164 557077980 558262901 559928513 561703033 560980797 558958817 556934052
1458.2E56934052L621139J705399K555809K024879J233749K698136q3656K552757K327690
$$ 556934052 560555191 562260590 564816399 566841278 568075027 570773163 570689507 573242264 575569954
1466.8E75569954J900635J526107J006775K676621J351242K790794K459526L844300
$$ 575569954 577470589 578996696 580003471 582680092 584031334 586822128 589281654 593125954
1474.6E93125954L616943J821137K899131K263947K156868J323204J242065J751480
$$ 593125954 596742897 598564034 601463165 603727112 605883980 607207184 608449249 610200729
1482.3F10200729J962700K214813J816559K768784J259155J342468K274895l64036
$$ 610200729 612163429 614378242 616194801 618963585 620222740 621565208 623840103 623476067
1490F23476067K66952J277008J669159O81305J430855J115455j680183L299370J005134
$$ 623476067 623743019 625020027 626689186 627370491 628801346 629916801 628236618 631535988 632541122
1498.7F32541122j10015J284332q7662n73463j64109J085663j171036o666336m312286
$$ 632541122 632431107 633715439 633627777 633054314 632890205 633975868 632804832 626138496 621826210
1507.3F21826210L793716K869034p50084J142769k104950l557625j412429k362595
$$ 621826210 625619926 628488960 627738876 628881645 626776695 623219070 621806641 619444046
1515.1F19444046j528206m834595l924408Q97675J412964m619522o089592j581650
$$ 619444046 617915840 613081245 609156837 610054512 611467476 606847954 600758362 599176712
1522.8E99176712n07240N56183o530686k369118j744880m048157j800919j251640n46837
$$ 599176712 598669472 599225655 592694969 590325851 588580971 584532814 582731895 581480255 580933418
1531.5E80933418j430626j988105o828041n8480j007652j682510J202430q044052p584228
$$ 580933418 579502792 577514687 570686646 570628166 569620514 567938004 569140434 561096382 553512154
1540.1E53512154R41734L65219k068138J121025k75841l277740J436081j332016n55954
$$ 553512154 554453888 554819107 552750969 553871994 553596153 550318413 551754494 550422478 549866524
1548.8E49866524l188248m091072O08292J19438J147270m158440J224671K791290J844406
$$ 549866524 546678276 542587204 543195496 543314934 544462204 540303764 541528435 544319725 546164131
1557.5E46164131m416160j3761635O201935K565765J943741m33998J6365r77478M52614
$$ 546164131 541747971 527986336 534188271 536754036 538697777 538263779 538280144 537302666 537755280
1566.2E37755280K238807O65283Q88825m878006J170730O20652j333847m67110j74751
$$ 537755280 539994087 540659370 541548195 536670189 537840919 538461571 537127724 536660614 536485863
1574.9E36485863l49045p773666L710136K248650O82716M64744p80487k76069k038155
$$ 536485863 536136818 528363152 532073288 534321938 535004654 535469398 534688911 534412842 532374687
1583.5E32374687r94301j637725j015130o67419r42383K29225q18138P88002m66232
$$ 532374687 531380386 529742661 528727531 528060112 527117729 527346954 526528816 527316818 526850586
1592.2E26850586O7520k47955j323776o99997j581841K2621q13637M87061O13251J219787
$$ 526850586 526918106 526670151 525346375 524646378 523064537 523087158 522273521 522760582 523373833 524593620
1601.9E24593620J555863j08032J040306k7924N58929l61137r9983j27068p73544R33952
$$ 524593620 526149483 526041451 527081757 527053833 527612762 527251625 527151642 527024574 526251030 527184982
1611.5E27184982L00713J323051L69606J796532O42204n860786J833458n75943q38928
$$ 527184982 527485695 528808746 529178352 530974884 531617088 525756302 527589760 527013817 526174889
1620.2E26174889j647568J8310j017913m171944O92749m47884O32935l025475k783050
$$ 526174889 524527321 524545631 523527718 519355774 520048523 519600639 520233574 517208099 514425049
1628.9E14425049j080246k189293j879082l062172J47209n80825p234917l080635J353378
$$ 514425049 513344803 511155510 509276428 506214256 506361465 505780640 498545723 495465088 496818466
1637.5D96818466J77155j148987o12984k799682o08139k323952o48880L58581m524841
$$ 496818466 496995621 495846634 495233650 492433968 491825829 489501877 488852997 489211578 484686737
1646.2D84686737m24118k667198J547928l3188J546364J770172p215500m366913k58026
$$ 484686737 484262619 481595421 483143349 483110161 484656525 486426697 479211197 474844284 474586258
1654.9D74586258M264831M81453P59354L85666P81212K086830J498108J939621j579781
$$ 474586258 478851089 479332542 480091896 480477562 481258774 483345604 484843712 486783333 485203552
1663.6D85203552K995491J746064J841049K600555J504364K189140J292000N954552
$$ 485203552 488199043 489945107 491786156 494386711 495891075 498080215 499372215 505326767
1671.3E05326767L416367N199317N624199L320580L629608L829269N683060M458924
$$ 505326767 508743134 513942451 519566650 522887230 526516838 530346107 536029167 540488091
1679E40488091N650939N368729O653671Q227730M756127O298904N867119Q993377P222863
$$ 540488091 546139030 551507759 558161430 566389160 571145287 577444191 583311310 592304687 599527550
1687.7E99527550N768738O482238M997673N872879N521965O277543P193794N826416
$$ 599527550 605296288 611778526 616776199 622649078 628171043 634448586 641642380 647468796
1695.4F47468796L119964N851136O714859O275253j456528j924362P915802N827866
$$ 647468796 650588760 656439896 663154755 669430008 667973480 666049118 673964920 679792786
1703.1F79792786L261871J680527K984161K188873L796235M076461K029648Q08258
$$ 679792786 683054657 684735184 687719345 689908218 693704453 697780914 699810562 700618820
1710.8G00618820J762467K019577J543197L2959Q07953M274674J320190k854614M800491
$$ 700618820 702381287 704400864 705944061 705977020 706784973 711059647 712379837 709525223 714325714
1719.5G14325714M090195K346573J133575N18417m08172R24759Q80279N34973J618805
$$ 714325714 718415909 720762482 721896057 722414474 722006302 722931061 723811340 724346313 725965118
1728.2G25965118K075043P42493M74930L923797K930145l140792m394837L190232L290176
$$ 725965118 728040161 728782654 729257584 733181381 736111526 732970734 728575897 731766129 735056305
1736.9G35056305M80194K147522k67105j698609L724518K355805K28042j13525J871185
$$ 735056305 735536499 737684021 737416916 735718307 739442825 741798630 742026672 741913147 743784332
1745.5G43784332Q64105K38495r69543j839981K694244j011352k57721L161621J915207
$$ 743784332 744648437 744886932 743917389 742077408 744771652 743760300 743502579 746664200 748579407
1754.2G48579407J872253J508408j758118l41339J238480J24130J126861k637634p59659
$$ 748579407 750451660 751960068 750201950 749860611 751099091 751223221 752350082 749712448 748952789
1762.9G48952789K781372J388092J597748J629105J490402k609940L69187K235489
$$ 748952789 751734161 753122253 754720001 756349106 757839508 755229568 755598755 757834244
1770.6G57834244j608811k960968j404800L683624J387100l49273J992721R96781J462097
$$ 757834244 756225433 753264465 751859665 755543289 756930389 756581116 758573837 759570618 761032715
1779.3G61032715j50223j567306l60489P15332O75659j157227J26725J068344Q86459
$$ 761032715 760882492 759315186 758954697 759670029 760345688 759188461 759315186 760383530 761269989
1788G61269989R63287J285019j20849j62583j682052q84095K410660L6621n34744R49707
$$ 761269989 762233276 763518295 763397446 763234863 761552811 760668716 763079376 763115997 762581253 763530960
1797.6G63530960J582260R9640r17282J805420o04935L1891Q84400k52305J06430k41241
$$ 763530960 765113220 765212860 764295578 766100998 765496063 765527954 766412354 766160049 766266479 766025238
1807.3G66025238l30734L31344Q67005p83081R20181J477432K97318L89175m77600
$$ 766025238 765694504 766025848 766892853 766109772 767029953 768507385 768804703 769193878 768716278
1815.9G68716278K10877n27421J6480L23791m29687O79321K13394J007081J047515
$$ 768716278 768927155 768399734 768416214 768740005 768310318 768989639 769203033 770210114 771257629
1824.6G71257629j091842Q5449J292953N39399j225205k996445O00815K136383L43857
$$ 771257629 770165787 770251236 771544189 772083588 770858383 767861938 768462753 770599136 770942993
1833.3G70942993M55094N77392O14624M95606m64325K93045n62287J54343o8131M82026
$$ 770942993 771398087 771975479 772590103 773085709 772621384 772914429 772352142 772506485 772438354 772920380
1842.9G72920380M00161l356781K121888J977386L73459m9210M51432L03802j098938
$$ 772920380 773320541 769963760 772085648 774063034 774436493 774387283 774838715 775142517 774043579
1851.6G74043579m74472m28390K63977M39224M85306N15136L28446P97958J92566K98309
$$ 774043579 773569107 773140717 773404694 773843918 774329224 774844360 775172806 775970764 776163330 776461639
1861.3G76461639q31146o87027j40762j31302J72348p75299M46320j89820k11716J098481
$$ 776461639 775630493 774943466 774802704 774671402 774843750 774068451 774514771 774324951 774113235 775211716
1870.9G75211716R24835L97949n10330m13971n36881k45437p99103j85471O22864N51682
$$ 775211716 776136551 776534500 776024170 775610199 775073318 774827881 774028778 773843307 774466171 775017853
1880.6G75017853J063614M07562Q54416m2038j005325q06962m94384N15289q05206
$$ 775017853 776081467 776489029 777343445 777301407 776296082 775489120 774994736 775510025 774704819
1889.2G74704819j490402N50460J423569N95093R87320M29230j066361N1346o77109
$$ 774704819 773214417 773764877 775188446 775783539 776770859 777200089 776133728 776185074 775507965
1897.9G75507965k52228n98144r69849j97220j74560P38373M49218R58634L56064n93796
$$ 775507965 775255737 774657593 773687744 773490524 773315964 774054337 774503555 775462189 775818253 775224457
1907.6G75224457n32303l39584l86887j088486J23596k91824K34833M29611O1417J096344
$$ 775224457 774692154 774352570 773965683 772877197 773000793 772708969 772943802 773373413 773434830 774531174
1917.2G74531174j259232m33197P38297o2256l55454j513824j028977P2022M06799
$$ 774531174 773271942 772838745 773577042 773514786 773159332 771645508 770616531 770688553 771095352
1925.9G71095352J52664N86548M23508M8523k42691l86048k46200j044464m58679m61121
$$ 771095352 771248016 771834564 772258072 772306595 772063904 771677856 771431656 770387192 769928513 769467392
1935.5G69467392l76434k91367j58768M27704K85721J272049o98547j913071M24042
$$ 769467392 769090958 768799591 768640823 769068527 769354248 770626297 769927750 768014679 768438721
1944.2G68438721J04828p07627r26437j79672m93088j11466M17710M5624K31246J59836
$$ 768438721 768543549 767835922 766909485 766729813 766236725 766125259 766542969 766588593 766819839 766979675
1953.8G66979675r4757o46057k79541r60922j036759J2665j91269J3886M9820L51333
$$ 766979675 766884918 766238861 765959320 764998398 763961639 763974304 763783035 763796921 763846741 764198074
1963.5G64198074K65198J90201J12152o91452q32138m66080k93503m47769O5079k44751
$$ 764198074 764463272 764653473 764765625 764074173 763242035 762775955 762482452 762034683 762099762 761855011
1973.1G61855011o9275N64804K61231K97165l26920m87442o80008m79813l29132m17785
$$ 761855011 761785736 762350540 762611771 762908936 762582016 762094574 761414566 760934753 760605621 760187836
1982.8G60187836J20392j12000J17645J34735M17710P0724m86145J60294k48642q70972
$$ 760187836 760308228 760196228 760313873 760448608 760866318 760937042 760450897 760611191 760362549 759491577
1992.4G59491577n42831L64380K8610j9608K22092l66211M120J11389L22189k79922
$$ 759491577 758948746 759313126 759341736 759322128 759544220 759178009 759182129 759293518 759615707 759335785
2002.1G59335785n07660k05688m03595k60010m73404J72348J65939j05438o8741J23825
$$ 759335785 758828125 758622437 758218842 757958832 757485428 757657776 757823715 757718277 757649536 757773361
2011.7G57773361P7133o77414l32031l02734l40729o69708j16806L03879k93503K11334
$$ 757773361 757850494 757173080 756841049 756538315 756197586 755527878 755411072 755714951 755421448 755632782
2021.3G55632782m3640J58005p4921l95889k47040n40543j84326k80685P0495k34680
$$ 755632782 755589142 755747147 755672226 755276337 755029297 754488754 754304428 754023743 754094238 753859558
2031G53859558r0790K64359o3324J89972m27017n34745l56064j36261l45993n19943
$$ 753859558 753768768 754033127 753969803 754159775 753732758 753198013 752841949 752705688 752359695 751839752
2040.6G51839752l67889P7209P59659k12173o2790J04522K2278j37634q88290k23237
$$ 751839752 751471863 751549072 752308731 752096558 752033768 752138290 752160568 752022934 751134644 750911407
2050.3G50911407l00216k2888R1095Q4228K58103K04849L85513l33176k02636n98069
$$ 750911407 750611191 750588303 750679398 750763626 751021729 751226578 751612091 751278915 751076279 750478210
2059.9G50478210m38919p2250k20108J86234m26178J76849N77850P21359M97666n16052
$$ 750478210 750039291 749967041 749746933 749933167 749506989 749683838 750261688 750983047 751480713 750964661
2069.6G50964661o10733o28968l39737l95965m3564Q3084J47171R5520q8272N35660
$$ 750964661 750353928 749724960 749385223 748989258 748945694 749028778 749175949 749271469 749183197 749718857
2079.2G49718857O7749L2196j06888n13000p41196m87976R9792m55093j25580J07651
$$ 749718857 749786606 749818802 749711914 749198914 748457718 747969742 748069534 747614441 747488861 747596512
2088.9G47596512O07834N35659j23596J09482m59213m19693m80728o53305o43082j25580
$$ 747596512 748204346 748740005 748616409 748725891 748266678 747846985 747366257 746712952 746069870 745944290
2098.5G45944290M26483K23694J92566p4005M23813q1024n48325n17502q03222l73459
$$ 745944290 746370773 746594467 746787033 746713028 747136841 747055817 746507492 745989990 745186768 744813309
2108.1G44813309n55420j28250j31073L34854Q56781K20337J56173j58081n7220l05939
$$ 744813309 744257889 744129639 743998566 744333420 745190201 745410538 745566711 745408630 745351410 745045471
2117.8G45045471l83987p32651p00073J86233o6910J73188L07693M21601J10778K24762
$$ 745045471 744661484 743928833 743228760 743414993 743348083 743521271 743828964 744250565 744361343 744586105
2127.4G44586105O43387l00827n70068p89490l86734j221r8800J34430L66287N30853
$$ 744586105 745229492 744928665 744358597 743569107 743182373 743181152 743082352 743216782 743583069 744113922
2137.1G44113922K28424L11890K7542P3395l44391r01947l03574j61896j83563l32565
$$ 744113922 744342346 744654236 744681778 744755173 744410782 743508835 743205261 743043365 742859802 742527237
2146.7G42527237M88205P89795N32989N16053J05209K46963l29818l61786k22855k02942
$$ 742527237 743015442 743805237 744338226 744854279 744959488 745206451 744876633 744514847 744291992 744089050
2156.4G44089050k42614k82288P29523Q73794O05393q0414J34277L18756m56772j21841
$$ 744089050 743846436 743564148 744293671 745167465 745772858 745692444 745826721 746145477 745688705 745566864
2166G45566864k14996k65961k71454J36566N98755N62439M58527N7831M04739j68839
$$ 745566864 745351868 745085907 744814453 744951019 745549774 746112213 746570740 746628571 747033310 746864471
2175.6G46864471p01980j21308J46409l73536m76837M00696M37470M16488L40653K89077
$$ 746864471 746162491 746041183 746187592 745814056 745337219 745737915 746175385 746591873 746932526 747221603
2185.3G47221603M5853r4147l6392m11606K19040k3727l57971M7607K72217L16925
$$ 747221603 747267456 747173309 747136917 746725311 746944351 746920624 746562653 746610260 746882477 747199402
2194.9G47199402K07748O05698R7656q7051j99127k10877J1139m22516o10k1134n5694
$$ 747199402 747407150 748012848 748110504 748023453 747824326 747613449 747624588 747202072 747201462 747180328 747124634
2205.5G47124634L04870P31888O13098J60828J70822m29458k16370O7444j31912k67182
$$ 747124634 747429504 748161392 748774490 748935318 749106140 748676682 748460312 748527756 748395844 748128662
2215.2G48128662L08304O65131N7373N28869K75345n1880j29318l36838q5907k17819
$$ 748128662 748436966 749102097 749159470 749688339 749963684 749911804 749782486 749445648 749359741 749141922
2224.8G49141922J55945K35901J94778p8430J23520N71365Q4000L128o3095k27966
$$ 749141922 749297867 749533768 749728546 749650116 749773636 750345001 750429001 750432129 750369034 750141068
2234.5G50141068m26407p9728p4691K11715O82755L14026O38809K07901K90222J64032
$$ 750141068 749714661 749634933 749560242 749771957 750454712 750768738 751407547 751615448 751905670 752069702
2244.1G52069702l64914j79596o53991l22266j99661P1716J0529N4321P45163P49817
$$ 752069702 751704788 751525192 750871201 750548935 750349274 750420990 750431519 750485840 751231003 751980820
2253.8G51980820R46502m577m42200m33731l99628J13907k96936l10974o0806K80533
$$ 751980820 752927322 752922745 752480545 752046814 751647186 751761093 751464157 751153183 751092377 751372910
2263.4G51372910N00335P59354N16128K06986J39465l57971m34952j091003n92575
$$ 751372910 751873245 752632599 753148727 753355713 753495178 753137207 752702255 751611252 751018677
2272.1G51018677J49078M84924J094971M40293p1335l9368N55038L06550j30921l41415
$$ 751018677 751167755 751652679 752747650 753187943 753116608 753077240 753632278 753938828 753807907 753466492
2281.7G53466492o40641m27475o55975K66266L32336l0899K80152O12259O88629l38745
$$ 753466492 752825851 752398376 751742401 752008667 752341003 752310104 752590256 753202515 753891144 753552399
2291.4G53552399j04828p11899r92355n60837o30036L66059J59988P0267r6283J36414
$$ 753552399 753447571 752735672 751743317 751182480 750552444 750918503 751078491 751148758 751052475 751188889
2301G51188889L63388o0807p9574o13785m98734q72955k97851N7601m07562j16119
$$ 751188889 751552277 751491470 751411896 750798111 750299377 749426422 749128571 749186172 748778610 748662491
2310.7G48662491j88599Q05359K89154m97742p04650n11780j99661j261445q16955
$$ 748662491 748473892 749279251 749568405 749070663 748366013 747854233 747654572 746393127 745576172
2319.3G45576172m47922K95029L34244j45874L76434O59485J11160j518173n31693
$$ 745576172 745128250 745423279 745757523 745611649 745988083 746647568 746758728 745240555 744708862
2328G44708862p19833q25729L77883l25164n65338k58255R78088k15836k60162P82242
$$ 744708862 743989029 743163300 743541183 743216019 742650681 742392426 743370514 743154678 742894516 743676758
2337.7G43676758N40771J77460j354752j001129j686020m06036O98624r38034P5073
$$ 743676758 744217529 744394989 743040237 742039108 740353088 739947052 740645676 739707642 739782715
2346.3G39782715Q65707J677628J328430n06821j603393j333542j256104p22351m72641
$$ 739782715 740648422 742326050 743654480 743147659 741544266 740210724 738954620 738232269 737759628
2355G37759628o99081J63879l5248q00018j594848j139374m53034K73667N61065n10559
$$ 737759628 737060547 737224426 737189178 736389160 734794312 733654938 733201904 733475571 734036636 733526077
2364.7G33526077J028137P11213r58481k27967J338044P70416j80664Q55331M29230
$$ 733526077 734554214 735265427 734306946 734078979 735417023 736187439 736006775 736862106 737291336
2373.3G37291336k09045j98441K23694k51083m48227K82211j22528L98941P30057N46722
$$ 737291336 737082291 736883850 737107544 736856461 736408234 736690445 736567917 736966858 737696915 738243637
2383G38243637K47955j26876l49427p57065k04467n34973o70777k90680k14004K78702
$$ 738243637 738491592 738364716 738015289 737258224 737053757 736518784 735848007 735557327 735343323 735622025
2392.6G35622025J76849K52914n9509j51520m13437p27539l58429m59747l57208n39398
$$ 735622025 735798874 736051788 735992279 735840759 735427322 734699783 734341354 733881607 733524399 732985001
2402.3G32985001j04142J61896L9902O8436k50550j32293m42505k08359l35846p76978
$$ 732985001 732880859 733042755 733082657 733151093 732900543 732768250 732325745 732117386 731781540 731004562
2411.9G31004562o15692k80533L76969J58844J60599J9836l37296l85971k13165k00958
$$ 731004562 730388870 730108337 730485306 730644150 730804749 730824585 730487289 730101318 729888153 729687195
2421.6G29687195o90155q01697q85315p4768k76337l42331N01709n5618J07651j50452
$$ 729687195 728997040 728195343 727310028 727235260 726958923 726616592 727118301 727062683 727170334 727019882
2431.2G27019882m95834m58527m66461o00433q28553j4953l39127l87726j80740k82516
$$ 727019882 726524048 726065521 725599060 724998627 724170074 724155121 723815994 723428268 723247528 722965012
2440.8G22965012K50854O7062l51638q13141n16815n49775p32421l18680m45862m29764
$$ 722965012 723215866 723282928 722931290 722118149 721601334 721051559 720319138 720000458 719554596 719124832
2450.5G19124832m01459r9563J96228j86386p66602m40903l20739o97937n68619o64291
$$ 719124832 718723373 718623810 718820038 718633652 717867050 717426147 717105408 716407471 715838852 715174561
2460.1G15174561k19651k68173j92795L2959k36053K8991n46340q51365p01065l40042
$$ 715174561 714954910 714686737 714493942 714526901 714290848 714319839 713773499 712922134 712221069 711881027
2469.8G11881027l31344p43485o50406o64901l357K52151J61133k81448n61753l98559
$$ 711881027 711549683 710806198 710155792 709490891 709487534 709739685 709900818 709619370 709057617 708659058
2479.4G08659058q89054p90252p89872m51278n01938o51474j24512j69754N34k57263
$$ 708659058 707770004 706979752 706189880 705738602 705236664 704585190 704460678 704290924 704291458 704034195
2489.1G04034195l22800p36465j031876n00183l88412k89994n61828k60239K0523J3199
$$ 704034195 703711395 702974930 701943054 701442871 701054459 700764465 700202637 699942398 699962921 699976120
2498.7F99976120j75476n14755l25394k72369k43378q96607r41696n20553m33350n75409
$$ 699976120 699800644 699285889 698960495 698688126 698444748 697548141 696606445 696085892 695652542 695077133
2508.3F95077133n30548O7978m16031J0986J36795o07070p00913r31549o06613o41937
$$ 695077133 694546585 694614563 694198532 694209518 694346313 693739243 693038330 692106781 691500168 690858231
2518F90858231m74244o02874r7885L85360m57916p0267k52228m78744n64041o35071
$$ 690858231 690383987 689781113 689683228 690068588 689610672 689540405 689288177 688809433 688245392 687610321
2527.6F87610321m41818r04465k79846k79541o29120q7967R6665k67640m72259k97470
$$ 687610321 687168503 686264038 685984192 685704651 685075531 684987564 685084229 684816589 684344330 684046860
2537.3F84046860l79944l69949o62461o30340n99823q33741n77697R2773M83399n98298
$$ 684046860 683666916 683296967 682634506 682004166 681404343 680570602 679992905 680085678 680569077 679970779
2546.9F79970779o65283J40305k3880o16684r08737m41819m58068m97971m69742m33731
$$ 679970779 679305496 679445801 679421921 678805237 677896500 677454681 676996613 676498642 676028900 675595169
2556.6F75595169j64337J14212r5062q12073m89426l98712o60705n26581m07715m84467
$$ 675595169 675430832 675545044 675449982 674637909 674148483 673749771 673089066 672562485 672154770 671670303
2566.2F71670303m19159K366l11127k33307k57492l37830k02636p31278o14242n40848
$$ 671670303 671251144 671253510 670942383 670709076 670451584 670113754 669911118 669179840 668565598 668024750
2575.9F68024750l43170l18451n53360j41754n6916k92816m19464j74103k17438p50579
$$ 668024750 667681580 667363129 666809769 666668015 666611099 666318283 665898819 665724716 665507278 664756699
2585.5F64756699j164093o04401j33057k49557P629m13971k28042o1798m00467m26712
$$ 664756699 663592606 662988205 662855148 662605591 662613220 662199249 661971207 661909409 661508942 661082230
2595.1F61082230q77076m88739l14331n87005o66046o16303j54800J35345J90582j81655
$$ 661082230 660205154 659716415 659402084 658815079 658149033 657532730 657377930 657513275 657703857 657522202
2604.8F57522202k84653l38516l76740n22537q45566m89197j50070j32751n37262n35279
$$ 657522202 657237549 656899033 656522293 655999756 655154190 654664993 654514923 654382172 653844910 653309631
2614.4F53309631m36172m85306j8539M1427k13928o70929p56760p91778r31168m24194
$$ 653309631 652873459 652388153 652369614 652411041 652197113 651526184 650769424 649977646 649046478 648622284
2624.1F48622284j39389j42822J12533N5695p16782o45599l58963q32138q07267l59191
$$ 648622284 648482895 648340073 648452606 648508301 647791519 647145920 646786957 645954819 645147552 644788361
2633.7F44788361l80555j013870n86700j07193l92762j29470k78168p19757o99463
$$ 644788361 644407806 643393936 642807236 642700043 642307281 642177811 641899643 641179886 640480423
2642.4F40480423p37228j043778o95152l65143l55492l14521o01960l57208k32391
$$ 640480423 639743195 638699417 638004265 637639122 637283630 636969109 636367149 636009941 635777550
2651.1F35777550k42729o15769r15260o53496p14531m92783q30802q14362n78804n47371
$$ 635777550 635534821 634919052 634003792 633350296 632635765 632142982 631312180 630497818 629919014 629371643
2660.7F29371643P896l9901l06015r12934o69937l69720q60825r80758j133461m28429
$$ 629371643 629379539 629339638 629033623 628120689 627450752 627081032 626220207 625239449 624105988 623677559
2670.4F23677559l51029q63685o12602k61917j71547m24309l61328p27043j106186
$$ 623677559 623326530 622462845 621850243 621588326 621416779 620992470 620631142 619904099 618797913
2679F18797913p22886n00869j076203r75265K1171L2273k96898o09970k98920q9340
$$ 618797913 618075027 617574158 616497955 615522690 615543861 615576134 615279236 614669266 614370346 614281006
2688.7F14281006p02210j037750j077881o48536p68090o19430j52893l44K24381j99852
$$ 614281006 613578796 612541046 611463165 610814629 610046539 609427109 609274216 609273872 609498253 609298401
2698.3F09298401m84238o21338l91082o96183j048813m11186m98771n01175l07236
$$ 609298401 608814163 608192825 607801743 607105560 606056747 605645561 605146790 604645615 604338379
2707F04338379o065j13183m90303j57203l37601n70641p72361q05245o40716m05312
$$ 604338379 604332314 604219131 603728828 603571625 603234024 602663383 601891022 601085777 600445061 600039749
2716.6F00039749j41258o24848n72853m9438J06087j68763o27632n37567l19519n04112
$$ 600039749 599898491 599273643 598700790 598651352 598757439 598588676 597961044 597423477 597103958 596599846
2726.3E96599846o97556n41114o46172l80669K84005K4948l43171k5024m9744n48210
$$ 596599846 595902290 595361176 594715004 594334335 594618340 594643288 594300117 594275093 594225349 593677139
2735.9E93677139l16047k32087p53402p42417m47540m1084J24283q3695J37520K08588
$$ 593677139 593361092 593129005 592375603 591633186 591185646 591144562 591268845 591185150 591322670 591531258
2745.6E91531258k96250m75616n09033n89180p57065q17909k07444J74256m8104m59366
$$ 591531258 591235008 590759392 590250359 589661179 588904114 588086205 587878761 588053017 588004913 587545547
2755.2E87545547n41000m59251k44751j38321p68624n84869j22833k46391l67814m83360
$$ 587545547 587004547 586545296 586300545 586162224 585393600 584808731 584685898 584439507 584071693 583588333
2764.9E83588333o59103p86667j5869K31094q1520n15518q51669k08092j51673k75383
$$ 583588333 582929230 582142563 582126694 582357788 582276268 581760750 580909081 580700989 580549316 580273933
2774.5E80273933q17184r11446q4266k10228l45993n77813n65338o36673n90667k66381
$$ 580273933 579456749 578545303 578461037 578250809 577904816 577327003 576761665 576124992 575534325 575267944
2784.2E75267944r09462p58323l53165l19176l12118p81250q40492n71709n79910p62597
$$ 575267944 574358482 573600159 573246994 572927818 572615700 571834450 570993958 570422249 569842339 569079742
2793.8E69079742q20732j192474r73625l11241o63414r98574q43658n38139k60163
$$ 569079742 568259010 567066536 566092911 565781670 565118256 564119682 563276024 562737885 562477722
2802.5E62477722l12309j004448j302185n94635n96085r68094q83674j097145j132508
$$ 562477722 562165413 561160965 559858780 559264145 558668060 557699966 556816292 555719147 554586639
2811.2E54586639p37648o83632o37321p89909r70269o84547r57603j248322j255341
$$ 554586639 553848991 553165359 552528038 551738129 550767860 550083313 549125710 547877388 546622047
2819.8E46622047j129608q85696q12225n53895o77986j033973j257820j052208q73032
$$ 546622047 545492439 544606743 543794518 543240623 542562637 541528664 540270844 539218636 538345604
2828.5E38345604j068955j002120j389084j684494j477929j196479j016465r48867
$$ 538345604 537276649 536274529 534885445 533200951 531723022 530526543 529510078 528561211
2836.2E28561211r47991j302910j668548k095375j806870j699714k213669j940499
$$ 528561211 527613220 526310310 524641762 522546387 520739517 519039803 516826134 514885635
2843.9E14885635j684951j850472k247200j676330j425171k131806j703682j602821
$$ 514885635 513200684 511350212 509103012 507426682 506001511 503869705 502166023 500563202
2851.7E00563202j626396j621743j802253j405068j209526j124267j221314p94258
$$ 500563202 498936806 497315063 495512810 494107742 492898216 491773949 490552635 489758377
2859.4D89758377o21529j196403j068459r24263j283493j456642r84192p40356o73714
$$ 489758377 489136848 487940445 486871986 485947723 484664230 483207588 482223396 481483040 480809326
2868.1D80809326o19583o76765L19938P52831j54419m33273k07291m27437l82423n7183
$$ 480809326 480189743 479512978 479832916 480585747 480431328 479998055 479790764 479363327 478980904 478923721
2877.7D78923721n0659L8986j13907J31264Q25844N21469J73378O25610N39437N2070
$$ 478923721 478873062 478912048 478798141 478929405 479755249 480276718 480450096 481075706 481615143 481667213
2887.3D81667213M17176O28395K47230J42556L77121M54216L35998O72188P37800N18837
$$ 481667213 482084389 482712784 482960014 483102570 483479691 483933907 484269905 484942093 485679893 486198730
2897D86198730L45726j35726r1019L09067M84581O01349M78706J45073l70445q11768
$$ 486198730 486544456 486408730 486317711 486626778 487111359 487712708 488191414 488336487 487966042 487154274
2906.6D87154274O3972J056176M00200m05312o34880l59802k14959o22673m17556m006
$$ 487154274 487218246 488274422 488674622 488269310 487634430 487274628 487059669 486436996 486019440 486015434
2916.3D86015434k22664n40275l13721J82304N46036K10190k53372J05705L65639O32400
$$ 486015434 485792770 485252495 484938774 485121078 485667114 485877304 485623932 485729637 486095276 486727676
2925.9D86727676O72036O47544J216431J219597P92465R78470J394310J079178R30633
$$ 486727676 487399712 488047256 489263687 490483284 491275749 492254219 493648529 494727707 495658340
2934.6D95658340J186676J177445J173172J229820J369400J146469J353798J980095
$$ 495658340 496845016 498022461 499195633 500425453 501794853 502941322 504295120 506275215
2942.3E06275215J877899J226731Q27560J004753J121063J467553J461830J091575
$$ 506275215 508153114 509379845 510207405 511212158 512333221 513800774 515262604 516354179
2950E16354179J021233J023636J069870Q93936J420364J562195J074295J058121J045265
$$ 516354179 517375412 518399048 519468918 520362854 521783218 523345413 524419708 525477829 526523094
2958.7E26523094J259995Q45985P96929J394920J461563J593246J197510J044960J433792
$$ 526523094 527783089 528629074 529426003 530820923 532282486 533875732 535073242 536118202 537551994
2967.4E37551994Q00095L43933J099205J523132J020623P16095J132202P56073M23698
$$ 537551994 538352089 538696022 539795227 541318359 542338982 543055077 544187279 544943352 545367050
2976.1E45367050J325798R63707L75824Q10661Q08526M96559L19938M78707L44963
$$ 545367050 546692848 547656555 548032379 548843040 549651566 550148125 550468063 550946770 551291733
2984.7E51291733L50113M99801O04744J048241Q44154K61650j79710j72234M5205j51139
$$ 551291733 551641846 552141647 552746391 553794632 554638786 554900436 554720726 554548492 554593697 554442558
2994.4E54442558j55945L74070K16484o59333m11186q964n6343r880m7150q2398p87582
$$ 554442558 554286613 554660683 554877167 554217834 553806648 553797684 553741341 553731461 553684311 553601913 552814331
3005E52814331p53365P5837p0992m47807n28793k00882J49383l04794m66805m02603
$$ 552814331 552060966 552136803 552065811 551618004 551089211 550888329 551037712 550732918 550266113 549863510
3014.6E49863510q84552n11970k17743p59621r64966q70056m09393k21863J0948L13645
$$ 549863510 548978958 548466988 548249245 547489624 546524658 545654602 545245209 545023346 545034294 545347939
3024.3E45347939p60346j628799n82314n5733q76693j015778o68259j56555r1514l68767
$$ 545347939 544587593 542958794 542376480 542320747 541444054 540428276 539760017 539603462 539511948 539143181
3033.9E39143181k87743o90880p59430o42623r63211j131096p96662m45671o46629
$$ 539143181 538855438 538164558 537405128 536762505 535799294 534668198 533871536 533425865 532779236
3042.6E32779236o88744o72912r02710r26323j46256j63002p71789m87213q25997q82912
$$ 532779236 532090492 531417580 530514870 529588547 529442291 529279289 528507500 528020287 527194290 526311378
3052.2E26311378j007537r89876m77829p71866l91655k63939o56586r71107o39191
$$ 526311378 525303841 524313965 523836136 523064270 522672615 522408676 521752090 520780983 520141792
3060.9E20141792k2964o43006j012649j041565q20694o73866n82543o49299j035500
$$ 520141792 520118828 519475822 518463173 517421608 516600914 515927048 515344505 514695206 513659706
3069.6E13659706n40962m43764l71551n38483j061668n28336n1002k24686o68945n77927
$$ 513659706 513118744 512674980 512303429 511764946 510703278 510174942 510123940 509899254 509230309 508652382
3079.2E08652382p97806p30591p9727n50346p55806o53382p35397m71458n24369p10907
$$ 508652382 507854576 507123985 507044258 506493912 505738106 505084724 504349327 503877869 503353500 502642593
3088.9E02642593k58979k92626o81763m37164k93465P5837n41497j017990j05858l1318
$$ 502642593 502383614 502090988 501409225 500972061 500678596 500754433 500212936 499194946 499089088 499057770
3098.5D99057770k23084p47375q33779l45382l74375K3003L04031j96266n39474l1357
$$ 499057770 498834686 498087311 497253532 496908150 496533775 496556778 496860809 496664543 496125069 496093712
3108.2D96093712k31972q45604o44073l49274k28844k69165j07231j47514l05557l27340
$$ 496093712 495861740 495016136 494372063 494022789 493793945 493524780 493417549 493270035 492964478 492637138
3117.8D92637138k75688m72297p42951k83241r7466j54152k66304n26123r34753n67284
$$ 492637138 492361450 491889153 491146202 490862961 490765495 490611343 490345039 489818916 488884163 488316879
3127.5D88316879K19002l23753k36168k38304o75316q59833j018639k53143p3318j71280
$$ 488316879 488535881 488212128 487975960 487737656 487062340 486202507 485183868 484930725 484857407 484686127
3137.1D84686127n95398m14658j27487r17091j69602K8267p18536q35343o72455m69551
$$ 484686127 484090729 483676071 483548584 482631493 482461891 482490158 481771622 480936279 480263824 479794273
3146.8D79794273m11148k56080n60456j76887l59154j042175n17693J3161k41051j288681
$$ 479794273 479383125 479127045 478566589 478389702 478030548 476988373 476470680 476483841 476242790 474954109
3156.4D74954109j175308q25501p30628k30217l16277k29797m60244n55915m28353
$$ 474954109 473778801 472953300 472222672 471992455 471676178 471446381 470986137 470430222 470001869
3165.1D70001869r01832j147042n21583p1640p23229j070442o43349k8190l57056p47185
$$ 470001869 469100037 467952995 467431412 467359772 466636543 465566101 464922752 464894562 464537506 463790321
3174.7D63790321n71479o12298k86636n82161p04689l63579k16484n23948j174050
$$ 463790321 463218842 462606544 462319908 461737747 461033058 460669479 460452995 459929047 458754997
3183.4D58754997n75218n71251r22623l69682l10249o69594r04121n62249o8931j6403
$$ 458754997 458179779 457608528 456685905 456316223 456005974 455336380 454432259 453870010 453801079 453784676
3193D53784676n74074q07228l87917j41258n18990r11140k35062q5373n86700n98450
$$ 453784676 453210602 452403374 452015457 451874199 451355209 450444069 450209007 450123634 449536934 448938484
3202.7D48938484n35393n81665n52368n38826m92019l17421q59681q18405m78706j49078
$$ 448938484 448403091 447821426 447269058 446730232 446238213 445920792 445061111 444242706 443764000 443614922
3212.3D43614922M66003n63965p74269k50015l07732j03035m77753q65745p66411j53503
$$ 443614922 444080925 443516960 442742691 442492676 442184944 442081909 441604156 440738411 439972000 439818497
3222D39818497l84789n78804l00369o12831n78270p06101l62739n89752p04804j1749
$$ 439818497 439433708 438854904 438554535 437941704 437363434 436657333 436294594 435704842 435000038 434988289
3231.6D34988289o44226q20961p47223o14510k47497o88401o07261q7853k57263q78372
$$ 434988289 434344063 433523102 432775879 432161369 431913872 431225471 430618210 430530357 430273094 429394722
3241.3D29394722j126556n90439J66282k70729m74853l76129j185341j113167p95631
$$ 429394722 428268166 427677727 427844009 427573280 427098427 426722298 425536957 424423790 423628159
3249.9D23628159n49241o47048n22461p25p18498p26777l58047n56183r53522p52983
$$ 423628159 423078918 422431870 421909409 421908684 421190186 420463409 420105362 419549179 418595657 417842674
3259.6D17842674o6452n90095q44536p10945n24025m37012o21872n80902n43632k3270
$$ 417842674 417776222 417186127 416341591 415630646 415106621 414669609 414047737 413466835 412923203 412899933
3269.2D12899933m06647q27827m81377o76308p46460q37059p62825p23037o09398j00098
$$ 412899933 412493286 411665459 411184082 410507774 409761314 408924255 408161430 407438393 406828995 406728897
3278.9D06728897l33786q56666n36500m48608q89816n66254n46799m52385n6190p28188
$$ 406728897 406395111 405538445 405001945 404553337 403663521 403097267 402550468 402098083 402041893 401313705
3288.5D01313705n73005J90849J03722q0414m12789o79817o73217o16036n10979o42891
$$ 401313705 400740700 400931549 401035271 400954857 400542068 399862251 399189034 398572998 398062019 397419128
3298.2C97419128l87916o2752m19769j74866K45094O4469l35045l95546l8681l63655
$$ 397419128 397031212 396968460 396548691 396373825 396618919 396683388 396348343 395952797 395914116 395550461
3307.8C95550461n95627o67801o60210l87268n47599l48778j66550J2703j19286n03463
$$ 395550461 394954834 394287033 393626823 393239555 392691956 392343178 392176628 392189331 392070045 391566582
3317.4C91566582l39241n14183l39318l28331n42144l78609m19312p2555l54347r94149
$$ 391566582 391227341 390713158 390373840 390045509 389503365 389124756 388705444 388632889 388278542 387284393
3327.1C87284393q25042n25742n23300q20351p75642o94084r06830n54810k022m13360
$$ 387284393 386459351 385933609 385410309 384589958 383814316 383120232 382213402 381658592 381656570 381243210
3336.7C81243210j105309q28437m94996q96225r31091n91812r24416j086616o01654
$$ 381243210 380137901 379309464 378814468 377918243 376987152 376395340 375470924 374384308 373782654
3345.4C73782654m80690p68280n48363m55627q68035p37152j082687j466332p67441
$$ 373782654 373301964 372533684 371985321 371529694 370661659 369924507 368841820 367375488 366608047
3354.1C66608047l60832n75409q05893q33091j040879q40835n37071m92783n9891n10177
$$ 366608047 366247215 365671806 364865913 364032822 362991943 362151108 361614037 361121254 361061363 360551186
3363.7C60551186r33915q22792p24449l42102q34007n96161K90527n50804r70268l01628
$$ 360551186 359617271 358794479 358070030 357727928 356893921 356297760 356588287 356037483 355067215 354765587
3373.4C54765587m66156o26145l55377n17273m62341R7046K23999l06168p90710m16145
$$ 354765587 354299431 353673286 353317909 352800636 352338295 352435341 352659340 352353172 351562462 351146317
3383C51146317P0610m69971m05655R7237n04990n87120J7738M1390k51122l86123m68674
$$ 351146317 351216927 350746956 350341301 350438538 349933548 349346428 349364166 349405556 349154434 348768311 348299637
3393.6C48299637j98479J08299k66380n21316n45578j21613M32243k3727q31413p91512
$$ 348299637 348101158 348209457 347943077 347421761 346876183 346754570 347186813 347163086 346331673 345540161
3403.3C45540161K04964J81846l56140l27491m10233j84212l29933l54614j32904n58968
$$ 345540161 345745125 345926971 345570831 345243340 344833107 344648895 344318962 343964348 343831444 343272476
3412.9C43272476o27975R1133M47502j27640o5193M27055l24707r95254P1297L04298
$$ 343272476 342644501 342735634 343183136 343055496 342990303 343417358 343092651 342097397 342168694 342472992
3422.6C42472992o38695k96020J00670m02031o82640K9602O09436N89218J48620o81343
$$ 342472992 341834297 341538277 341638947 341236916 340554276 340583878 341193314 341782532 341931152 341249809
3432.2C41249809j28364K1591l59841n226N8480L56674J74332l20015Q1062J000023
$$ 341249809 341121445 341143036 340783195 340777969 340836449 341193123 341367455 341047440 341128502 342128525
3441.8C42128525M09851l72467O76765R82170K97089r21936n01251P74574Q38280N37796
$$ 342128525 342538376 342165909 342842674 343824844 344121933 343199997 342698746 343473320 344311600 344849396
3451.5C44849396K79617M04549K47917L55987R423K60696J375656L70865p8621L34587
$$ 344849396 345129013 345533562 345781479 346137466 346146889 346407585 347783241 348154106 348075485 348410072
3461.1C48410072L72849K33917L50761R87206Q91228O31485K92015P61947N28336O4812
$$ 348410072 348782921 349016838 349367599 350354805 351246033 351877518 352169533 352931480 353459816 353524628
3470.8C53524628R50966J019592J074715O34193N16472R45396O91414R08089P63550
$$ 353524628 354475594 355495186 356569901 357204094 357720566 358665962 359357376 360265465 361029015
3479.5C61029015L13949K89726P32232J140136J359825Q44841N85518J034851N17083
$$ 361029015 361342964 361632690 362364922 363505058 364864883 365709724 366295242 367330093 367847176
3488.1C67847176J106186J505126P39441P18727R20868P46041Q23364J161385N67703
$$ 367847176 368953362 370458488 371197929 371916656 372837524 373583565 374406929 375568314 376136017
3496.8C76136017J023178J769905J279335R93767J100540J199799P48787R92431J676903
$$ 376136017 377159195 378929100 380208435 381202202 382302742 383502541 384251328 385243759 386920662
3505.5C86920662J901970J206169R44862R29261K47879J268806J189804R80339J607437
$$ 386920662 388822632 390028801 390973663 391902924 392150803 393419609 394609413 395589752 397197189
3514.2C97197189J550560J276169O78559J130905J103630J515732K195129J663055
$$ 397197189 398747749 400023918 400702477 401833382 402937012 404452744 406647873 408310928
3521.9D08310928J008034M80270J879464K233658J174697N00718J023483J813583J725769
$$ 408310928 409318962 409799232 411678696 413912354 415087051 415587769 416611252 418424835 420150604
3530.6D20150604J460037R15375J714096J983719J686974R47036N97153K017174J535339
$$ 420150604 421610641 422526016 424240112 426223831 427910805 428857841 429454994 431472168 433007507
3539.2D33007507J265297J654511K076721J906586J541519J278763N29785J501426
$$ 433007507 434272804 435927315 438004036 439910622 441452141 442730904 443260689 444762115
3547D44762115J099053K199287K003212J661263K126121j29089K216072K310829J494255
$$ 444762115 445861168 448060455 450063667 451724930 453851051 453721962 455938034 458248863 459743118
3555.6D59743118J534958J022873K817268K051888J175156P21321K289085J794319
$$ 459743118 461278076 462300949 465118217 467170105 468345261 469066582 471355667 473149986
3563.4D73149986J668091M886437J16958p09038J7128J026955M656105K719574K587280
$$ 473149986 474818077 479704514 479821472 479112434 479129562 480156517 484812622 487532196 490119476
3572D90119476J921044J636657J652565K197838K815132Q84324K363967K117539J256790
$$ 490119476 492040520 493677177 495329742 497527580 500342712 501227036 503591003 505708542 506965332
3580.7E06965332J969681K509880K354736K313919M485169R65423k53219K336769j43929
$$ 506965332 508935013 511444893 513799629 516113548 520598717 521564140 521310921 523647690 523503761
3589.4E23503761L351250M098434L487091J072159J048127K962532N50270M081497
$$ 523503761 526855011 530953445 534440536 535512695 536560822 539523354 540073624 544155121
3597.1E44155121L704223O67992L018761J855163J742211K902870J758690K548752
$$ 544155121 547859344 548527336 551546097 553401260 555143471 558046341 559805031 562353783
3604.8E62353783M470024L065872k5826L942833J24741K91367P099876Q32901r88274
$$ 562353783 566823807 569889679 569863853 573806686 573931427 574222794 581322670 582155571 581167297
3613.5E81167297M602890J435662N000229M046135Q20999K684555k25601J861534L812599
$$ 581167297 585770187 587205849 592206078 596252213 597073212 599757767 599532166 601393700 605206299
3622.2F05206299K879333K462693L537826L384934K987365N739212k499199q492698
$$ 605206299 608085632 610548325 614086151 617471085 620458450 626197662 623698463 615205765
3629.9F15205765O321411O798973O239700J619911p25517L030739L493652K665863
$$ 615205765 621527176 628326149 634565849 636185760 635460243 638490982 641984634 644650497
3637.6F44650497R80072K022248L540191L068695J110154R84649L158646M089584N275956
$$ 644650497 645630569 647652817 651193008 654261703 655371857 656356506 659515152 663604736 668880692
3646.3F68880692q23594k058715O129074O13250l788833Q33740O963730N411453M274521
$$ 668880692 668057098 665998383 672127457 672740707 668951874 669785614 676749344 682160797 686435318
3655F86435318L693008p098617K826004N412979K080460J755294L11585K233429J469955
$$ 686435318 690128326 683029709 685855713 691268692 693349152 695104446 695416031 697649460 699119415
3663.6F99119415J988144K094269J051788M218827K708053J091538k257080p141190
$$ 699119415 701107559 703201828 704253616 708472443 711180496 712272034 710014954 702873764
3671.4G02873764N268097Q778305Q088684k241669j7032318M250870Q251801L731994
$$ 702873764 708141861 716920166 725008850 722767181 705734863 709985733 718237534 721969528
3679.1G21969528k701721J071930K999039J535873J123276N94024J096650M475708
$$ 721969528 719267807 720339737 723338776 724874649 725997925 726591949 727688599 732164307
3686.8G32164307N133285j0782165j694413P524338n728454J007461N178681J328887
$$ 732164307 737297592 726515427 724821014 732345352 726616898 727624359 732803040 734131927
3694.5G34131927K269669j39389j755447N81970J442032L328476J575241p143784j257705
$$ 734131927 736401596 736262207 734506760 735088730 736530762 739859238 741434479 734290695 733032990
3703.2G33032990N144729J909485O50177P39136K383346J507111o981583M805298J467819
$$ 733032990 738177719 740087204 740737381 741476517 743859863 745366974 738385391 743190689 744658508
3711.9G44658508j2220382O132888M737168O80771Q83941J211930O4621k622757J778335
$$ 744658508 732438126 738571014 743308182 743988953 744872894 746084824 746149445 743526688 745305023
3720.5G45305023M277497m394455k870484M718170M77524j246643k676620Q68759L487472
$$ 745305023 749582520 745188065 742317581 747035751 747513275 746266632 743590012 744458771 747946243
3729.2G47946243R74732M278869m353027n011749R625320q04519j1708069O79474L448944
$$ 747946243 748920975 753199844 748846817 743835068 753460388 752655869 740947800 741627274 745076218
3737.9G45076218J504593K700195J936111l147888M574127R541550j8137207r041901
$$ 745076218 746580811 749281006 751217117 748069229 752643356 762184906 744047699 735005798
3745.6G35005798J2433625N398712M519424n008774o872253R175415r442902l864135
$$ 735005798 747439423 752838135 757357559 752348785 745476532 754651947 745209045 741344910
3753.3G41344910P154541M159774K366562m146347K487946L418426q196334l16468
$$ 741344910 748499451 752659225 755025787 750879440 753367386 756785812 748589478 748273010
3761G48273010M217224P21283M04892L131867k862320l379746L749390M381180j293106
$$ 748273010 752490234 753211517 753616409 756748276 753885956 750506210 754255600 758636780 757343674
3769.7G57343674q473435K440796L141785J52359K29187n32456O32630P37381L029861
$$ 757343674 748870239 751311035 754452820 754605179 754834366 754301910 754934540 755671921 758701782
3778.4G58701782j266632o785431K808609J916886J055450J026077l297119m01916
$$ 758701782 757435150 750649719 753458328 755375214 756430664 757456741 754159622 753757706
3786.1G53757706J249313M24118N73578k85034m79126N41687J177978l0136J375733
$$ 753757706 755007019 755431137 756004715 755719681 755240555 755782242 756960220 756930084 758305817
3794.8G58305817K575454l729705l147355J966172L500824M597549q370438q952636
$$ 758305817 760881271 757151566 754004211 755970383 759471207 764068756 755698318 746745682
3802.5G46745682N197601L618317M876251L864593j0304107k692871N024566J717072
$$ 746745682 751943283 755561600 760437851 764302444 753998337 751305466 756330032 758047104
3810.2G58047104n33447j39161r21020M82788N197220l377075j0695420O933213N099258
$$ 758047104 757513657 757374496 756453476 756936264 762133484 758756409 748060989 754994202 760093460
3818.9G60093460L371506j35193j6337509K761459N505219K036209J803360j057129
$$ 760093460 763464966 763329773 746992264 749753723 755258942 757295151 759098511 758041382
3826.6G58041382l570328J086960J887970K720413N53818p494583M324112O082382
$$ 758041382 754471054 755558014 757445984 760166397 760720215 753225632 757549744 763632126
3834.3G63632126p707291J208878P803039j0083160k947540O821212n652694R70535
$$ 763632126 755924835 757133713 764936752 754853592 751906052 758727264 753074570 754045105
3842.1G54045105O413269l184204k392426L154145N48019O6147J692657j023712K165985
$$ 754045105 760458374 757274170 754881744 758035889 758583908 758650055 760342712 759319000 761484985
3850.7G61484985M328766p547378k265396j3958512M513931R859620j027298j406556
$$ 761484985 765813751 758266373 756000977 742042465 746556396 756416016 755388718 753982162
3858.4G53982162K021561K753296K417908n408859M12445N335846o623612l804398
$$ 753982162 756003723 758757019 761174927 755766068 756178513 761514359 754890747 751086349
3866.2G51086349N016556M680634K138824j0001220m860306M856109N504914N57327
$$ 751086349 756102905 760783539 762922363 752921143 748060837 752916946 758421860 758979187
3873.9G58979187r227142L092117M271622n0659J739807K799072p248154n489197O243897
$$ 758979187 749752045 752844162 757115784 757065125 758804932 761604004 754355850 748866653 755110550
3882.6G55110550Q53882K327575L148880j2843627K998504L648911O23626M039689
$$ 755110550 755964432 758292007 761440887 748597260 751595764 755244675 755868301 759907990
3890.3G59907990k537156q111267K284241K914124j321335J648483J228180J757507
$$ 759907990 757370834 749259567 751543808 754457932 753136597 754785080 756013260 757770767
3898G57770767n45959q289490N992966N51376m143906M063034l609314k01644K64740
$$ 757770767 757224808 748935318 754928284 755479660 751335754 755398788 751789474 751587830 751852570
3906.7G51852570P41272J987304n96313l1281p95288r842P99713p3623J137161J102447
$$ 751852570 752593842 754581146 753984833 753953552 753158264 753148422 753948135 753874512 755011673 756114120
3916.3G56114120m306030j857147M391022j004181k349472K577286Q89205j52587l041764
$$ 756114120 751808090 749950943 754341965 753337784 750988312 753565598 754454803 754302216 751260452
3925G51260452k729950J743775J931381J123276q97751o5766J399613l004761j308212
$$ 751260452 748530502 750274277 752205658 753328934 752431183 752365417 753765030 750760269 749452057
3933.7G49452057J883087J50147K60162l3112q02536J78910K58483J498414O41784
$$ 749452057 751335144 751485291 751745453 751712341 750909805 751088715 751347198 752845612 753487396
3942.3G53487396l797073o97556J377945J229554N90515k573395M74243n5771j826782
$$ 753487396 749690323 748992767 750370712 751600266 752190781 749617386 750091629 750035858 748209076
3951G48209076K095184L99323o99692J06735K9831k20032o67495M13055k54440R75189
$$ 748209076 750304260 750703583 750003891 750110626 750140457 749920425 749252930 749665985 749411545 750386734
3960.7G50386734L45459j713028O98853M54254n09415j93939M20456O80694p33032
$$ 750386734 750732193 749019165 749718018 750172272 749662857 749468918 749889374 750570068 749837036
3969.3G49837036m58908J031113J8310j292495J38549P26853j25275m50668J82342
$$ 749837036 749378128 750409241 750427551 749135056 749273605 750000458 749875183 749424515 749606857
3978G49606857P26090L31573M2191n5924j30005m54025k5940l69873p26471P0496K07977
$$ 749606857 750332947 750664520 750706711 750650787 750520782 750066757 750040817 749670944 748944473 749014969 749222946
3988.6G49222946O97098Q4991l33175n14450l31650N29938k00196l8833N5847N21316
$$ 749222946 749920044 750005035 749671860 749157410 748825760 749355698 749155502 749116669 749172516 749693832
3998.3G49693832J450n82809
$$ 749693832 749695282 749112473
4000.2G49112473
$$ 749112473
##END=$$ End of the data block
