##TITLE=QTS-PVA-Clo $$ Begin of the data block
##JCAMP-DX=5.00 $$ ACD/SpecManager v 10.08
##SPECTROMETER/DATA SYSTEM=Alpha
##DATE=25 Nov 2013 10:34:22
##DATA TYPE=INFRARED SPECTRUM
##DATA CLASS=XYDATA
##ORIGIN=
##OWNER=
##NPOINTS=1667
##FIRSTX=599.57470703
##LASTX=3997.16503906
##MAXX=3997.16503906
##MINX=599.57470703
##MAXY=0.99690306
##MINY=0.45990798
##XFACTOR=1.0000000000
##YFACTOR=1.000000000000000e-9
##FIRSTY=0.45990798
##DELTAX=2.03937006
##XUNITS=1/CM
##YUNITS=ARBITRARY UNITS
##XYDATA=(X++(Y..Y))
599.6D59907979O25044J443684K562255L146648L110200L024578K976805K635181K578050
$$ 459907979 460533023 461976707 464538962 467685610 470795810 473820388 476797193 479432374 482010424
617.9D82010424L156334L307075K881825K368688K022594K131880K277523J829445
$$ 482010424 485166758 488473833 491355658 493724346 495746940 497878820 500156343 501985788
634.2E01985788J035273L31104o2108n1200J95741L79086Q41081K058089L369629M457593
$$ 501985788 503021061 503352165 503290057 503238857 503434598 503813684 504654765 506712854 510082483 514540076
654.6E14540076N558372O266236O180525N399346M097522M503369O236255M114866
$$ 514540076 520098448 526364684 532545209 537944555 542042077 546545446 552781701 556896567
671E56896567K640367K874076K891064K802134K632260K342701K225101K280593K518236
$$ 556896567 559536934 562411010 565302074 568104208 570736468 573079169 575304270 577584863 580103099
689.3E80103099K754629K685547K403796K077102K112508K407491K607584K616883
$$ 580103099 582857728 585543275 587947071 590024173 592136681 594544172 597151756 599768639
705.6E99768639K462089K529859K727509K694607K544701K508998K621591K709984
$$ 599768639 602230728 604760587 607488096 610182703 612727404 615236402 617857993 620567977
721.9F20567977K662719K711594K711534K481342K441227K590180K465426K311886
$$ 620567977 623230696 625942290 628653824 631135166 633576393 636166573 638631999 640943885
738.3F40943885K459049K604961K661705K757669K815783K629042K526104K706170
$$ 640943885 643402934 646007895 648669600 651427269 654243052 656872094 659398198 662104368
754.6F62104368K738118K530754K423823K446353K404571K470732K485811K355218
$$ 662104368 664842486 667373240 669797063 672243416 674647987 677118719 679604530 681959748
770.9F81959748K393782K673090K704680K278089J842559J478910J319468J255274
$$ 681959748 684353530 687026620 689731300 692009389 693851948 695330858 696650326 697905600
787.2F97905600R62257P75636Q07583P44581O81877N40674J50502k66969o75083j155197
$$ 697905600 698867857 699643493 700451076 701195657 701877534 702418208 702568710 702301741 701626658 700471461
807.6G00471461j768410k402425k987087l244996k664805j604020p15792j67251l9220
$$ 700471461 698703051 696300626 693313539 690068543 687403738 685799718 685083926 684916675 684877455
825.9F84877455o1452O020P2420L42965Q09371J126290J222789J259625J340508J538635
$$ 684877455 684816003 684822023 684894443 685237408 686046779 687173069 688395858 689655483 690995991 692534626
846.3F92534626J952767K663255L828287N474448P520199R894967J2199044J3905406
$$ 692534626 694487393 697150648 700978935 706453383 713973582 723868549 736067593 749972999
862.7G49972999J4613092J3819814J1676013R094477O430805L863454J982033O89804
$$ 749972999 764586091 778405905 790081918 799176395 805607200 809470654 811452687 812142491
879H12142491n36084j581549k292216k551616k343237k145827j990556j596094j203537
$$ 812142491 811606407 810024858 807732642 805181026 802837789 800691962 798701406 797105312 795901775
897.3G95901775j000046r17316r34660j016438j396299k239585l273248m059017l932178
$$ 795901775 794901729 793984413 793049753 792033315 790637016 788397431 785124183 781065166 777132988
915.7G77132988k853215j776516j190961o91533K36810J494228K303660K289594J741111
$$ 777132988 774279773 772503257 771312296 770620763 770857573 772351801 774655461 776945055 778686166
934G78686166Q80480j82271j085878j367509r78410M17J563310L250123M361331M605889
$$ 778686166 779566646 779384375 778298497 776930988 775952578 775952995 777516305 780766428 785127759 789733648
954.4G89733648M042745K820253J457751N48303m2975n66959r66013j397490k027929
$$ 789733648 793776393 796596646 798054397 798602700 798559725 797992766 797026753 795629263 793601334
972.8G93601334k776861l499210m072249m490554m955471n504906n896032o147981
$$ 793601334 790824473 787325263 783253014 778762460 773806989 768302083 762406051 756258070
989.1G56258070o408333o629348o874681p300615p956624q886874j0159313j1817992
$$ 756258070 749849737 743220389 736345708 729045093 721088469 712201595 702042282 690224290
1005.4F90224290j3721585j5449107j6489089j6355514j4738202j1591912p316768
$$ 690224290 676502705 661053598 644564509 628208995 613470793 601878881 594562113
1019.7E94562113k836048R44614L562868M852712M957080M260719K948463J323819
$$ 594562113 591726065 592670679 596233547 601086259 606043339 610304058 613252521 614576340
1036F14576340j64748j387417k162933k113879j342595l77535M21524P48634M21107
$$ 614576340 614411592 613024175 610861242 608747363 607404768 607027233 607448757 608197391 608618498
1054.4F08618498l67224j255572j988232k380848k401710k226055j948356j677394
$$ 608618498 608251274 606995702 605007470 602626622 600224912 597998857 596050501 594373107
1070.7E94373107j595140j888275k539336l076852l031850k444684j654625p57039
$$ 594373107 592777967 590889692 588350356 585273504 582241654 579796970 578142345 577385306
1087E77385306L83079J793623L427267N197883P085919R188831J1433423J3414323
$$ 577385306 577768385 579562008 582989275 588187158 595273077 604461908 615895331 629309654
1103.3F29309654J4400959J3923764J2271703J0019839P718920N893708M782676M231513
$$ 629309654 643710613 657634377 669906080 679925919 687644839 693538547 698321223 702552736
1119.6G02552736L931403L772676L861129M191995M492998M524052L935814J997352
$$ 702552736 706484139 710256815 714117944 718309939 722802937 727326989 731262803 733260155
1135.9G33260155j213610l490150j172543P050276J7355084K4181962K5085986K1278560
$$ 733260155 732046545 728556395 727383852 734434128 751789212 775971174 801057160 822335720
1152.2H22335720J5371621R690463N578578L136039J769781Q84711J45495l99410o75142
$$ 822335720 837707341 847397804 852976382 856112421 857882202 858766913 858912408 858512998 857837856
1170.6H57837856q37028r66251j115859j236796j231730j229644j298249j384079j556635
$$ 857837856 857000828 856034577 854918718 853681922 852450192 851220548 849922299 848538220 846981585
1189H46981585j809716j976788k185583k582729k920449l114998l367722l748596m296064
$$ 846981585 845171869 843195081 841009498 838426769 835506320 832391322 829023600 825275004 820978940
1207.3H20978940m980267n701482o590426p782042r180069j0599196j1951566j3214290
$$ 820978940 815998673 810297191 803706765 795924723 786744654 776145458 764193892 750979602
1223.6G50979602j4227032j4667094j4419139j3548374j1945009r706080p321834n205989
$$ 750979602 736752570 722085476 707666337 694117963 682172954 672466874 665145040 659939051
1239.9F59939051l436566k006352j022219l45826K47716O37889Q25584J111627J685142
$$ 659939051 656502485 654496133 653473914 653128088 653375804 654013693 654839277 655950904 657636046
1258.3F57636046K593518L711760M878640O085932P294297Q397878R333372J0158896
$$ 657636046 660229564 663941324 668819964 674905896 682200193 690598071 699931443 710090339
1274.6G10090339J0815978J1105061J1007726J0551929R684504Q502900P100642N535006
$$ 710090339 720906317 732011378 743019104 753571033 763255537 771758437 778859079 784394085
1290.9G84394085L923119K369046J011014o7532q89480j464546j786173k049267k410829
$$ 784394085 788317204 790686250 791697264 791629732 790740252 789275706 787489533 785440266 783029437
1309.3G83029437k783894l001273l070593l123045l116608k937197k618492k246082
$$ 783029437 780245543 777244270 774173677 771050632 767934024 764996827 762378335 760132253
1325.6G60132253j888096j602233j329541j049220p17640n9486J013756K003014K702952
$$ 760132253 758244157 756641924 755312383 754263163 753545523 753486037 754499793 756502807 759205759
1344G59205759L148019K867699J760900R8526j905680l890693n337179o324410p371485
$$ 759205759 762353778 765221477 766982377 767080903 765175223 761284530 755947351 749622941 742251456
1362.3G42251456q226216q796334r527624r346664p560909m397511j70589L794313
$$ 742251456 734025240 725228906 715701282 706354618 698793709 694396198 694225609 698019922
1378.6F98019922O600201P618427O859422N044699J872301k160371n973518r654343
$$ 698019922 704620123 712238550 719097972 724142671 726014972 723854601 717881083 708226740
1394.9G08226740j1914074j2919366j2521029j0548770q271933n098820j587510J576126
$$ 708226740 696312666 683393300 670872271 660323501 652051568 646952748 645365238 646941364
1411.3F46941364M085839N525410O814301Q477747P888019O765426O703853O589532
$$ 646941364 651027203 656552613 663366914 671844661 679732680 686498106 693201959 699791491
1427.6F99791491O924272O833374N994260O468714P286608O166875N731821N991876
$$ 699791491 706715763 713549137 719543397 726012111 733298719 739465594 745197415 751189291
1443.9G51189291O140471O589234O474733N704880N168855O209135P616580N838454
$$ 751189291 757329762 763918996 770393729 776098609 781267464 787476599 795093179 800931633
1460.2H00931633M600822N447090N986393N103290M934311O118774O143510M947484
$$ 800931633 805532455 810979545 816965938 822069228 827003539 833122313 839265823 844213307
1476.5H44213307M347324M065037L738582L049135K432108K092123J734496J070976
$$ 844213307 848560631 852625668 856364250 859413385 861845493 863937616 865672112 866743088
1492.8H66743088M79042L934m81188p95007j047611j641214k982259l213465k857089
$$ 866743088 867222130 867226064 866744876 865949869 864902258 863261044 860278785 857065320 854208231
1511.2H54208231l172994l708899m234552m531324n357385n814314n613446o149173
$$ 854208231 851035237 847326338 843091786 838560462 833203077 827388763 821775317 815626144
1527.5H15626144o304621o615401q089780p956326p091225r543955j1333585r482801
$$ 815626144 809321523 802706122 794616342 786660016 779568791 770024836 758691251 749208450
1543.8G49208450q625805q183241p951379p181465n990804m532575k759874j081646
$$ 749208450 740582645 732399404 724448025 717266560 711275756 706743181 703983307 702901661
1560.1G02901661K27809J880348L604770N712151Q053363Q003890Q655429J2105107
$$ 702901661 703129470 705009818 708614588 714326739 722380102 730383992 739039421 751144528
1576.4G51144528J2043834J0287523J0792673J1107206J0826826J0251999R499193
$$ 751144528 763188362 773475885 784268558 795375764 806202590 816454589 825953782
1590.7H25953782Q740127Q128166P384241O421327N609274M873991M041016L283322
$$ 825953782 834693909 842822075 850206316 856627643 862236917 867110908 871151924 874435246
1607H74435246K684474J908600J085878N33819O4969n52714r35733j323939j621067
$$ 874435246 877119720 879028320 880114198 880648017 880712986 880160272 879224539 877900600 876279533
1625.4H76279533j778483k016485j969159j877785k129137k042353j492262j281560
$$ 876279533 874501050 872484565 870515406 868637621 866508484 864466131 862973869 861692309
1641.7H61692309j143217r18686p39038m28736P5102O91235P91072R19462J282751
$$ 861692309 860549092 859630406 858891368 858462632 858537734 859228969 860020041 860939503 862222254
1660.1H62222254J811505K086103J990616K399385K910793K538383K468765K686798
$$ 862222254 864033759 866119862 868110478 870509863 873420656 875959039 878427804 881114602
1676.4H81114602K164781J688600J592755J577973O54638l07202r29594j679480l116012
$$ 881114602 883279383 884967983 886560738 888138711 888793349 888486147 887556553 885877073 882761061
1694.7H82761061m807949n866170q145988q188605p619560q129060p096946n682588
$$ 882761061 877953112 872086942 863940954 855752349 848132789 840003729 832906783 827224195
1711.1H27224195m357457k900481j359105k64287j04905l13937p55787j144171j134276
$$ 827224195 822866738 819966257 818607152 818342865 818237960 817924023 817168236 816024065 814889789
1729.4H14889789k47658K432943N703330P478952J1159480J4906585J6085863J6677141
$$ 814889789 814642131 817075074 822778404 830257356 841416836 856323421 872409284 889086425
1745.7H89086425J6780079J6605794J4712930J0441422P168889N333424L690839K761125
$$ 889086425 905866504 922472298 937185228 947626650 954795539 960128963 963819802 966580927
1762I66580927K031505J338304J025676R07839Q68380P84039O69658N88954N46157
$$ 966580927 968612432 969950736 970976412 971884251 972752631 973536670 974206328 974795282 975341439
1780.4I75341439M51505L99054M33146M05312K24233K13265L54707K81752J36196J25289
$$ 975341439 975792944 976191998 976625144 977030456 977254689 977467954 977822661 978104413 978240609 978365898
1800.8I78365898K49982K89738K12193N4776K5690J47462J51157L8445M7744P7247
$$ 978365898 978615880 978905618 979117811 979172587 979198277 979345739 979496896 979535341 979583085 979660332
1821.2I79660332k2292L9101J54912R8527J26838J99616J50681J03175j549j20461
$$ 979660332 979638040 979677141 979832053 979930580 980057418 980257034 980407715 980510890 980509341 980388880
1841.6I80388880n1439J66297K80619K45869J79469R9540M2141K9862P0571J08123
$$ 980388880 980337441 980503738 980784357 981030226 981209695 981309235 981351376 981381238 981451809 981559932
1862I81559932M9114r4115j59443M6194K56777K31564R8049n245m0471l3796j0193
$$ 981559932 981609046 981514931 981355488 981401682 981658459 981890023 981988072 981982827 981942356 981908560 981898367
1884.4I81898367O56L099L4512O7532J04665J18852L6240j7345l875K7180L8922k921
$$ 981898367 981899023 981902122 981936634 982004166 982108831 982227683 982263923 982246578 982242703 982269883 982308805 982305884
1908.9I82305884j5556J8537K1576n126j9133n0783P868J17719O7473l7968q8573j10805
$$ 982305884 982290328 982308865 982330441 982325315 982306182 982255399 982263267 982380986 982448459 982410491 982321918 982211113
1933.3I82211113n8711K9087j0848q1181k7001M9889R5129Q9347m828p2836p570J02579
$$ 982211113 982152402 982181489 982170641 982089460 982062459 982112348 982207477 982296824 982291996 982219160 982211590 982314169
1957.8I82314169J02163J0013j9073k921R835K8908L1472N7876L6656l1650k6285k2173
$$ 982314169 982416332 982426345 982407272 982404351 982414186 982443094 982474566 982532442 982569098 982537448 982511163 982488990
1982.3I82488990k6047M4345L3856q4281p4565M7504P8559k0086j08421j06812r1255
$$ 982488990 982462943 982507288 982541144 982456863 982382298 982429802 982508361 982488275 982379854 982273042 982181787
2004.7I82181787o0856k5034m6968r5904j08242q8990o1333k7955l5226q7619j01149
$$ 982181787 982120931 982095897 982048929 981953025 981844783 981755793 981694460 981666505 981631279 981543660 981442511
2027.2I81442511n8353o3836j39773j60277p5817j5319q3625j28031o2048j3531k9325
$$ 981442511 981384158 981320322 981180549 981020272 980944455 980929136 980845511 980717480 980655432 980641901 980612576
2049.6I80612576r7275j19090p5340q6069j06931j27792j83940j21892K206n1201j74522
$$ 980612576 980515301 980396211 980320871 980234802 980127871 980000079 979816139 979694247 979696453 979645252 979470730
2072I79470730j74344q6248R299M5120k7895j03175q4341p9036j28626j37747j06930
$$ 979470730 979296386 979210138 979219437 979264557 979236662 979133487 979049146 978970110 978841484 978703737 978596807
2094.5I78596807j25409j50323q1241p927m2141o9558r239Q643n5850j16646j55985
$$ 978596807 978471398 978321075 978239834 978231907 978189766 978120208 978110969 978119612 978063762 977947116 977791131
2116.9I77791131j57476j27256j43766j29581l3140n543q7202j57356j03176l9875
$$ 977791131 977633655 977506399 977362633 977233052 977199912 977194369 977107167 976949811 976846635 976806760
2137.3I76806760l7193m8221r6917q7619n3703o4969o6400p4565m2975O854j8358n3108
$$ 976806760 976769567 976721346 976624429 976536810 976483107 976418138 976351738 976277173 976234198 976241052 976222694 976169586
2161.8I76169586k4378P152l4749o6876m2260k2590Q1181J80364M9710p8022j8299
$$ 976169586 976145208 976152360 976117611 976050735 976008475 975985885 976067066 976247430 976297140 976219118 976200819
2184.2I76200819P570K9087J13070M5836n0903M2081J24276P4804N1975P6831N5432
$$ 976200819 976208389 976237476 976350546 976396382 976345479 976387560 976511836 976586640 976638615 976715446 976770878
2206.6I76770878K7120O5446J08003J05024O1750j8954l1769M1604J17242J11103L0756
$$ 976770878 976797998 976863444 976971447 977076471 977138221 977119267 977087498 977129102 977246344 977357447 977388203
2229.1I77388203K027O3955J21415O7294L3080M7326L7432J04785J41263N1260l2663
$$ 977388203 977390230 977454185 977575600 977642894 977675974 977723300 977760732 977865517 978006780 978058040 978025377
2251.5I78025377l8624j4067K3902R8943R3341J5378O1870J30951N0605m9532j6987
$$ 978025377 977986753 977972686 977996588 978095531 978188872 978204250 978266120 978397071 978447676 978398144 978381157
2273.9I78381157J07169J34766J1861q9526k4914J19984J04964m0830q9585o5089o6817
$$ 978381157 978488326 978623092 978634953 978545427 978520513 978640497 978745461 978704631 978615046 978549957 978483140
2296.4I78483140m7683J7345Q5890O3241l3558n3823o497k324j3471j8060l0756N9247
$$ 978483140 978435457 978452802 978538692 978601933 978568375 978514552 978508055 978505731 978492260 978474200 978443444 978502691
2320.8I78502691J83344K02894J17838p3135p9274J23263J99437J78933R6023L7611
$$ 978502691 978686035 978888929 979006767 978933632 978854358 978977621 979177058 979355991 979452014 979489625
2341.2I79489625N0783l100o2287j00016p8917Q0884L47614M80533J67489j79708k32756
$$ 979489625 979540408 979537308 979475021 979375005 979296088 979376972 979724586 980205119 980372608 980192900 979960144
2363.6I79960144k47121k28763k38776k17021j05381r8526j54615j04904o1333q7321
$$ 979960144 979713023 979484260 979245484 979028463 978923082 978824556 978669941 978565037 978503704 978416383
2384I78416383l9994N9843Q6128K1518o8486j32084j56224j17838o7294l3855k1398
$$ 978416383 978376389 978436232 978522360 978543878 978475392 978343308 978187084 978069246 978001952 977968097 977946699
2406.5I77946699r3937j42694q5294l3677n7757j24812j39177p0333q345l6597q4638
$$ 977946699 977852762 977710068 977624774 977591097 977533340 977408528 977269351 977199018 977190673 977154076 977069438
2428.9I77069438r2209o5684j7524o1452j57416j20342k1577k6405q6009j30356j40965
$$ 977069438 976977229 976911545 976894021 976832569 976675153 976554811 976533234 976506829 976420820 976290464 976149499
2451.3I76149499j39355j68264j69814j31190p2240k0385q3685k06173j89483r3579
$$ 976149499 976010144 975841880 975672066 975540876 975468636 975448251 975364566 975158393 974968910 974875331
2471.7I74875331j05381j50621j68443k39670k62678j65641j07467j25289j09315r4891
$$ 974875331 974769950 974619329 974450886 974211216 973948538 973782897 973675430 973550141 973440826 973345935
2492.1I73345935j76549k52843k05278j38760j13844r6381j21892j65045j80483j41918
$$ 973345935 973169386 972916543 972711265 972572505 972458661 972362280 972240388 972075343 971894860 971752942
2512.5I71752942q7619j40429k01046j06812l1173j03950j77145j96040j71542j35303
$$ 971752942 971665323 971524894 971323848 971217036 971185863 971081913 970904768 970708728 970537186 970401883
2532.9I70401883j36316j24752j17660j00612r3103j50204j52289p5996j9491m8161
$$ 970401883 970265567 970140815 970023155 969922543 969829440 969679236 969526947 969450951 969431460 969383299
2553.3I69383299j56998k54453k24351p0513q523j15752j96875j80482j53423j24037
$$ 969383299 969226301 968971848 968747497 968676984 968668461 968552709 968355834 968175352 968021929 967897892
2573.7I67897892q6427q7619j48296k65121l38614k67804j78814j84596k29477k77698
$$ 967897892 967811465 967723846 967575550 967310429 966971815 966704011 966525197 966340601 966111124 965833426
2594.1I65833426l24786l31938k86341k76864l17394l68357m37319l76165k63334l47912
$$ 965833426 965508640 965176702 964890361 964613497 964296103 963927746 963490427 963114262 962850928 962503016
2614.5I62503016m57466m24981m00066m28796m38690m21465l57508l47615m27901m46677
$$ 962503016 962045550 961620569 961220503 960791707 960353017 959931552 959574044 959226429 958798528 958351851
2634.9I58351851m35055m22358l60489l38972m31001m85837m11273l62634l97086m53353
$$ 958351851 957916796 957494438 957133949 956794977 956363976 955878139 955466866 955104232 954707146 954253793
2655.3I54253793m71950m22537l58343l43979l40819k82645k46883k97010l81231m28796
$$ 954253793 953781843 953359306 953000963 952656984 952316165 952033520 951786637 951489627 951108396 950679600
2675.7I50679600l90053k90930k20239k46286l07858l19839k50518j70529j70708j98006
$$ 950679600 950289547 949998617 949778378 949532092 949224234 948904395 948653877 948483348 948312640 948114634
2696.1I48114634k40803k99096l47197l37124k34127j97470k85864l52562l24189k86878
$$ 948114634 947873831 947574735 947227538 946890414 946656287 946458817 946172953 945820391 945496202 945209324
2716.4I45209324l04460l63648m81844n81861n38051m14312l84748m35352m62770m75169
$$ 945209324 944904864 944541216 944059372 943477511 942939460 942525148 942140400 941705048 941242278 940767109
2736.8I40767109m71413m49300m05192l91841m60386m12822k50637k42353l33428l58880
$$ 940767109 940295696 939846396 939441204 939049363 938588977 938176155 937925518 937683165 937349737 936990857
2757.2I36990857l41713l20137l39389l83317l57747l33727l90172m16755l78728l68834
$$ 936990857 936649144 936329007 935989618 935606301 935248554 934914827 934524655 934107900 933729172 933360338
2777.6I33360338m28855m95672m99607m71413n11110o33955p65264q59737q54254q00848
$$ 933360338 932931483 932435811 931936204 931464791 930953681 930319726 929554462 928694725 927840471 927039623
2798I27039623r09328j143873j300633j353502j350880j374185j420438j411736j436472
$$ 927039623 926130295 924986422 923685789 922332287 920981407 919607222 918186784 916775048 915338576
2816.4I15338576j534701j583099j561463j566708j600742j591742j579047j631677
$$ 915338576 913803875 912220776 910659313 909092605 907491863 905900121 904321074 902689397
2832.7I02689397j709282j851022k072692k187789k240479k426386k671241k772570
$$ 902689397 900980115 899129093 897056401 894868612 892628133 890201747 887530506 884757936
2849H84757936k589703k068162j313984n78165l9160J55747r537k63870m97341p50661
$$ 884757936 882168233 880100071 878786087 878207922 878168762 878324509 878314972 878051102 877553761 876803100
2869.4H76803100r20594r28461q70764r89080j334011j739562k183855k707660l321349
$$ 876803100 875882506 874954045 874083281 873094201 871760190 870020628 867836773 865129113 861807764
2887.8H61807764l974438m549444n008399n287171n356014n144298m627108m020930
$$ 861807764 857833326 853283882 848275483 842988312 837632298 832488000 827860892 823839962
2904.1H23839962l304719k490283j843810j468896j213730r26852p52270o95169o19710
$$ 823839962 820535243 818044960 816201150 814732254 813518524 812591672 811839402 811144233 810524523
2922.4H10524523n62131n35190n25415n85914o38127m70460j44660J95682O06298J360774
$$ 810524523 809962392 809427202 808901787 808315873 807677746 807207286 807062626 807258308 807864606 809225380
2942.8H09225380K638162M178881N579055O587445P272721P643819P489502O932974
$$ 809225380 811863542 816042423 821621478 828208923 835481644 843125463 850614965 857547939
2959.1H57547939O317675N661368M876495M087090L392697K811789K306163J862765
$$ 857547939 863865614 869526982 874403477 878490567 881883264 884695053 887001216 888863981
2975.4H88863981J471579J122713Q68380O62506M54187K20716L338j35422k68996l72707
$$ 888863981 890335560 891458273 892326653 892989159 893443346 893664062 893667400 893531978 893262982 892890275
2995.8H92890275l51429m09544o37710p32601p24852p77006q18670q59439r05991r41932
$$ 892890275 892538846 892129302 891491592 890758991 890034139 889257133 888438463 887579024 886673033 885731101
3016.2H85731101r32515r01997r79662j098990j109243j157701j259863j270175j278818
$$ 885731101 884798586 883896589 882916927 881817937 880708694 879550993 878291130 877020955 875742137
3034.6H75742137j264333j250029j315057j418889j492858j450300j412511j476288
$$ 875742137 874477804 873227775 871912718 870493829 869000971 867550671 866138160 864661872
3050.9H64661872j577377j656473j614391j545251j614570j663566j641274j705229
$$ 864661872 863084495 861428022 859813631 858268380 856653810 854990244 853348970 851643741
3067.2H51643741j736760j629889j623094j805246j900196j809597j724958j750231
$$ 851643741 849906981 848277092 846653998 844848752 842948556 841138959 839414001 837663770
3083.5H37663770j757801j720548j732230j770794j828849j885832j871705j782596
$$ 837663770 835905969 834185421 832453191 830682397 828853548 826967716 825096011 823313415
3099.8H23313415j755714j819373j920938k010107j981616j925469j938760j955569
$$ 823313415 821557701 819738328 817817390 815807283 813825667 811900198 809961438 808005869
3116.2H08005869j922011j851797j793742j803696j916469k037286k017677j962125
$$ 808005869 806083858 804232061 802438319 800634623 798718154 796680868 794663191 792701066
3132.5G92701066j966596j907170j860797j931668k007961k032757k037108j981616
$$ 792701066 790734470 788827300 786966503 785034835 783026874 780994117 778957009 776975393
3148.8G76975393j873076j850426j936078k015710k017081j932621j851379j862407
$$ 776975393 775102317 773251891 771315813 769300103 767283022 765350401 763499022 761636615
3165.1G61636615j877725j808167j770496j841009j858830j725555j632392j703322
$$ 761636615 759758890 757950723 756180227 754339218 752480388 750754833 749122441 747419119
3181.4G47419119j741767j680315j621604j572251j520932j448929j442611j523793
$$ 747419119 745677352 743997037 742375433 740803182 739282250 737833321 736390710 734866917
3197.7G34866917j506328j346827j296937j364530j276493j196146j210451j111269
$$ 734866917 733360589 732013762 730716825 729352295 728075802 726879656 725669205 724557936
3214G24557936j054764j103878j061141r04679q04604q25166q17716q11756q68678
$$ 724557936 723503172 722399294 721338153 720433474 719628870 718803704 717985988 717174232 716305554
3232.4G16305554q39233o95646o08802n73278m29928l69489n11170n18858l36349k55108
$$ 716305554 715466321 714770675 714161873 713588595 713158667 712789178 712278008 711759150 711422801 711167693
3252.8G11167693k83599k47359j91510k44736k41697j08063o3479l2068M5061N3585
$$ 711167693 710884094 710636735 710445225 710200489 709958792 709850729 709787250 709755182 709800243 709853828
3273.2G09853828N6446O7710Q7738J51158J76012J83642K84493L42429K91228L24726
$$ 709853828 709910274 709977984 710065722 710216880 710392892 710576534 710861027 711203456 711494684 711819410
3293.6G11819410M12166M08769L77297L80636M13418M59551M47393L24905L06189M91679
$$ 711819410 712231576 712640345 713017642 713398278 713811696 714271247 714718640 715043545 715349734 715841413
3314G15841413O16788O16968N64694M97818M94361M61698M35591N82337O92904O00934
$$ 715841413 716458201 717075169 717639863 718137681 718632042 719093740 719529331 720111668 720804572 721405506
3334.4G21405506M29332L28958M45128O47485P29025P64012P82549O68705O01947P90894
$$ 721405506 721834838 722163796 722608924 723256409 723985434 724749446 725531995 726200700 726802647 727593541
3354.8G27593541R04322P88867P65682Q34405R41694J116514J141071J074791J087368
$$ 727593541 728497863 729286730 730052412 730886817 731828511 732945025 734086096 735160887 736248255
3373.1G36248255J116812J240730J436651J461566J329481J260340J390279J507222
$$ 736248255 737365067 738605797 740042448 741504014 742833495 744093835 745484114 746991336
3389.4G46991336J506925J620054J615048J380622J407564J668036J759350J718700
$$ 746991336 748498261 750118315 751733363 753113985 754521549 756189585 757948935 759667635
3405.7G59667635J658857J588642J631976J803875J861691J822829J843393J808703
$$ 759667635 761326492 762915134 764547110 766350985 768212676 770035505 771878898 773687601
3422G73687601J773954J839041J899302J874268J884699K008140K107978K064228J975060
$$ 773687601 775461555 777300596 779199898 781074166 782958865 784967005 787074983 789139211 791114271
3440.4G91114271J958430J979589K119124K278030K264142K139687K039791K005040
$$ 791114271 793072701 795052290 797171414 799449444 801713586 803853273 805893064 807898104
3456.7H07898104K097070K302230K281129J998961J923919K190530K332211K158940
$$ 807898104 809995174 812297404 814578533 816577494 818501413 820691943 823024154 825183094
3473H25183094J944541J963318K205968K350509K250731K059519K002597K152503K285540
$$ 825183094 827127635 829090953 831296921 833647430 835898161 837957680 839960277 842112780 844398320
3491.4H44398320K221226K032519J924932K054333K194167K168953K054870K038002
$$ 844398320 846619546 848652065 850576997 852631330 854825497 856994450 859049320 861087322
3507.7H61087322K242089K366423K264261K074600J881182J846671K067983K251804
$$ 861087322 863329411 865695834 867960095 870034695 871915877 873762548 875830531 878082335
3524H78082335K202272K148331K126157K039254K026498K135873K146661K069593K022802
$$ 878082335 880284607 882432938 884559095 886598349 888624847 890760720 892907381 894976974 896999776
3542.4H96999776J973510J915097J904965J951337J983285J996815J976251J925469
$$ 896999776 898973286 900888383 902793348 904744685 906727970 908724785 910701036 912626505
3558.7I12626505J856208J737177J734614J867176J894176J889288J849890J748800
$$ 912626505 914482713 916219890 917954504 919821680 921715856 923605144 925455034 927203834
3575I27203834J653075J621127J686573J589299J392662J485348J702547J693487J677692
$$ 927203834 928856909 930478036 932164609 933753908 935146570 936631918 938334465 940027952 941705644
3593.4I41705644J647651J560688J603246J592457J384437J206398J236916J313984
$$ 941705644 943353295 944913983 946517229 948109686 949494123 950700521 951937437 953251421
3609.7I53251421J305998J290262J269340J332760J424372J360655J261651J242817
$$ 953251421 954557419 955847681 957117021 958449781 959874153 961234808 962496459 963739276
3626I63739276J500130J698970J366556J212180J243591J216889J152396R91583Q08835
$$ 963739276 965239406 966938376 968304932 969517112 970760703 971977592 973129988 974121571 974930406
3644.3I74930406Q25286J168966J453996J226365R42707R24945R91106R52601Q34287
$$ 974930406 975755692 976924658 978378654 979605019 980547726 981472671 982463777 983416378 984250665
3662.7I84250665P14898O68585O85513O81579O24597P31469Q24749O50704N14567M46319
$$ 984250665 984965563 985634148 986319661 987001240 987625837 988357306 989182055 989832759 990347326 990793645
3683.1I90793645M20869N11646N72562M40479L21984K65539J42157O9499J74760K02716
$$ 990793645 991214514 991726160 992298722 992739201 993061185 993326724 993468881 993538380 993713140 993915856
3703.5I93915856J06275K9743J5676J02699J37209J56761K39372K43783J23322k5988
$$ 993915856 994022131 994051874 994067550 994170249 994307458 994464219 994703591 994947374 995070696 995044708
3723.9I95044708l6418J27256K10523R9659q3744o0082n483r5249l0696M4704m0889
$$ 995044708 995008290 995135546 995346069 995445728 995361984 995301902 995296419 995201170 995170474 995215178 995174289
3746.3I95174289J19209L44515J45197p0632l0577N2989J78337K58326J66238p2360
$$ 995174289 995293498 995638013 995783210 995712578 995682001 995734990 995913327 996171653 996337891 996265531
3766.7I96265531j25289J27494J47402j53780k25126N4895K53380K19464J72794R9122
$$ 996265531 996140242 996267736 996415138 996261358 996036232 996091127 996344507 996563971 996736765 996835887
3787.1I96835887k0861o0797j45674k06291l755O9677q5294l3080J24394J45793K7478
$$ 996835887 996815026 996754229 996608555 996402264 996398509 996468186 996382892 996349812 996474206 996619999 996647477
3809.5I96647477m6432j2576K7298P2957J27315l0458k69949j69099R4116K22027J74463
$$ 996647477 996601045 996588469 996615767 996688724 996816039 996785581 996515632 996346533 996440649 996662676 996837139
3831.9I96837139K1637j52111k00808n3406M112q5294k2828K09987K00450j73986k23040
$$ 996837139 996858776 996706665 996505857 996452451 996456563 996371269 996348441 996558428 996758878 996584892 996361852
3854.4I96361852N9724N5611k5928p7427L3915J10746O7055M2200r3997j06990k8491
$$ 996361852 996421576 996477187 996451259 996373832 996407747 996518493 996585548 996627748 996533751 996426761 996398270
3876.8I96398270j06990j24812L7372J87874J56700o3717j74701L8981J75476J7584
$$ 996398270 996291280 996166468 996203840 996391714 996548414 996484697 996309996 996348977 996524453 996542037
3897.2I96542037j58489k88069j64271K50816M23134K46823K8670o1751l3677O8725
$$ 996542037 996383548 996095479 995931208 996182024 996605158 996851981 996880651 996818900 996785223 996853948
3917.6I96853948M9114l3498j4365n6684j31488j28269m1365P4088L2723j73330k40743
$$ 996853948 996903062 996869564 996855199 996798515 996667027 996538758 996497393 996571481 996604204 996430874 996190131
3940I96190131o3420O6936J4961K3782J79053J62065j4425o3836n722J8596l5464j00792
$$ 996190131 996126711 996193647 996208608 996232390 996411443 996573508 996559083 996495247 996489525 996508121 996472657 996371865
3964.5I96371865o2227L6359O8784P8261L7968n186p9036k58624j84715J10209K17497
$$ 996371865 996309638 996345997 996414781 996493042 996531010 996525824 996446788 996188164 996003449 996113658 996331155
3986.9I96331155J66357P5221m6074k0504J54614
$$ 996331155 996497512 996572733 996526659 996506155 996660769
3997.1I96660769
$$ 996660769
##END=$$ End of the data block
