##TITLE=QTS-PVA-CLO $$ Begin of the data block
##JCAMP-DX=5.00 $$ ACD/SpecManager v 10.08
##SPECTROMETER/DATA SYSTEM=Alpha
##DATE=17 Apr 2014 09:51:36
##DATA TYPE=INFRARED SPECTRUM
##DATA CLASS=XYDATA
##ORIGIN=
##OWNER=
##NPOINTS=1667
##FIRSTX=599.57470703
##LASTX=3997.16503906
##MAXX=3997.16503906
##MINX=599.57470703
##MAXY=0.99093330
##MINY=0.29862654
##XFACTOR=1.0000000000
##YFACTOR=1.000000000000000e-9
##FIRSTY=0.29862654
##DELTAX=2.03937006
##XUNITS=1/CM
##YUNITS=ARBITRARY UNITS
##XYDATA=(X++(Y..Y))
$$ plain form
599.6 298626542 300403029 302430153 304666251 306783497 308507532 309818476 311101824 312521249
615.9 312521249 314051569 316225111 319212198 322402835 325558722 328569382 330843568 332491338
632.2 332491338 334195346 335838854 336915284 337552279 338217854 339114755 340217203 341838241 344480008
650.6 344480008 348144501 352685660 357796937 363129497 368513644 373614550 377918601 382387251
666.9 382387251 387934834 392200738 395684063 399282247 402639985 405789495 408800900 411680132
683.2 411680132 414542854 417391092 420246154 423147351 426106691 429060310 431787223 434468418
699.5 434468418 437433422 440684170 443957329 446986169 449985772 453228980 456496596 459612578
715.8 459612578 462730229 465986848 469403028 472803831 476000160 478942513 481966704 485273480
$$ packed form
599.6B98626542J776487K027124K236098K117246J724035J310944J283348J419425
615.9C12521249J530320K173542K987087L190637L155887L010660K274186J647770
632.2C32491338J704008J643508J076430O36995O65575Q96901J102448J621038K641767
650.6C44480008L664493M541159N111277N332560N384147N100906M304051M468650
666.9C82387251N547583M265904L483325L598184L357738L149510L011405K879232
683.2D11680132K862722K848238K855062K901197K959340K953619K726913K681195
699.5D34468418K965004L250748L273159L028840K999603L243208L267616L115982
715.8D59612578L117651L256619L416180L400803L196329K942353L024191L306776
$$ plain form
732.1 485273480 488569617 491846502 495243132 498687297 501927555 504944086 508091748 511461854
748.4 511461854 514902949 518362463 521715820 525016308 528367400 531657398 535018504 538532794
764.8 538532794 542020261 545405686 548805416 552147627 555294037 558487594 561800480 564978957
781.1 564978957 568027496 571076870 574068546 576824307 579183459 581245720 583071053 584429979
797.4 584429979 585302651 585846722 585672379 584360301 582233131 579543769 576146543 572281480 568741083
815.7 568741083 566216707 564837754 564229012 564201415 564754128 565586209 566533566 567755461 569377959
834.1 569377959 571168602 572902620 574827731 577157438 579640985 582101047 585015953 588945985
850.4 588945985 594213367 601378858 611172318 624262094 640578687 658936203 677801430 695504487
$$ packed form
732.1D85273480L296137L276885L396630L444165L240258L016531L147662L370106
748.4E11461854L441095L459514L353357L300488L351092L289998L361106L514290
764.8E38532794L487467L385425L399730L342211L146410L193557L312886L178477
781.1E64978957L048539L049374K991676K755761K359152K062261J825333J358926
797.4E84429979Q72672N44071j74343j312078k127170k689362l397226l865063l540397
815.7E68741083k524376j378953o08742k7597N52713Q32081R47357J221895J622498
834.1E69377959J790643J734018J925111K329707K483547K460062K914906L930032
850.4E88945985N267382P165491R793460J3089776J6316593J8357516J8865227J7703057
$$ plain form
866.7 695504487 710449100 721836627 729770839 734854758 737690508 738738477 738566995 737767041
883 737767041 736387312 734339237 732172132 730531394 729510427 728894830 728521287 728241324 727821052
901.4 727821052 727016032 725623965 723394990 720022798 715585530 711122692 708296120 707926512 709238231
919.8 709238231 711115360 713318646 716264069 720388234 725659490 731582403 737449169 742606461
936.1 742606461 746838093 750178933 752684772 754573703 756139755 757570326 758841336 759776771 760217130
954.4 760217130 760208666 759874046 759195209 758138537 756752610 755153775 753260016 750818610 747827113
972.8 747827113 744418263 740512848 736064315 731207311 726020455 720648170 715292394 710088968
989.1 710088968 705129921 700390577 695700645 690821826 685544133 679704607 673086226 665264189
$$ packed form
866.7F95504487J4944613J1387527P934212N083919K835750J047969j71482p99954
883G37767041j379729k048075k167105j640738j020967o15597l73543k79963m20272
901.4G27821052q05020j392067k228975l372192m437268m462838k826572l69608J311719
919.8G09238231J877129K203286K945423M124165N271256N922913N866766N157292
936.1G42606461M231632L340840K505839J888931J566052J430571J271010R35435M40359
954.4G60217130q464l34620o78837j056672j385927j598835j893759k441406k991497
972.8G47827113l408850l905415m448533m857004n186856n372285n355776n203426
989.1G10088968m959047m739344m689932m878819n277693n839526o618381p822037
$$ plain form
1005.4 665264189 655889928 645077586 633321822 621470749 610607028 601587296 594813883 590258718
1021.7 590258718 587374747 585203111 582963645 580335379 577159166 573513985 569701612 565824330
1038 565824330 561916471 558015943 554075062 550247729 546851873 543941677 541162789 538042843 534386158
1056.4 534386158 530270934 525658906 520653367 515814662 511529684 507814050 504590809 501437902
1072.7 501437902 497679800 493010134 487708986 482406288 477828860 474544883 472810626 472978324
1089 472978324 475496650 480520308 488186896 498769701 512578487 529808581 549975634 571587265
1105.3 571587265 592475116 610487342 624599874 635258019 643444359 650051534 655739069 660838664
1121.7 660838664 665580988 670246780 674996495 679600716 683306396 684679449 681418121 671675503
$$ packed form
1005.4F65264189r374261j0812342j1755764j1851073j0863721r019732o773413m555165
1021.7E90258718k883971k171636k239466k628266l176213l645181l812373l877282
1038E65824330l907859l900528l940881l827333l395856k910196k778888l119946l656685
1056.4E34386158m115224m612028n005539m838705m284978l715634l223241l152907
1072.7E01437902l758102m669666n301148n302698m577428l283977j734257J67698
1089D72978324K518326N023658P666588J0582805J3808786J7230094K0167053K1611631
1105.3E71587265K0887851J8012226J4112532J0658145Q186340O607175N687535N099595
1121.7F60838664M742324M665792M749715M604221L705680J373053l261328r742618
$$ plain form
1138 671675503 657556593 647623897 652375519 674896955 708602130 743708491 773287952 794720292
1154.3 794720292 808493912 816697419 821518660 824340403 826014698 827026367 827533126 827672660
1170.6 827672660 827635646 827583611 827480018 827204645 826771319 826194406 825466275 824608266 823673010 822667658
1191 822667658 821433961 819991589 818591297 817307711 816101372 814945579 813829541 812761009 811647892
1209.4 811647892 810386240 809019864 807563126 805932462 804103255 802095175 799885809 797356188
1225.7 797356188 794425130 791163504 787909150 785280526 783818841 783725441 784881532 786866128 789062917
1244 789062917 790968418 792331815 793092906 793239355 792841315 792003810 790748358 789160609 787274718
1262.4 787274718 785070956 782738924 780437768 778065324 775579691 772993028 770238280 767261326
$$ packed form
1138F71675503j4118910r932696M751622K2521436L3705175L5106361K9579461K1432340
1154.3G94720292J3773620Q203507M821241K821743J674295J011669N06759J39534
1170.6H27672660l7014n2035j03593k75373m33326n76913p28131q58009r35256j005352
1191H22667658j233697j442372j400292j283586j206339j155793j116038j068532j113117
1209.4H11647892j261652j366376j456738j630664j829207k008080k209366k529621
1225.7G97356188k931058l261626l254354k628624j461685r3400J156091J984596K196789
1244G89062917J905501J363397P61091J46449l98040q37505j255452j587749j885891
1262.4G87274718k203762k332032k301156k372444k485633k586663k754748k976954
$$ plain form
1278.7 767261326 763960540 760327697 756532967 752648890 748583138 744298398 739857256 735304117
1295 735304117 730591238 725777447 721016228 716347754 711747706 707151294 702518046 697779238 692921937
1313.4 692921937 688112557 683425069 678970516 675016165 671637833 668867230 666789830 665378153
1329.7 665378153 664533436 664157689 664251149 664982915 666799366 670054078 674655318 680405498 686869919
1348 686869919 693356872 699103177 703663588 707045197 709277630 710261941 709997535 708671570 706205130
1366.4 706205130 702216625 696927190 690787911 684290469 678822279 675050080 672734976 671425045
1382.7 671425045 670100212 667370439 662294388 654794514 643938899 628921986 611917138 594257057
1399 594257057 577557385 563626587 552257836 544884324 542129815 543411195 548155129 555228114
$$ packed form
1278.7G67261326l300786l632843l794730l884077m065752m284740m441142m553139
1295G35304117m712879m813791m761219m668474m600048m596412m633248m738808m857301
1313.4F92921937m809380m687488m454553l954351l378332k770603k077400j411677
1329.7F65378153q44717l75747R3460P31766J816451L254712M601240N750180O464421
1348F86869919O486953N746305M560411L381609K232433R84311k64406j325965k466440
1366.4G06205130l988505n289435o139279o497442n468190l772199k315104j309931
1382.7F71425045j324833k729773n076051p499874j0855615j5016913j7004848j7660081
1399E94257057j6699672j3930798j1368751p373512k754509J281380M743934P072985
$$ plain form
1415.3 555228114 564261138 575838268 587293088 597678185 608112752 618022501 627615213 636616230
1431.6 636616230 644186080 651397407 658815384 664965868 670493662 676136017 681925178 688247681
1448 688247681 694861233 701142073 706942201 713507652 721772909 728998125 735040486 741722584 749009728
1466.3 749009728 755515575 761570513 768626571 776242137 783093333 789150715 794634163 799779534
1482.6 799779534 804214895 807708561 810458243 812963903 815019310 816168308 816464186 816377878 816211760
1501 816211760 815723419 813958228 809906244 806324363 803691983 800471961 796239734 791176319 785737872
1519.3 785737872 779008746 771714151 764743149 756984234 749214411 740958989 730611145 720974922
1535.7 720974922 712595880 700311840 685836077 674714208 665413439 657120705 649281859 642726779
$$ packed form
1415.3E55228114R033024J1577130J1454820J0385097J0434567R909749R592712R001017
1431.6F36616230P569850P211327P417977O150484N527794N642355N789161O322503
1448F88247681O613552O280840N800128O565451Q265257P225216O042361O682098P287144
1466.3G49009728O505847O054938P056058P615566O851196O057382N483448N145371
1482.6G99779534M435361L493666K749682K505660K055407J148998K95878q6308j66118
1501H16211760m88341j765191m051984l581881k632380l220022m232227n063415n438447
1519.3G85737872o729126p294595o971002p758915p769823q255422j0347844r636223
1535.7G20974922q379042j2284040j4475763j1121869r300769q292734p838846o555080
$$ plain form
1552 642726779 638083041 635336697 634516358 636532545 640354872 645610034 652527511 661339343 672509670
1570.3 672509670 683314204 694013596 707800269 721392930 732750058 743995488 755062461
1584.6 755062461 765446186 774999499 783719897 791548967 798536539 804687142 809996545 814548373
1600.9 814548373 818296492 821195185 823352814 824872911 825591981 825572908 824813247 823171198 821366072
1619.3 821366072 819440365 816765606 813923895 811243355 808468699 806017160 803631008 800516605
1635.6 800516605 797881663 796536565 795590818 794757307 793954849 793719709 794268072 794903278 796199918
1653.9 796199918 798468113 800949454 803652227 806820631 810519457 814247668 818336487 823303342
1670.3 823303342 828162551 833104551 838663578 843871593 848599434 853589058 860026658 866209090
$$ packed form
1552F42726779m643738k746344q20339K016187L822327N255162O917477Q811832J1170327
1570.3F72509670J0804534J0699392J3786673J3592661J1357128J1245430J1066973
1584.6G55062461J0383725R553313Q720398P829070O987572O150603N309403M551828
1600.9H14548373L748119K898693K157629J520097P19070j9073p59661j642049j805126
1619.3H21366072j925707k674759k841711k680540k774656k451539k386152l114403
1635.6H00516605k634942j345098r45747q33511q02458k35140N48363O35206J296640
1653.9G96199918K268195K481341K702773L168404L698826L728211M088819M966855
1670.3H23303342M859209M942000N559027N208015M727841M989624O437600O182432
$$ plain form
1686.6 866209090 871300757 876597404 881462693 886010408 890636086 894989252 899837494 904212952
1702.9 904212952 907908499 911707342 915199578 918301821 921028018 923491120 926509321 930040777
1719.2 930040777 933009684 935469747 937816441 939902186 941684127 943158746 944730699 946835041
1735.5 946835041 948799312 950500727 951982200 953211606 954292476 955263436 956271172 957641423
1751.8 957641423 958969116 959805489 960411847 961034656 961759865 962593019 963209331 963548601 963824153
1770.2 963824153 964184046 964846909 965579927 966072857 966347396 966588557 966904461 967348397 967719316 967774630
1790.6 967774630 967905581 968390763 968840480 969001353 969092309 969488263 969980001 970139921 970014930 970012188
1811 970012188 970297337 970636427 970873237 971064031 971151233 971059978 970931232 970888555 970896721 971132338 971517682
$$ packed form
1686.6H66209090N091667N296647M865289M547715M625678M353166M848242M375458
1702.9I04212952L695547L798843L492236L102243K726197K463102L018201L531456
1719.2I30040777K968907K460063K346694K085745J781941J474619J571953K104342
1735.5I46835041J964271J701415J481473J229406J080870R70960J007736J370251
1751.8I57641423J327693Q36373O06358O22809P25209Q33154O16312L39270K75552
1770.2I63824153L59893O62863P33018M92930K74539K41161L15904M43936L70919N5314
1790.6I67774630J30951M85182M49717J60873R0956L95954M91738J59920j24991k742
1811I70012188K85149L39090K36810J90794Q7202r1255j28746m2677Q166K35617L85344
$$ plain form
1833.4 971517682 971725225 971841097 971948445 971847713 971602678 971682549 972028375 972277701 972424507 972560763
1853.8 972560763 972692668 972768247 972782552 972784281 972773671 972612441 972368717 972412765 972744524 973066151 973237395
1876.2 973237395 973232627 973137915 973119080 973181307 973207533 973147511 973125875 973171413 973141015 973114371 973171830 973233879
1900.7 973233879 973245740 973210752 973146975 973076880 973091900 973192394 973183990 973005295 972887099 972867787 972861707
1923.2 972861707 972962976 973087668 973075807 972983301 972935259 972913742 972874761 972771525 972562373 972462177
1943.5 972462177 972597182 972735763 972757936 972742200 972723246 972714782 972747445 972803414 972828627 972782850 972707450
1966 972707450 972721279 972791672 972794354 972763598 972770154 972752512 972640276 972528875 972521544 972552240 972470224 972302377
1990.5 972302377 972235501 972266436 972239077 972136557 972083926 972087145 972093999 972100198 972055554 971979678 971874654 971653759
$$ packed form
1833.4I71517682K07543J15872J07348j00732k45035P9871L45826K49326J46806J36256
1853.8I72560763J31905P5579J4305J729j0610j61230k43724M4048L31759L21627J71244
1876.2I73237395m768r4712j8835O2227K6226o0022k1636M5538l0398k6644N7459O2049
1900.7I73233879J1861l4988o3777p0095J5020J00494q404j78695j18196j9312o080
1923.2I72861707J01269J24692j1861r2506m8042k1517l8981j03236k09152j00196
1943.5I72462177J35005J38581K2173j5736j8954q464L2663N5969K5213m5777p5400
1966I72707450J3829P0393K682l0756O556j7642j12236j11401p331L0696q2016j67847
1990.5I72302377o6876L0935k7359j02520n2631L219O854O199m4644p5876j05024k20895
$$ plain form
2014.9 971653759 971425533 971353412 971316278 971164942 970971048 970834017 970714390 970568359 970429301 970306873
2035.3 970306873 970160544 969984710 969838977 969731927 969604433 969440222 969246328 969000459 968756080 968584716
2055.7 968584716 968461871 968363106 968233585 968011558 967811525 967742205 967695415 967559159 967344403 967131555
2076.1 967131555 966979325 966851950 966667116 966432810 966245830 966085315 965892076 965729356 965599120 965435565
2096.5 965435565 965291321 965140283 964921594 964721203 964537442 964353800 964234531 964170098 964093983 963973880
2116.9 963973880 963831961 963668466 963479936 963343263 963254869 963104069 962974310 962958336 962925911 962789357
2137.3 962789357 962580025 962389767 962308347 962300241 962264657 962206066 962189078 962167740 962100625 962032914 962008297
2159.7 962008297 962057710 962120593 962090254 961999178 961949348 961983085 962076128 962182522 962268770 962278724 962271154 962345898
$$ packed form
2014.9I71653759k28226p2121l7134j51336j93894j37031j19627j46031j39058j22428
2035.3I70306873j46329j75834j45733j07050j27494j64211j93894k45869k44379j71364
2055.7I68584716j22845r8765j29521k22027k00033o9320m6790j36256k14756k12848
2076.1I67131555j52230j27375j84834k34306j86980j60515j93239j62720j30236j63555
2096.5I65435565j44244j51038k18689k00391j83761j83642j19269o4433p6115j20103
2116.9I63973880j41919j63495j88530j36673q8394j50800j29759j5974l2425j36554
2137.3I62789357k09332j90258q1420q106l5584n8591j6988k1338o7115o7711k4617
2159.7I62008297M9413O2883l0339r1076m9830L3737R3043J06394Q6248R954p570P4744
$$ plain form
2184.2 962345898 962394178 962346256 962297678 962299943 962373018 962530673 962682784 962774634 962841213 962866545 962882102
2206.6 962882102 962945461 963017404 963097990 963231027 963365138 963469684 963580728 963694453 963822544 963986278
2227 963986278 964148641 964219093 964211762 964259744 964397490 964528143 964586496 964637160 964757860 964949012 965118587
2249.4 965118587 965228021 965327978 965355277 965309978 965344250 965494573 965629518 965701342 965791941 965907872 966017187
2271.9 966017187 966138959 966271102 966371179 966472566 966620743 966755033 966852248 966959178 967054904 967109144
2292.3 967109144 967132270 967125773 967113137 967111230 967115164 967121959 967143595 967163682 967177927 967268109 967441320 967620552
2316.7 967620552 967755973 967790246 967743397 967841804 968181551 968531191 968716085 968794763 968888164 969036698
2337.1 969036698 969169676 969202936 969038010 968662024 968437552 968515694 968754888 969080448 969446063 969776809
$$ packed form
2184.2I62345898M8280m7922m8578K265P3075J57655J52111R1850O6579K5332J5557
2206.6I62882102O3359P1943Q0586J33037J34111J04546J11044J13725J28091J63734
2227I63986278J62363P0452p331M7982J37746J30653N8353N0664J20700J91152J69575
2249.4I65118587J09434R9957K7299m5299L4272J50323J34945P1824R0599J15931J09315
2271.9I66017187J21772J32143J00077J01387J48177J34290R7215J06930R5726N4240
2292.3I67109144K3126o497j2636j907L934O795K1636K0087J4245R0182J73211J79232
2316.7I67620552J35421L4273m6849R8407L39747L49640J84894P8678R3401J48534
2337.1I69036698J32978L3260j64926l75986k24472P8142K39194L25560L65615L30746
$$ plain form
2357.5 969776809 969785154 969506383 969457030 969525814 969268143 968821526 968570590 968515515 968455493 968411267 968459666
2380 968459666 968536913 968623281 968711436 968729258 968726635 968776464 968822658 968843699 968821108 968734860 968664348 968636274
2404.4 968636274 968624413 968588114 968477726 968351781 968265176 968215823 968167007 968044519 967866957 967745185
2424.8 967745185 967746854 967799962 967771649 967698872 967700124 967732310 967716992 967665136 967600524 967567444 967556119 967446864
2449.3 967446864 967256010 967098951 966937840 966807723 966813266 966846764 966763914 966589153 966449022 966419399
2469.7 966419399 966374278 966185391 965948522 965738595 965514839 965309739 965178370 965042353 964844525 964634359
2490.1 964634359 964415848 964198589 964004219 963861227 963772953 963676095 963527679 963313818 963094652 962904632
2510.5 962904632 962709010 962512791 962321103 962132871 961954534 961796641 961635292 961431563 961235285 961088181
$$ packed form
2357.5I69776809Q345k78771m9353O8784k57671m46617k50936n5075o0022m4226M8399
2380I68459666P7247Q6368Q8155J7822k623M9829M6194K1041k2591q6248p0512k8074
2404.4I68636274j1861l6299j10388j25945q6605m9353m8816j22488j77562j21772
2424.8I67745185J669N3108k8313p2777J252L2186j5318n1856o4612l3080j1325j09255
2449.3I67446864j90854j57059j61111j30117N543L3498q2850j74761j40131k9623
2469.7I66419399m5121j88887k36869k09927k23756k05100j31369j36017j97828k10166
2490.1I64634359k18511k17259j94370j42992q8274r6858j48416k13861k19166j90020
2510.5I62904632j95622j96219j91688j88232j78337j57893j61349k03729j96278j47104
$$ plain form
2530.9 961088181 960942090 960805476 960736096 960684240 960533559 960262299 960003376 959862053 959770501 959680438
2551.3 959680438 959584296 959418178 959256768 959209919 959143758 958941042 958722830 958621383 958581328 958457947
2571.7 958457947 958236992 958004653 957802951 957616568 957411706 957156360 956830978 956443548 956005573 955567241
2592.1 955567241 955207467 954906404 954548776 954127610 953712881 953304708 952862322 952346385 951811731 951280594
2612.4 951280594 950687945 950092614 949549198 948979318 948401928 947884083 947312713 946644008 946036577 945526183
2632.8 945526183 945002139 944416881 943769276 943140149 942591906 942070723 941569090 941075981 940567076 940043628
2653.2 940043628 939520359 939063370 938624144 938102245 937559843 937067628 936607420 936190844 935818732 935374498
2673.6 935374498 934838355 934384704 934037328 933685958 933312595 932938576 932537735 932104111 931716979 931426883
$$ packed form
2530.9I61088181j46091j36614o9380n1856j50681k71260k58923j41323r1552r0063
2551.3I59680438r6142j66118j61410m6849o6161k02716k18212j01447m0055j23381
2571.7I58457947k20955k32339k01702j86383k04862k55346l25382l87430m37975m38332
2592.1I55567241l59774l01063l57628m21166m14729m08173m42386n15937n34654n31137
2612.4I51280594n92649n95331n43416n69880n77390n17845n71370o68705o07431n10394
2632.8I45526183n24044n85258o47605o29127n48243n21183n01633m93109n08905n23448
2653.2I40043628n23269m56989m39226n21899n42402m92215m60208m16576l72112m44234
2673.6I35374498n36143m53651l47376l51370l73363l74019m00841m33624l87132k90096
$$ plain form
2694 931426883 931139529 930733860 930274785 929877222 929547906 929260433 928942680 928499341 927984774 927542090
2714.4 927542090 927114844 926605105 926035583 925395191 924706995 924078584 923530400 922975540 922339380 921603322
2734.8 921603322 920809686 920021236 919316530 918694556 918094575 917537510 917006612 916448236 915869176 915287316
2755.2 915287316 914706886 914179504 913764834 913372636 912894130 912372351 911864519 911324859 910681665 909993470
2775.6 909993470 909389555 908773720 907979608 907128751 906288922 905341983 904311955 903201997 901910543
2793.9 901910543 900466561 899024367 897591531 895992696 894163370 892150044 890006125 887805820
2810.3 887805820 885607958 883441746 881246924 879013598 876869857 874810398 872732699 870647252
2826.6 870647252 868602037 866552711 864462495 862326443 860069573 857762337 855487406 853159666
$$ packed form
2694I31426883k87354m05669m59075l97563l29316k87473l17753m43339n14567m42684
2714.4I27542090m27246n09739n69522o40392o88196o28411n48184n54860o36160p36058
2734.8I21603322p93636p88450p04706o21974n99981n57065n30898n58376n79060n81860
2755.2I15287316n80430n27382m14670l92198m78506n21779n07832n39660o43194o88195
2775.6I09993470o03915o15835p94112q50857q39829r46939j030028j109958j291454
2793.9I01910543j443982j442194j432836j598835j829326k013326k143919k200305
2810.3H87805820k197862k166212k194822k233326k143741k059459k077699k085447
2826.6H70647252k045215k049326k090216k136052k256870k307236k274931k327740
$$ plain form
2842.9 853159666 850765169 848309577 845986366 844057381 842353761 840683877 839142680 837733030
2859.2 837733030 836373508 835031092 833604813 832060456 830499947 828919411 827226341 825415552
2875.5 825415552 823411822 820998430 818044245 814447403 810112357 805018008 799139321 792524457
2891.8 792524457 785275638 777630210 770067692 763086617 757061481 752239943 748825133 746880352
2908.1 746880352 746133685 746170998 746757388 747798264 748985052 749848664 750043392 749414384 748040378
2926.5 748040378 745966792 743222296 740034342 736678183 733529091 730949581 729313910 729263961 731488049
2944.9 731488049 736505687 744382203 754533410 766052365 778066754 789878488 800884366 810657799
2961.2 810657799 819062233 826099694 831841171 836331844 839613140 841926694 843538225 844545186
$$ packed form
2842.9H53159666k394497k455592k323211j928985j703620j669884j541197j409650
2859.2H37733030j359522j342416j426279j544357j560509j580536j693070j810789
2875.5H25415552k003730k413392k954185l596842m335046n094349n878687o614864
2891.8G92524457p248819p645428p562518o981075o025136m821538l414810j944781
2908.1G46880352p46667L7313N86390J040876J186788Q63612J94728o29008j374006
2926.5G48040378k073586k744496l187954l356159l149092k579510j635671m9949K224088
2944.9G31488049N017638P876516J0151207J1518955J2014389J1811734J1005878R773433
2961.2H10657799Q404434P037461N741477M490673L281296K313554J611531J006961
$$ plain form
2977.5 844545186 845069945 845247924 845042706 844384193 843407869 842296124 841058373 839672327 838167667
2995.8 838167667 836608231 834984601 833217859 831377983 829591513 827772081 825785041 823723912
3012.1 823723912 821711779 819742024 817770839 815741181 813627064 811426282 809158683 806894064
3028.5 806894064 804613948 802216291 799750984 797278166 794689476 791989744 789294124 786625326
3044.8 786625326 783963799 781243622 778473556 775720477 772929192 770084798 767200291 764228642
3061.1 764228642 761279285 758410454 755483150 752466500 749372244 746209562 743009150 739793897
3077.4 739793897 736633420 733488381 730330288 727224708 724120080 721010149 717951119 714833200
3093.7 714833200 711571574 708246648 704949260 701795101 698749959 695578218 692247808 688906133
$$ packed form
2977.5H44545186N24759J77979k05218o58513r76324j111745j237751j386046j504660
2995.8H38167667j559436j623630j766742j839876j786470j819432j987040k061129
3012.1H23723912k012133j969755j971185k029658k114117k200782k267599k264619
3028.5H06894064k280116k397657k465307k472818k588690k699732k695620k668798
3044.8G86625326k661527k720177k770066k753079k791285k844394k884507k971649
3061.1G64228642k949357k868831k927304l016650l094256l162682l200412l215253
3077.4G39793897l160477l145039l158093l105580l104628l109931l059030l117919
3093.7G14833200l261626l324926l297388l154159l045142l171741l330410l341675
$$ plain form
3110 688906133 685616076 682334065 679029047 675761342 672580063 669428885 666216493 662947416 659697235
3128.4 659697235 656518221 653371692 650170207 646860540 643530369 640352368 637359142 634392321
3144.7 634392321 631255448 628001153 624793828 621683538 618665159 615664959 612649798 609662175
3161 609662175 606743813 603945851 601222694 598464012 595694244 592975795 590292394 587606370 584968209
3179.4 584968209 582482874 580135643 577852070 575568199 573257983 571017802 568898082 566806793
3195.7 566806793 564765990 562864959 561033309 559241295 557540894 555884659 554314792 552878797
3212 552878797 551449597 549992323 548568547 547308803 546256185 545145690 543956220 543022513 542343318
3230.4 542343318 541669607 540963233 540264785 539551318 538862348 538304746 537896752 537528276 537129581 536767721
$$ packed form
3110F88906133l290057l282011l305018l267705l181279l151178l212392l269077l250181
3128.4F59697235l179014l146529l201485l309667l330171l178001k993226k966821
3144.7F34392321l136873l254295l207325l110290l018379l000200l015161k987623
3161F09662175k918362k797962k723157k758682k769768k718449k683401k686024k638161
3179.4E84968209k485335k347231k283573k283871k310216k240181k119720k091289
3195.7E66806793k040803j901031j831650j792014j700401j656235j569867j435995
3212E52878797j429200j457274j423776j259744j052618j110495j189470r33707o79195
3230.4E42343318o73711p06374o98448p13467o88970n57602m07994l68476l98695l61860
$$ plain form
3250.7 536767721 536473632 536248505 536134720 536096036 536071360 536080539 536200106 536421895 536655843 536902189
3271.1 536902189 537184417 537500978 537822843 538089514 538353801 538729131 539272368 539872348 540369749 540839374
3291.5 540839374 541428924 542120457 542837858 543496311 544086337 544736087 545443177 546176553 546986878 547862828
3311.9 547862828 548725069 549549878 550440669 551404059 552350760 553197742 553935170 554680526 555519342 556409955
3332.3 556409955 557312846 558250129 559206009 560119331 561035752 562082767 563211203 564285636 565291703
3350.7 565291703 566315591 567453682 568741620 570112646 571464598 572850168 574411452 576102495
3367 576102495 577772737 579443336 581228375 583115041 585053265 587060332 589099586 591170549 593295455
3385.3 593295455 595509291 597808361 600052595 602216482 604430854 606845915 609445035 611964285
$$ packed form
3250.7E36767721k94089k25127j13785l8684k4676R179J19567K21789K33948K46346
3271.1E36902189K82228L16561L21865K66671K64287L75330N43237N99980M97401M69625
3291.5E40839374N89550O91533P17401O58453N90026O49750P07090P33376Q10325Q75950
3311.9E47862828Q62241Q24809Q90791R63390R46701Q46982P37428P45356Q38816Q90613
3332.3E56409955R02891R37283R55880R13322R16421J047015J128436J074433J006067
3350.7E65291703J023888J138091J287938J371026J351952J385570J561284J691043
3367E76102495J670242J670599J785039J886666J938224K007067K039254K070963K124906
3385.3E93295455K213836K299070K244234K163887K214372K415061K599120K519250
$$ plain form
3401.7 611964285 614202440 616410077 618910313 621551692 624184191 626921177 629637718 632246077
3418 632246077 634933770 637707353 640510499 643311083 646084785 648855448 651705861 654686153 657692492
3436.3 657692492 660630286 663503706 666400194 669355214 672413886 675647795 678984940 682312906
3452.6 682312906 685573578 688747227 691896915 695063412 698340535 701788843 705249369 708574414
3469 708574414 711772740 715010822 718286574 721597254 725003958 728353918 731527269 734622598 737842739
3487.3 737842739 741232455 744660318 748019516 751311123 754541337 757742286 760968208 764266491
3503.6 764266491 767566442 770887196 774404645 777910829 781132996 784244418 787489772 790704608
3519.9 790704608 793801963 797073901 800533533 803946972 807340741 810761213 814049125 817155540
$$ packed form
3401.7F11964285K238155K207637K500236K641379K632499K736986K716541K608359
3418F32246077K687693K773583K803146K800584K773702K770663K850413K980292L006339
3436.3F57692492K937794K873420K896488K955020L058672L233909L337145L327966
3452.6F82312906L260672L173649L149688L166497L277123L448308L460526L325045
3469G08574414L198326L238082L275752L310680L406704L349960L173351L095329L220141
3487.3G37842739L389716L427863L359198L291607L230214L200949L225922L298283
3503.6G64266491L299951L320754L517449L506184L222167L111422L245354L214836
3519.9G90704608L097355L271938L459632L413439L393769L420472L287912L106415
$$ plain form
3536.3 817155540 820301712 823502719 826500595 829423964 832560837 835861206 839055300 842154860
3552.6 842154860 845273256 848217666 851027429 853892624 856605053 858939111 861490369 864778280
3568.9 864778280 868122995 871067584 873841465 876597941 879265368 881888986 884315729 886324823
3585.2 886324823 888502479 891392231 894148052 896466196 898850262 901393414 903901935 906306982
3601.5 906306982 908539772 910555005 912589729 914768696 916908622 918948293 920870960 922769248
3617.8 922769248 925084829 927744806 930178225 932195783 934035838 936291099 938843131 941358149
3634.1 941358149 943653226 945599258 947465003 949421704 951222956 952652872 954054058 956144750
3650.5 956144750 958580613 960619211 962319672 963978529 965593457 967118144 968571842 969905198
$$ packed form
3536.3H17155540L146172L201007K997876K923369L136873L300369L194094L099560
3552.6H42154860L118396K944410K809763K865195K712429K334058K551258L287911
3568.9H64778280L344715K944589K773881K756476K667427K623618K426743K009094
3585.2H86324823K177656K889752K755821K318144K384066K543152K508521K405047
3601.5I06306982K232790K015233K034724K178967K139926K039671J922667J898288
3617.8I22769248K315581K659977K433419K017558J840055K255261K552032K515018
3634.1I41358149K295077J946032J865745J956701J801252J429916J401186K090692
3650.5I56144750K435863K038598J700461J658857J614928J524687J453698J333356
$$ plain form
3666.8 969905198 971112132 972393751 973655879 974774480 976129830 977614880 978773832 979639769
3683.1 979639769 980435669 981073141 981438100 982059658 983079016 983961701 984488726 984801769 985106707
3701.4 985106707 985472798 985763073 985857964 985889316 986118317 986464262 986770213 987024784 987059236 986915588
3721.8 986915588 986894846 987141192 987662613 988078475 987933099 987468898 987557352 988105416 988400817 988289654
3742.2 988289654 987966597 988023400 988331974 988401175 988389075 988529682 988683164 988829136 989130616 989329755
3762.6 989329755 989161432 989060402 989249349 989514291 989783108 989825964 989566684 989396334 989581883 989803016
3783 989803016 989959598 990225852 990438819 990425766 990277231 990135014 990142226 990276098 990258098 990170419 990117192
3805.4 990117192 990056813 990243137 990525723 990535617 990308344 990202904 990062058 989940047 990227401 990490317
$$ packed form
3666.8I69905198J206934J281619J262128J118601J355350J485050J158952Q65937
3683.1I79639769P95900O37472L64959O21558J019358Q82685N27025L13043L04938
3701.4I85106707L66091K90275R4891L1352K29001L45945L05951K54571L4452j43648
3721.8I86915588k0742K46346N21421M15862j45376m64201Q8454N48064K95401j11163
3742.2I88289654l23057N6803L08574O9201j2100J40607J53482J45972L01480J99139
3762.6I89329755j68323j01030J88947K64942K68817M2856k59280j70350J85549K21133
3783I89803016J56582K66254K12967j3053j48535j42217P212J33872j8000q7679n3227
3805.4I90117192o0379J86324K82586R894k27273j05440j40846j22011K87354K62916
$$ plain form
3825.8 990490317 990600288 990713418 990695953 990691543 990682364 990309596 989947200 990014434 990217090 990345299 990518093
3848.3 990518093 990633667 990351677 989975154 990150809 990493834 990641415 990585268 990444720 990303159 990029573
3868.7 990029573 989710271 989711761 990014613 990392923 990447819 990135789 989856601 989784837 990072608 990348995
3889.1 990348995 990372658 990638077 990933299 990708351 990139604 989640534 989451468 989793420 990414143 990751684
3909.4 990751684 990739346 990618467 990469337 990375161 990383923 990333319 990193069 990266562 990472615 990393698 990209401
3931.9 990209401 990294695 990522146 990611851 990386963 989986062 989855766 990003645 990194082 990459621 990655780
3952.3 990655780 990571856 990406334 990365267 990304530 990232706 990307331 990476012 990550697 990434885 990245461 990086615
3974.7 990086615 990029335 990069032 990108192 990147829 990206957 990186572 990051031 989973009 990038276 990084410 990021050
$$ packed form
3825.8I90490317J09971J13130j7465m410r179l72768l62396O7234K02656J28209J72794
3848.3I90518093J15574k81990l76523J75655L43025J47581n6147j40548j41561k73586
3868.7I90029573l19302J490L02852L78310N4896l12030k79188p1764K87771K76387
3889.1I90348995K3663K65419K95222k24948n68747m99070j89066L41952O20723L37541
3909.4I90751684j2338j20879j49130r4176Q762n0604j40250P3493K06053p8917j84297
3931.9I90209401Q5294K27451Q9705k24888m00901j30296J47879J90437K65539J96159
3952.3I90655780q3924j65522m1067o0737p1824P4625J68681P4685j15812j89424j58846
3974.7I90086615n7280L9697L9160L9637N9128k0385j35541p8022O5267M6134o3360
$$ plain form
3997.1 990021050
$$ packed form
3997.1I90021050
##END=$$ End of the data block
