##TITLE=QTS-PVA $$ Begin of the data block
##JCAMP-DX=5.00 $$ ACD/SpecManager v 10.08
##SPECTROMETER/DATA SYSTEM=Alpha
##DATE=25 Nov 2013 10:34:22
##DATA TYPE=INFRARED SPECTRUM
##DATA CLASS=XYDATA
##ORIGIN=
##OWNER=
##NPOINTS=1667
##FIRSTX=599.57470703
##LASTX=3997.16503906
##MAXX=3997.16503906
##MINX=599.57470703
##MAXY=0.99548692
##MINY=0.43495771
##XFACTOR=1.0000000000
##YFACTOR=1.000000000000000e-9
##FIRSTY=0.43495771
##DELTAX=2.03937006
##XUNITS=1/CM
##YUNITS=ARBITRARY UNITS
##XYDATA=(X++(Y..Y))
599.6 434957713 436309516 438171655 440675974 443704218 447160035 450836778 454043806 456691980
615.9 456691980 459223866 461736560 464382589 467126459 469626069 471837789 473824888 475717157
632.2 475717157 477507055 479024947 480294585 481384367 482071817 482288688 482590169 483767748 486199945
650.6 486199945 489634901 494029880 499317825 504877388 510213912 515279710 519736946 524056673
666.9 524056673 528963208 532950282 536268651 539506197 542555213 545496345 548220873 550768614
683.2 550768614 553364515 555894613 558151364 560352206 562883019 565576494 568101764 570677459
699.5 570677459 573397756 576128483 578788280 581298947 583810031 586534858 589398801 592142880
715.8 592142880 594664931 597096324 599709690 602510691 605382264 608269036 611015975 613682926
732.1 613682926 616436064 619146824 621707201 624164283 626617849 629298925 632200480 635119617
748.4 635119617 637913346 640615165 643335760 646111548 648882866 651533484 654091537 656597674
764.8 656597674 659240603 662045062 664767981 667511523 670384049 673072278 675487041 677866042
781.1 677866042 679997325 681689084 683181882 684623420 686008394 687274694 688493550 689810514
797.4 689810514 691016436 691755354 692010462 692065418 691835165 691027761 689641535 687734187 685817778
815.7 685817778 684518814 683806062 683524549 683642983 683895767 684195876 684727371 685487926 686479032 687796235
836.1 687796235 689411640 691155195 692926347 694757402 696833372 699374437 702471554 706356645
852.5 706356645 711592674 718748391 728077650 739545047 752544582 765848100 778115213 788419425
868.8 788419425 796445727 802221715 805997968 808191001 809113324 808904171 807823896 806240678 804419518
887.1 804419518 802637994 801112592 799848974 798929274 798411369 798105478 797879636 797688723 797397017
905.5 797397017 796594799 794923365 792475939 789527059 786630154 784519911 783284783 782361209 781630874
923.8 781630874 781780064 783195078 785341859 787571311 789492011 790623903 790646017 789785385 788614273
942.2 788614273 787701845 787623882 788901508 791660130 795465708 799558282 803178430 805783093 807332039
960.5 807332039 808092356 808255911 807976007 807252169 806063712 804467440 802328408 799475074 795938075
978.9 795938075 791956961 787693024 783128917 778326035 773327649 768161058 762837112 757206976
995.2 757206976 751209795 744741321 737366438 728685021 718465328 706522346 692831635 677751660
1011.5 677751660 662285089 647847533 635968804 627970278 624258041 624170482 626622856 630605519
1027.8 630605519 635040522 638921201 641736805 643292367 643548906 642694950 641028345 639128983 637765288
1046.2 637765288 637276590 637475669 637973845 638334751 638029337 636728168 634657502 632259130 629726470
1064.6 629726470 627199113 624933422 622963011 621020138 618819654 616130769 612841785 609425008
1080.9 609425008 606584787 604500175 603286862 603293180 604733288 607826710 612801671 619689286 628631234
1099.2 628631234 639776230 652796328 666751385 680234551 691991150 701472223 708730400 714298606
1115.5 714298606 718945920 723089933 726827025 730440557 734356225 738706052 743338943 748018205
1131.9 748018205 752087891 754242003 753291309 749990523 748573244 754677355 770387232 792440176
1148.2 792440176 815242410 834552944 848666608 857803762 863234043 866376996 868239820 869283676
1164.5 869283676 869625866 869390249 868766963 867906272 866920948 865796506 864492238 863183498 861987770
1182.8 861987770 860767841 859387875 857828557 856088638 854173779 852069020 849726796 847177088
1199.2 847177088 844514847 841706038 838525236 834816813 830618203 825854003 820232630 813565731
1215.5 813565731 805816174 796916246 786776006 775408983 763083696 750317872 737628639 725477338
1231.8 725477338 714494586 705318034 698149025 692765176 688879311 686225116 684440792 683268189
1248.1 683268189 682633162 682422280 682536125 683036804 684071422 685811698 688406348 691999853 696740568
1266.5 696740568 702642083 709662437 717753053 726766169 736463487 746552885 756753504 766747594
1282.8 766747594 776110709 784509897 791724563 797503769 801677585 804317474 805697739 806093156
1299.1 806093156 805665851 804563284 803004742 801135242 798985600 796517074 793772399 790894508
1315.4 790894508 787909985 784942150 782288909 780013323 778025568 776336730 774978161 773944080
1331.7 773944080 773082316 772240460 771673977 771983325 773426175 775746882 778613627 781447947 783463597
1350.1 783463597 784064293 782968342 780136526 775866330 770364165 763643980 756364942 748703003
1366.4 748703003 740022004 731184363 723600864 718519986 717491925 720445156 726176023 733132660
1382.7 733132660 739583254 744357586 746502340 745262384 740144193 731093824 719794393 707331717
1399 707331717 695066273 684349298 675203323 669035375 666473746 667090178 670436859 675471783
1415.3 675471783 681560159 689120173 696839035 703888655 710891366 717722833 724574089 731353104
1431.6 731353104 737460375 743551731 750350296 756698787 762638986 768581986 774447739 780549109
1448 780549109 786721289 792369425 797270417 802414775 808958828 814987302 819864094 824783385 829891384
1466.3 829891384 834309042 838129282 842396140 847094774 851529598 855670452 859356523 862561464
1482.6 862561464 865093231 866822362 868041456 869386911 870625734 871010125 870450735 869585216 868815124
1501 868815124 867826939 865559518 861363351 858206391 856084704 853307724 849584579 845218122 840615869
1519.3 840615869 835148036 829452813 824005485 818007648 812088966 805563450 797274530 789700150
1535.7 789700150 782974482 772846758 761113942 752254903 744795620 737923384 731231987 725398064
1552 725398064 720906258 717799962 715509772 715288639 717909455 721794009 726709604 733097494 741442680
1570.3 741442680 750049770 758809865 769884408 781202376 791153550 801125050 811008096 820452213
1586.6 820452213 829278052 837408125 844876409 851715028 857733130 862735152 866842628 870275438
1603 870275438 873120725 875344813 876939476 877830207 878044367 877457500 876061559 874564946 872854114
1621.3 872854114 870435953 867882192 865361571 862712622 860331535 857766330 854406953 851774991
1637.6 851774991 850429296 849268973 847982943 846427262 845382988 845471740 845399618 845363736 846778274
1656 846778274 848604202 850350022 852358341 854873002 857387483 859875202 862869978 865915537 868835151
1674.3 868835151 872039795 874864697 876937091 878444910 879915774 881275296 881870806 881757855 880840540
1692.7 880840540 878255188 874116898 869138539 862318933 856124640 850445271 844184995 839010835
1709 839010835 835116625 832231104 830331862 829700649 830768168 832505226 833983362 835120916 835873246
1727.4 835873246 836353540 837230504 840010524 845982015 853652716 863758922 876511812 890082777
1743.7 890082777 903927326 917536557 930765390 942630470 951190412 956940174 961168468 964083970
1760 964083970 966244400 968039393 969230711 969967544 970623195 971312761 972107649 972921550 973556399
1778.4 973556399 974045753 974457324 974829257 975286067 975677788 975716472 975795448 976245642 976603568 976645827
1798.7 976645827 976686835 977103412 977639616 977900207 977904856 977947295 978168130 978369117 978431404 978510261 978538513
1821.2 978538513 978348613 978231370 978315771 978401780 978684545 979081929 979235709 979266882 979281664 979109108
1841.6 979109108 978845716 978958786 979396582 979769886 980035365 980213284 980254591 980191350 980166793 980238497
1862 980238497 980297506 980120242 979777336 979821742 980261147 980610132 980753005 980812073 980834782 980827630 980792224
1884.4 980792224 980693817 980557978 980601370 980810523 980913401 980948985 981020808 981081128 981116831 981159985 981136560
1906.8 981136560 981013715 980994105 981073916 980989695 980776787 980722308 980754614 980790675 980954945 981078267 981056809
1929.3 981056809 980997801 980916977 980859399 980892599 980872452 980697572 980592310 980692327 980845451 980911136 980906188
1951.7 980906188 980906725 980916858 980926275 980914116 980888128 980832398 980725169 980746746 980928004 981031656 981017470
1974.1 981017470 980975270 980927050 980879128 980804920 980719030 980676830 980598629 980429053 980361760 980488777 980630696
1996.6 980630696 980649292 980520189 980334103 980207741 980151534 980124772 980095685 980029762 979873598 979683220
2017 979683220 979582787 979571760 979564071 979474127 979311287 979178071 979111552 979062319 978987038 978888154 978759170
2039.4 978759170 978579164 978419483 978313923 978216171 978136539 978075266 978003860 977905750 977797031 977669358
2059.8 977669358 977488399 977294087 977196217 977214336 977178037 977017522 976849973 976734221 976662993 976604342
2080.2 976604342 976501882 976399601 976348341 976243436 976030946 975865304 975829184 975773811 975634754 975509703
2100.6 975509703 975428164 975341916 975256622 975188375 975098968 975005925 974936664 974835753 974695385 974549592 974391162
2123 974391162 974278986 974267364 974293172 974270344 974189103 974109352 974018693 973895788 973764598 973627210 973528624
2145.4 973528624 973502994 973508775 973497391 973441482 973393261 973407090 973419309 973420262 973419249 973347962 973245442 973192990
2169.9 973192990 973191082 973207474 973261535 973408997 973544896 973579884 973606288 973644376 973680019 973727405 973739982
2192.3 973739982 973757982 973851323 973936856 973954618 973992348 974091649 974190772 974265218 974345148 974416018 974479020
2214.8 974479020 974569142 974654496 974697411 974748373 974871278 974961519 974940062 974955499 975099981 975260437 975366890
2237.2 975366890 975470483 975546896 975611687 975720167 975808740 975856781 975908875 975967944 976013482 976033270 976034403
2259.6 976034403 976041377 976112545 976266384 976358593 976346076 976379931 976492524 976613224 976690531 976727307 976738811
2282.1 976738811 976773500 976903319 977005899 976959646 976869226 976831198 976845324 976841331 976796746 976802826 976818979
2304.5 976818979 976769745 976675630 976580739 976605952 976785958 976944149 976952195 976952016 977085292 977341831 977620900
2326.9 977620900 977710903 977741659 977999985 978342533 978578866 978701949 978692591 978480220 978118896 977852285
2347.3 977852285 977810562 978052676 978553772 979060292 979380071 979388952 979219258 979110062 978944302 978704989
2367.7 978704989 978392065 977984011 977718532 977634847 977549791 977511883 977593541 977710128 977797925 977871954 977915168
2390.2 977915168 977878869 977823436 977806032 977785945 977721095 977639258 977635741 977678299 977632761 977538228 977517605 977534592
2414.6 977534592 977486253 977373779 977272213 977244854 977276146 977266848 977205873 977162004 977138817 977116227 977032125
2437.1 977032125 976879597 976791382 976791263 976764500 976684570 976602077 976553261 976537824 976471543 976327062 976201355
2459.5 976201355 976143777 976137221 976109147 975983560 975827396 975732028 975680649 975641847 975556493 975358784 975126028
2481.9 975126028 974947035 974831045 974766731 974690080 974590659 974451721 974247038 974069655 973939002 973834574
2502.3 973834574 973768115 973693192 973567963 973409534 973313808 973273516 973177552 973049939 972948134 972899497 972894669
2524.8 972894669 972815692 972617567 972411990 972287238 972224951 972179532 972127199 972064197 971946955 971737683
2545.1 971737683 971566737 971538782 971540689 971433818 971243143 971087217 971001685 970980287 970973551 970888913 970717192
2567.6 970717192 970514059 970327795 970161200 970043302 970004678 969943941 969722331 969394326 969182491 969115794
2588 969115794 968996823 968729079 968423665 968192518 967973828 967698276 967398643 967109203 966812134 966500103
2608.4 966500103 966204524 965907097 965569139 965192974 964851201 964531302 964129090 963724732 963404059 963123441
2628.8 963123441 962803721 962397099 961982369 961586654 961190760 960850239 960489511 960018039 959589124 959293962
2649.2 959293962 959022045 958711505 958364666 957960665 957525671 957183897 956927180 956608355 956227481 955858946
2669.5 955858946 955546737 955298722 955030084 954739690 954491675 954251349 953978300 953673780 953412414 953210533
2689.9 953210533 952939451 952613473 952365994 952170610 951951921 951706469 951427996 951137185 950873673 950660348
2710.3 950660348 950431347 950116515 949828744 949562192 949139893 948617995 948154151 947711945 947256744 946842670
2730.7 946842670 946461439 946090400 945684075 945183992 944671810 944268525 943910122 943500817 943133295 942860842
2751.1 942860842 942604303 942335963 942021906 941626370 941253603 940946221 940598428 940223157 939900756 939601302
2771.5 939601302 939266562 938897491 938487113 937999487 937483966 937005043 936544716 936037958 935410202 934661329
2791.9 934661329 933853865 933065295 932306409 931449115 930413008 929245889 928035617 926879048 925769389
2810.3 925769389 924582005 923245966 921833754 920440912 919089735 917780697 916539490 915341973
2826.6 915341973 914088726 912743688 911333561 909901381 908502460 907154560 905826330 904509306
2842.9 904509306 903255761 902036071 900656998 898920715 896979332 895259678 893952489 892987967
2859.2 892987967 892234087 891518474 890712857 889768064 888692915 887594461 886547863 885519862 884423673
2877.6 884423673 883101285 881450474 879477620 877181172 874443173 871140718 867313206 863084316
2893.9 863084316 858622432 854101598 849780798 845929861 842568576 839772880 837780714 836571813
2910.2 836571813 835900426 835626245 835586429 835466504 835142732 834657013 833959103 832991779 831760228 830313921
2930.6 830313921 828758180 827205420 825763702 824639261 824043691 824249327 825742900 828867733 833540738
2948.9 833540738 839377344 845915198 852738798 859376013 865429044 870847523 875688553 879848301
2965.2 879848301 883188367 885741770 887700975 889239490 890437603 891272843 891801059 892125428 892239451
2983.6 892239451 892173469 891958535 891588628 891127110 890628636 890088856 889493048 888768017 887925565 887114644
3004 887114644 886306524 885346174 884237468 883103669 881982684 880838871 879644036 878412366 877192497
3022.3 877192497 875963688 874755025 873543322 872168303 870670319 869216442 867836714 866469145
3038.7 866469145 865037978 863501906 861886203 860213697 858550727 856952488 855276406 853452742
3055 853452742 851683140 850066900 848449290 846697330 844811141 842905223 841119111 839441180 837727666
3073.3 837727666 835868716 833867431 831815720 829846025 827948749 826025784 824146032 822376788
3089.6 822376788 820570886 818599999 816567004 814597964 812646806 810666323 808719456 806763470
3106 806763470 804755270 802746952 800701737 798643410 796621799 794631660 792700827 790767848 788787484
3124.3 788787484 786810815 784812748 782741904 780643582 778602600 776570976 774434268 772265553
3140.6 772265553 770200551 768220782 766227961 764143407 762032151 760026217 758074522 756114542
3156.9 756114542 754120708 752062678 750037551 748087108 746156454 744230568 742327690 740463436
3173.3 740463436 738621116 736776412 734946668 733170688 731502652 729949713 728373289 726670921
3189.6 726670921 724971950 723461926 722057402 720582664 719130635 717809796 716540456 715254962
3205.9 715254962 713966072 712711155 711477816 710270882 709160149 708143234 707208872 706344247 705453694
3224.2 705453694 704537213 703668833 702823460 702005982 701290548 700677454 700118959 699582100 699047148 698497355
3244.6 698497355 697955489 697541535 697288513 697024345 696698010 696414530 696181476 695980012 695827782 695691645
3265 695691645 695548773 695497334 695555568 695596278 695623875 695690274 695755541 695836306 695970774 696161211 696380258
3287.5 696380258 696587205 696821511 697124481 697432578 697743356 698099732 698456883 698853791 699274838 699598432
3307.8 699598432 699878812 700307071 700880170 701411366 701889217 702341914 702745974 703118622 703502595 703962088
3328.2 703962088 704438925 704865158 705234349 705534637 705814838 706166685 706689596 707329333 707941711 708542526
3348.6 708542526 709120989 709651232 710282564 711052716 711832762 712575734 713258564 713985503 714953482 716039956
3369 716039956 717031896 717993140 719069958 720256209 721489370 722750068 723975956 725170493 726516724
3387.4 726516724 727997541 729394376 730770051 732225955 733704150 735253274 736867368 738439798
3403.7 738439798 739968240 741486013 743036211 744676530 746465087 748331249 750095189 751782596
3420 751782596 753542602 755414188 757330894 759245813 761123598 763000190 764950037 766893923 768756032
3438.4 768756032 770629764 772625208 774663508 776725233 778887570 781041622 783134162 785256982
3454.7 785256982 787399828 789507627 791599274 793728232 795816481 797889411 800180018 802519202
3471 802519202 804615498 806608677 808785319 811141014 813459933 815703452 817877650 819980919 822161734
3489.3 822161734 824421704 826585233 828638256 830714047 832839847 834948599 837202013 839547276
3505.7 839547276 841733158 843963444 846405208 848846257 851022303 852979779 854972124 857046604
3522 857046604 859181821 861438155 863769352 866084039 868318319 870460033 872634947 874948740 877273142
3540.3 877273142 879276335 881004333 882999718 885340750 887547195 889586926 891733229 893883646
3556.6 893883646 895923674 897948802 899856806 901427746 903042793 905281305 907738984 909915149
3573 909915149 911933541 913907468 915762663 917595625 919352233 920696020 922039390 924207389 926480532
3591.3 926480532 928180754 929740369 931474566 933228254 935014367 936797202 938194692 939352274
3607.6 939352274 940848470 942563891 944196463 945711851 947076082 948704779 950733304 952558160
3623.9 952558160 953763187 954697013 956455410 958640993 960519135 962238729 963827074 965272605
3640.3 965272605 966548502 967424750 967905998 968705952 970529437 972576141 974116802 975538194 977098346
3658.6 977098346 978418350 979355216 980123222 980799735 981334567 982083261 983011484 983835816 984875917
3677 984875917 986014366 986999512 987849414 988435924 988629937 988771141 989410222 990176916 990625024 990876377
3697.4 990876377 991050124 991201162 991473198 991763055 991864383 991773188 991681635 991896629 992331982 992687225
3717.7 992687225 992826223 992775500 992714107 992845416 993238688 993530631 993288040 992801845 992802501 993215859
3738.1 993215859 993435204 993206322 992797673 992854476 993162751 993267059 993322372 993487775 993534803 993550897
3758.5 993550897 993933082 994416535 994539380 994345844 994152725 994330525 994668603 994709611 994568944 994606078
3778.9 994606078 994876444 995039821 995063305 995160520 995276451 995283782 995093584 994833529 994797647 994740903 994390130
3801.4 994390130 994219542 994262695 994394779 994754493 995064735 995080829 994904459 994852364 994694352 994253874
3821.8 994253874 994066894 994263828 994685590 995029390 994998455 994750500 994472027 994178116 994149148 994398654
3842.1 994398654 994621277 994740069 994827628 994703829 994108379 993821383 994291186 994655132 994702637 994579375
3862.5 994579375 994550526 994615972 994459689 994207799 994189441 994499743 994815409 994625628 994320512 994376898
3882.9 994376898 994498551 994684339 994770288 994637549 994789243 995090783 995018244 994542778 993893683 993612170
3903.3 993612170 994147539 995024741 995486915 995388627 994981050 994554579 994533479 994928360 995177865 995091915
3923.7 995091915 994981468 994973958 994867504 994708061 994740903 994925380 995046318 994963348 994789660 994728327
3944.1 994728327 994664967 994579971 994715869 994954526 995013952 994956136 994958401 995044231 995179296 995294988 995299041
3966.5 995299041 995191932 995056152 995008647 995029211 994971335 994851708 994749546 994685590 994726539 994856596
3986.9 994856596 994982541 995056629 995044827 995037794 995114803
3997.1 995114803
##END=$$ End of the data block
