##TITLE=QTS-PVA $$ Begin of the data block
##JCAMP-DX=5.00 $$ ACD/SpecManager v 10.08
##SPECTROMETER/DATA SYSTEM=Alpha
##DATE=17 Apr 2014 09:51:36
##DATA TYPE=INFRARED SPECTRUM
##DATA CLASS=XYDATA
##ORIGIN=
##OWNER=
##NPOINTS=1667
##FIRSTX=599.57470703
##LASTX=3997.16503906
##MAXX=3997.16503906
##MINX=599.57470703
##MAXY=0.99133575
##MINY=0.29602438
##XFACTOR=1.0000000000
##YFACTOR=1.000000000000000e-9
##FIRSTY=0.29602438
##DELTAX=2.03937006
##XUNITS=1/CM
##YUNITS=ARBITRARY UNITS
##XYDATA=(X++(Y..Y))
599.6B96024382J751214J822114J839102J967191J605958J161277J450867J771003
615.9C09393108K071381K762645L095686L155888L191500K770216K259522K085984
632.2C30785930J592696O35445j460N6475K74479M78209J143723J971126K806753L937959
652.6C43681335M833580N268603N886823O104201N393922M302770M332036N279362
668.9C85082632M107744L433019L587007L352434L133118L109455L066599K954483
685.2D11826491K851367K882839L079265L191560L064335K841741K851277L086001
701.5D35674876L231466L030062K865433L104031L250182L103435L011286L143549
717.9D60414320L288985L246277L200263L247708L163129L202647L377616L454149
$$ y = [296024382, 297775596, 299597710, 301436812, 303404003, 305009961, 306171238, 307622105, 309393108, 311464489, 314227134, 317322820, 320478708, 323670208, 326440424, 328699946, 330785930, 332378626, 333014071, 333012611, 333069086, 333343565, 333821774, 334965497, 336936623, 339743376, 343681335, 348514915, 353783518, 359670341, 365774542, 371168464, 375471234, 379803270, 385082632, 389190376, 392623395, 396210402, 399562836, 402695954, 405805409, 408872008, 411826491, 414677858, 417560697, 420639962, 423831522, 426895857, 429737598, 432588875, 435674876, 438906342, 441936404, 444801837, 447905868, 451156050, 454259485, 457270771, 460414320, 463703305, 466949582, 470149845, 473397553, 476560682, 479763329, 483140945, 486595094]
734.2D86595094L501326L344119L179431L156900L248781L453135L506482L375948
750.5E13361216L294050L265083L216684L214598L323316L448069L429115L454983
766.8E40007114L540814L489018L305077L213942L289402L340363L296733L064812
783.1E66547275K774238K632260K426088K101004J864732J512587R97484M09722m71234
801.5E80794156j518608k347946l120064m179299n125642n362511m767477l480494
817.8E50892115j948834q79645k78533R5129K57790N70298R57906J146734J382172
836.1E52195132J661479J735211J809060K090276K510249L088594L988325N519927
852.5E74598253P958233J1193574J4851570J8422067K0868122K1415592K0129144J7279625
$$ y = [486595094, 490096420, 493440539, 496619970, 499776870, 503025651, 506478786, 509985268, 513361216, 516655266, 519920349, 523137033, 526351631, 529674947, 533123016, 536552131, 540007114, 543547928, 547036946, 550342023, 553555965, 556845367, 560185730, 563482463, 566547275, 569321513, 571953773, 574379861, 576480865, 578345597, 579858184, 580855668, 581265390, 580794156, 579275548, 576927602, 573807538, 569628239, 564502597, 559140086, 554372609, 550892115, 548943281, 548063636, 547785103, 547880232, 548138022, 548708320, 549666226, 550812960, 552195132, 553856611, 555591822, 557400882, 559491158, 562001407, 565090001, 569078326, 574598253, 582556486, 593750060, 608601630, 627023697, 647891819, 669307411, 689436555, 706716180]
868.8G06716180J3422251R345948N735457K934277R12428m80175j393080j993894k306760
887.1G32892632k293825k012968j587808j195431r69588r67086j178324j618564k275586
905.5G18793452l224313m627347n897522n723060l577411n14924J757621K647162L055155
923.8G02688813L802002M889965N963146O536365O336391N648673M784345L699124
940.1G44348824K665579K074600J776576J545429J299500R33707N41270J71542l34561
958.5G55022466q07524j051187j230776j475454j813948k262533k734661l088116l384531
976.9G37173736l763616m218280m610122m877090n123317n418599n787253o132245
993.2F97243214o466747o916821p391214p912815q682191r722531j0925233j2147784
$$ y = [706716180, 720138431, 729484379, 735219836, 738154113, 739066541, 738586366, 737193286, 735199392, 732892632, 730598807, 728585839, 726998031, 725802600, 724833012, 723865926, 722687602, 721069038, 718793452, 715569139, 710941792, 705044270, 699321210, 695743799, 695228875, 696986496, 699633658, 702688813, 706490815, 711380780, 717343926, 723880291, 730216682, 735865355, 740649700, 744348824, 747014403, 749089003, 750865579, 752411008, 753710508, 754644215, 755185485, 755357027, 755022466, 754214942, 753163755, 751932979, 750457525, 748643577, 746381044, 743646383, 740558267, 737173736, 733410120, 729191840, 724581718, 719704628, 714581311, 709162712, 703375459, 697243214, 690776467, 683859646, 676468432, 668555617, 659873426, 650150895, 639225662, 627077878]
1009.5F27077878j3062001j3169110j2147843j0067344p361472m682719k603651j466035
1025.8E62517703j256288j702368k590716l598809m357159m851043n097807n002022
1042.1E34061491m716694m305720l764034l437101l449858l735542m373193n115449
1058.4E01163900n682618n956023n717576n034745m189253l472000l353208l967911
1074.7D63790566m944921n754113n804598m942388l511429j779019L53545K900064
1091.1D40307707N608618Q455872J1626453J5191972J8851757K1994054K3816347K3362160
1107.4E69214940K0413280J6194105J2245357R239018P123589N748809M862785M239798
1123.7F49281681M035532M145861M008114L091216O19769m412174j1414111j5909254
$$ y = [627077878, 614015877, 600846767, 588698924, 578631580, 571270108, 566587389, 563983738, 562517703, 561261415, 559559047, 556968331, 553369522, 549012363, 544161320, 539063513, 534061491, 529344797, 525039077, 521275043, 517837942, 514388084, 510652542, 506279349, 501163900, 495481282, 489525259, 483807683, 478772938, 474583685, 471111685, 467758477, 463790566, 458845645, 453091532, 447286934, 442344546, 438833117, 437054098, 437407643, 440307707, 445916325, 454372197, 465998650, 481190622, 500042379, 522036433, 545852780, 569214940, 589628220, 605822325, 618067682, 627306700, 634430289, 640179098, 645041883, 649281681, 653317213, 657463074, 661471188, 664562404, 665182173, 660769999, 649355888, 633446634]
1140F33446634j0794759N877793K5849342L8511336M0254355L4067451K4752439J5764415
1156.3H07729006Q874297M610300K291739R72033J44839l21508m55737n14030o74248
1174.7H22656691q06868q03411p85530q12530q40843q72016r28283j059770j219034
1193H14528406j333118j399994j474321j483440j380205j316190j325488j395881j533628
1211.4H01886141j608133j590014j646339j767636j962006k337515k778828l193260
1227.7G85002410l529727l555238k927661j541257J56402J608193K604306L040493
1244G80857921K835929K158940J363039O33240l2664o28769j138747j548588j854479
1262.4G82645822k116681k432048k758860k954841l048241l272414l600955l820658
$$ y = [633446634, 622651875, 628529668, 654379010, 692890346, 733144701, 767212152, 791964591, 807729006, 816603303, 821213603, 823505342, 824477375, 824622214, 824300706, 823844969, 823330939, 822656691, 821849823, 821046412, 820260882, 819448352, 818607509, 817735493, 816807210, 815747440, 814528406, 813195288, 811795294, 810320973, 808837533, 807457328, 806141138, 804815650, 803419769, 801886141, 800278008, 798687994, 797041655, 795274019, 793312013, 790974498, 788195670, 785002410, 781472683, 777917445, 774989784, 773448527, 773604929, 775213122, 777817428, 780857921, 783693850, 785852790, 787215829, 787849069, 787816405, 787187636, 786048889, 784500301, 782645822, 780529141, 778097093, 775338233, 772383392, 769335151, 766062737, 762461782, 758641124]
1278.7G58641124l915370l998339m161835m369616m588664m771888m944742n125344
1295G22765326n232214n261839n197346n036116m842460m722535m720092m797459m917085
1313.4F78038180m978418m928709m674017m142761l460229k655148j785338j007855
1329.7F50405705l73602J74999Q06988J766860L174901M717112O043255P117271P675171
1348F81508660P420004O371975N019605L738642K509296J241981q7559j444995k854347
1366.4G03423262m458070n829871o791413p205903o002248m000306k305865j115739
1382.7F65713847j016498k536178n404770q422196j2227535j6955137j9234360j9712448
1399E80204725j8354654j5015185j1944652p563531k570450J740455N152643P238925
$$ y = [758641124, 754725754, 750727415, 746565580, 742195964, 737607300, 732835412, 727890670, 722765326, 717533112, 712271273, 707073927, 702037811, 697195351, 692472816, 687752724, 682955265, 678038180, 673059762, 668131053, 663457036, 659314275, 655854046, 653198898, 651413560, 650405705, 650032103, 650207102, 651014090, 652780950, 655955851, 660672963, 666716218, 673833489, 681508660, 688928664, 695300639, 700320244, 704058886, 706568182, 707810163, 707722604, 706277609, 703423262, 698965192, 693135321, 686343908, 679138005, 673135757, 669135451, 666829586, 665713847, 664697349, 662161171, 656756401, 648334205, 636106670, 619151533, 599917173, 580204725, 561850071, 546834886, 534890234, 527326703, 524756253, 526496708, 531649351, 538888276]
1415.3E38888276R059071J1491954J1171639J0013998J0097802R688973R457171Q796573
1431.6F18665457P314145O986440P168352N916119N372464N581856N881965O496907
1448F69383705O774366O516158O189346P186473Q907735P554293O400823P309497Q010089
1466.3G34232485P243753P035196Q350610Q840740P919133P237792O781935O410480
1482.6G94052124N572975M707813M163563L680408K683938J614153P33435n3882m73500
1501H16681027p73131j775623l910363l895401l157855l610491m474938n325735n686760
1519.3G84070730o820261p376910p126927p938027p921398q212626j0172427r631574
1535.7G18870580q336246j1704802j3595760j0572672r020567q107781p630349o536305
$$ y = [538888276, 547947347, 559439301, 570610940, 580624938, 590722740, 600411713, 609868884, 618665457, 625979602, 632966042, 640134394, 646050513, 651422977, 657004833, 662886798, 669383705, 676158071, 682674229, 688863575, 696050048, 704957783, 712512076, 718912899, 726222396, 734232485, 741476238, 748511434, 756862044, 765702784, 773621917, 780859709, 787641644, 794052124, 799625099, 804332912, 808496475, 812176883, 814860821, 816474974, 817208409, 817154527, 816681027, 815907896, 814132273, 810221910, 806326509, 803168654, 799558163, 795083225, 789757490, 784070730, 777250469, 769873559, 762746632, 754808605, 746887207, 738674581, 728502154, 718870580, 710534334, 698829532, 685233772, 674661100, 665640533, 657532752, 649902403, 643366098]
1552F43366098m903614l106177j204789J510322L397286N081475O964445R066344J1663675
1570.3F71835065J1436462J1608780J5232801J5102685J2853741J3057649J3006270
1584.6G64133453J2271881J1315704J0320067R365499Q463800P422447O306291N328834
1600.9H34927976M370749L359676K454936J718223R09507K06054n78344j622558j894712
1619.3H43851507j989186k739966k963543k831876k977312k703070k560974l181457
1635.6H21904123k836347j686036j271248j033008q61526n01454P4208L43621J021206
1653.9H15153539J777351K029181K318263K857983L400683L360689L652215M459023
1670.3H39008927M403472M549027N078792M651070M195213M514218N874932N447626
$$ y = [643366098, 638462484, 635356307, 634151518, 635661840, 639059126, 644140601, 651105046, 660171390, 671835065, 683271527, 694880307, 710113108, 725215793, 738069534, 751127183, 764133453, 776405334, 787721038, 798041105, 807406604, 815870404, 823292851, 829599142, 834927976, 839298725, 842658401, 845113337, 846831560, 847741067, 847947121, 847368777, 845746219, 843851507, 841862321, 839122355, 836158812, 833326936, 830349624, 827646554, 825085580, 821904123, 819067776, 817381740, 816110492, 815077484, 814215958, 813714504, 813788712, 814132333, 815153539, 816930890, 818960071, 821278334, 824136317, 827537000, 830897689, 834549904, 839008927, 843412399, 847961426, 853040218, 857691288, 861886501, 866400719, 872275651, 877723277]
1686.6H77723277M333555M508853M138172L876686L967822L770053M156172L627181
1702.9I10101771L005982L137409K958000K731621K561450K459169K884030L149927
1719.2I32989359K653837K296209K255500K049744J791537J546561J652897J955092
1735.5I49190736J678586J455009J293540J149833J144469J138329J105964J163781
1751.8I59320247R99808O94216O25849O38186O56844P26998N88476L77298L83138M43697
1772.2I65454757M69089M76002L95954L06130L28600L17276K87771K69711J56820J86145
1792.6I68648255L39806L60608K34485J73986L13341L30031J62542K6345O3479J84059
1813I70836937J52588J00255J75834J39773m0591j16289k0980P0989J71065J88410
$$ y = [877723277, 882056832, 886565685, 890703857, 894580543, 898548365, 902318418, 906474590, 910101771, 913107753, 916245162, 919203162, 921934783, 924496233, 926955402, 929839432, 932989359, 935643196, 937939405, 940194905, 942244649, 944036186, 945582747, 947235644, 949190736, 950869322, 952324331, 953617871, 954767704, 955912173, 957050502, 958156466, 959320247, 960320055, 961014271, 961640120, 962278306, 962935150, 963662148, 964250624, 964627922, 965011060, 965454757, 965923846, 966399848, 966795802, 967101932, 967430532, 967747808, 968035579, 968305290, 968462110, 968648255, 968988061, 969348669, 969583154, 969757140, 970070481, 970400512, 970563054, 970589399, 970652878, 970836937, 970989525, 971089780, 971265614, 971405387, 971364796, 971248507, 971227527, 971298516, 971469581, 971657991]
1833.4I71657991P7963M6969M6372m0531q8692R7871K58565K21670J63078J08957P8619
1855.9I72628832Q8870P9036K2829p4566k00689j40428J31428K23696J54436Q0168
1876.2I72993612p093l4153L8743J08480P9632l4928p3195l4570o5089m1723O0320
1898.7I72990036P3731J6630P331l2842j02818j7941R4712Q94j81794j53423k1696
1921.1I72672820L0398Q5295N4776o5148j11699l5941K2709Q881o7651j77920r6261
1943.5I72320259J40547K05219P3075m9829n0843M6075J09672M7743R954M8340P15
1966I72900927m6551O318L6597K3961O259j7584q5652j22606m411J01030k6822j73748
1990.5I72597718o6399Q6307N6148k1994k6167n6803r3579o8963p8797j06335j08480
$$ y = [971657991, 971735954, 971782923, 971829295, 971788764, 971700072, 971797943, 972056508, 972278178, 972441256, 972550213, 972628832, 972717702, 972796738, 972819567, 972745001, 972544312, 972403884, 972535312, 972759008, 972913444, 972993612, 972986519, 972952366, 972991109, 973099589, 973179221, 973144293, 973071098, 973036528, 972971439, 972929716, 972990036, 973063767, 973080397, 973087728, 973054886, 972952068, 972934127, 973028839, 973029733, 972847939, 972694516, 972672820, 972703218, 972788513, 972843289, 972778141, 972666442, 972630501, 972653210, 972662091, 972594440, 972416520, 972320259, 972460806, 972666025, 972739100, 972689271, 972638428, 972684503, 972794175, 972841918, 972851872, 972900212, 972900927, 972854376, 972860694, 972897291, 972921252, 972927511, 972909927, 972824275, 972701669, 972697258, 972798288, 972771466, 972597718, 972531319, 972617626, 972673774, 972651780, 972625613, 972568810, 972475231, 972406268, 972327471, 972221136, 972112656]
2012.9I72112656j23680j24276r7871r5844j13547q4340j7941l0339j60873k50995
2033.3I71012950j87814j21177j40130j44839j17183j23322j64926k03788k45512k26438
2053.7I69337821j37985j02639j22607j46329j83344k02835j53184q4340j30832k45989
2074.1I67827737k33888j22726q6189j56581j81794j58191k12431k53081k11179j75000
2094.5I66036677j82092j75774j66893j55806j32323j55091j72734j62781j52707j42514
2114.9I64437962j35303j10507j26719k12431k00868j02818j01686r2148n4896j05143
2135.2I63195443j35958j21594j16825q6307o4373o7413m5836k8610m1247m5359l0756
2157.7I62411165O438L7729j8894j05679q5354j431L2366L0636M6909M7565J1325J3232
$$ y = [972112656, 971988976, 971864700, 971766829, 971670985, 971557438, 971473098, 971455157, 971424818, 971263945, 971012950, 970825136, 970703959, 970563829, 970418990, 970301807, 970178485, 970013559, 969809771, 969564259, 969337821, 969199836, 969097197, 968974590, 968828261, 968644917, 968442082, 968288898, 968204558, 968073726, 967827737, 967593849, 967471123, 967384934, 967228353, 967046559, 966888368, 966675937, 966422856, 966211677, 966036677, 965854585, 965678811, 965511918, 965356112, 965223789, 965068698, 964895964, 964733183, 964580476, 964437962, 964302659, 964192152, 964065433, 963853002, 963652134, 963549316, 963447630, 963355482, 963300586, 963195443, 963059485, 962937891, 962821066, 962734759, 962670386, 962602973, 962557137, 962528527, 962487280, 962441921, 962411165, 962417603, 962455332, 962436438, 962330759, 962245405, 962243974, 962276340, 962306976, 962353885, 962401450, 962412775, 962426007]
2182.2I62426007N9783O4552L9101K4497J4723L6954R2328P7188J2040N2512J32739
2204.6I63032424J43409J31488Q4937K8848O0797J24574J22249P9095N8890R8228J31071
2227I64096010Q2433J6272K4676O5208J06752J51515J11758J0968J1444J18136J44005
2249.4I64939177J10507R1732l636m8459O2585J41680O6757N007O0201J02997Q3208
2271.9I65611756R3281J27375J19865J09136N1678j0193M4286J09136R5010O5565L4988
2294.3I66451883m351J8418O1989N5730J5080l57K0980l6537q7738N6803K31445J84953
2318.8I66968298r239o0439J64688L10302K00092J52707J26005Q404N5790K39253J89304
2341.2I68345165k34425n95987l38852J07944L18885L57091K39611J16527L3259k04086
$$ y = [962426007, 962485790, 962550342, 962589443, 962613940, 962628663, 962665617, 962757945, 962835133, 962847173, 962899685, 963032424, 963175833, 963307321, 963392258, 963421106, 963481903, 963606477, 963728726, 963807821, 963866711, 963964939, 964096010, 964178443, 964194715, 964219391, 964284599, 964391351, 964542866, 964654624, 964665592, 964677036, 964795172, 964939177, 965049684, 965141416, 965137780, 965089321, 965151906, 965293586, 965360343, 965365350, 965425551, 965528548, 965611756, 965705037, 965832412, 965952277, 966061413, 966113091, 966102898, 966147184, 966256320, 966351330, 966416895, 966451883, 966447532, 966465950, 966527939, 966583669, 966598749, 966598392, 966619372, 966582835, 966495097, 966551900, 966783345, 966968298, 966959059, 966898620, 967063308, 967373610, 967573702, 967726409, 967852414, 967860818, 967916608, 968155861, 968345165, 968110740, 967514753, 967175901, 967283845, 967602730, 967959821, 968199432, 968315959, 968349218, 968145132]
2361.6I68145132k40803P8440L5048l84212m49240k39432j45555j19865l1650K3485
2382I66671348j3948m1902r3400j10627R537M7207o0201r9361k9623k0504j03951j36315
2406.5I66018260j14143j44899j90258j34945p4148q8692j44720k01345j68264m8458
2426.9I64708388M0233p093j02758j30117j23978j14679p3076l7670p5757j01626j05322
2449.3I63876545j79767k58804k31206j14620m4465j09553k13087k31802j74284j01745
2469.7I62217212j56462k84970k33114j62184k63989k96593k31326k56657l06547k84850
2490.1I59740520k56956k84255k94983k34962j72138j85311k84433l21925k40445k14994
2510.5I57250118k28107j81198j85072k73884l06844k27690j80185k17855k07603j35183
$$ y = [968145132, 967904329, 967982769, 968017817, 967633605, 967184365, 966944933, 966799378, 966679513, 966647863, 966671348, 966657400, 966615498, 966522098, 966411471, 966421008, 966468215, 966408014, 966308653, 966279030, 966258526, 966154575, 966018260, 965904117, 965759218, 965568960, 965434015, 965359867, 965271175, 965126455, 964925110, 964756846, 964708388, 964748621, 964741528, 964638770, 964508653, 964384675, 964269996, 964196920, 964159250, 964083493, 963981867, 963876545, 963696778, 963437974, 963206768, 963092148, 963047683, 962938130, 962725043, 962493241, 962318957, 962217212, 962060750, 961775780, 961542666, 961380482, 961116493, 960819900, 960588574, 960331917, 960025370, 959740520, 959483564, 959199309, 958904326, 958669364, 958497226, 958311915, 958027482, 957705557, 957465112, 957250118, 957022011, 956840813, 956655741, 956381857, 956075013, 955847323, 955667138, 955449283, 955241680, 955106497]
2530.9I55106497j53601k39373k00033j09672j46926k30610k18272j40429p3850n2929
2551.3I53540802r6679j86443k20060j56820j53780k17259k47657k30194j61349j45495
2571.7I51725066k03491k38239k34545k45750l50415m36068l33607k63751l78072m25279
2592.1I48615849l74436m03881m65453m73797n02050n57840n90503n71907n49376n99980
2612.4I43526626o49095o48737o42240o68585o61135n64158n55277o83009p30157o42419
2632.8I37081814o20008o82175o87659o50942o32107o08087n22673m65393n61833o77407
2653.2I30973530o44446n51402n54323n70774n08309n05268n67139n29408m08530l93212
2673.6I25740719m81427m77195m11451l86714m06445m46915m55558l99292k89142k10106
$$ y = [955106497, 954952896, 954713523, 954513490, 954403818, 954256892, 954026282, 953808010, 953667581, 953593731, 953540802, 953444123, 953257680, 953037620, 952880800, 952727020, 952509761, 952262104, 952031910, 951870561, 951725066, 951521575, 951283336, 951048791, 950803041, 950452626, 950016558, 949682951, 949419200, 949041128, 948615849, 948241413, 947837532, 947372079, 946898282, 946396232, 945838392, 945247889, 944675982, 944126606, 943526626, 942877531, 942228794, 941586554, 940917969, 940256834, 939692676, 939137399, 938454390, 937724233, 937081814, 936461806, 935779631, 935091972, 934441030, 933808923, 933200836, 932678163, 932212770, 931650937, 930973530, 930329084, 929777682, 929223359, 928652585, 928144276, 927639008, 927071869, 926542461, 926133931, 925740719, 925259292, 924782097, 924370646, 923983932, 923577487, 923130572, 922675014, 922275722, 921986580, 921776474]
2694I21776474k75791m42624n29886n03778m08232l36290l67462m56214n15104m72545
2714.4I17468548m67777n46992o18696o64771o50764o30557o51300o90818p53879q45016
2734.8I10947978q36610p66397p83443p33853o24895o30736o47128n92470n61356n75960
2755.2I04195130n68986n26011n10395m88042m16637m42326n96285p24435p51435o59764
2775.6H98510814n59032o27697p91490r03249r84251j029253j059055j213551j459956
2793.9H89883280j617968j591742j538873j741469k070606k275467k374589k429485
2810.3H74243081k436877k394497k398610k450586k369642k238333k325416k394974
2826.6H55234146k253353k191008k275347k388537k455712k428293k445876k618194
$$ y = [921776474, 921500683, 921058059, 920528173, 920024395, 919616163, 919279873, 918912411, 918456197, 917941093, 917468548, 917000771, 916453779, 915835083, 915170312, 914519548, 913888991, 913237691, 912546873, 911792994, 910947978, 910111368, 909344971, 908561528, 907827675, 907202780, 906572044, 905924916, 905332446, 904771090, 904195130, 903626144, 903100133, 902589738, 902101696, 901685059, 901242733, 900646448, 899922013, 899170578, 898510814, 897951782, 897324085, 896532595, 895629346, 894645095, 893615842, 892556787, 891343236, 889883280, 888265312, 886673570, 885134697, 883393228, 881322622, 879047155, 876672566, 874243081, 871806204, 869411707, 867013097, 864562511, 862192869, 859954536, 857629120, 855234146, 852980793, 850789785, 848514438, 846125901, 843670189, 841241896, 838796020, 836177826]
2842.9H36177826k789259k798975k472460j922607j621723j546026j389086j199663
2859.2H20438027j173436j246453j270473j364588j576424j785636j949012k060235
2875.5H08011770k254605k716780l345966m063249m914999n864799o808638p697046
2891.8G70345688q434773q715629q412540p598818o419479n021096l438770j866699
2908.1G20437884n90145K96354R09507J318813J434862J150191M19319n42999j456737
2926.5G23377049k346396l072680l457427l583014l288328k480030j263500N31376
2942.8G04417050L116250O297707R460271J1954129J3439476J3923049J3616502J2710333
2959.1G88934767J1351466R680927P978618O624401N422175M060745K867639K031267
$$ y = [836177826, 833388567, 830589592, 828117132, 826194525, 824572802, 823026776, 821637690, 820438027, 819264591, 818018138, 816747665, 815383077, 813806653, 812021017, 810072005, 808011770, 805757165, 803040385, 799694419, 795631170, 790716171, 784851372, 778042734, 770345688, 761910915, 753195286, 744782746, 737183928, 730764449, 725743353, 722304583, 720437884, 719847739, 720144093, 721053600, 722372413, 723807275, 724957466, 725376785, 724833786, 723377049, 721030653, 717957973, 714500546, 710917532, 707629204, 705149174, 703885674, 704417050, 707533300, 713831007, 723291278, 735245407, 748684883, 762607932, 776224434, 788934767, 800286233, 809967160, 817945778, 824570179, 829992354, 834053099, 836920738, 838952005]
2975.4H38952005J345277P67469K79844j82092n61655p90298q87751j079142j376570
2993.8H36467087j547336j606584j644492j723707j777172j693308j673579j863897
3010.1H22937012k077580k130687k038538j976371k006471k011717k046108k176940
3026.4H06472600k318800k452731k502799k387941k335250k504409k690911k755225
3042.7G86524534k713382k663553k727508k820850k833187k829910k810597k773702
3059.1G64351845k867997l038824l129780l093302k958298k933085l086149l211022
3075.4G40033388l181338l137946l224075l288269l222645l184080l227055l231466
3091.7G14336514l152012l130615l236950l293275l237486l198505l252685l351569
$$ y = [838952005, 840297282, 841064751, 841344595, 841162503, 840600848, 839810550, 838922799, 837843657, 836467087, 834919751, 833313167, 831668675, 829944968, 828167796, 826474488, 824800909, 822937012, 820859432, 818728745, 816690207, 814713836, 812707365, 810695648, 808649540, 806472600, 804153800, 801701069, 799198270, 796810329, 794475079, 791970670, 789279759, 786524534, 783811152, 781147599, 778420091, 775599241, 772766054, 769936144, 767125547, 764351845, 761483848, 758445024, 755315244, 752221942, 749263644, 746330559, 743244410, 740033388, 736852050, 733714104, 730490029, 727201760, 723979115, 720795035, 717567980, 714336514, 711184502, 708053887, 704816937, 701523662, 698286176, 695087671, 691834986, 688483417]
3108F88483417l373444l300846l277242l329158l329932l323257l361762l334463l296315
3126.3F58556998l318429l269553l224314l297090l358722l318846l184378l024996
3142.7F32560670l029942l195942l264367l209829l114939l020466l062665l154814
3159F07507706l111601l039718k942324k775728k706647k705217k704501k721250k707422
3177.3E82093298k658844k601027k487421k354562k321422k306045k218306k163827
3193.6E62981844k181888k119600j945854j823008j794159j770020j709222j612485
3210E48025608j484871j396298j398921j379788j223624j026988j036048j191497j052677
3228.3E36834896p56860p15435p31349o64413o17087n42521m58360m01020l18050k49446
$$ y = [688483417, 685109973, 681809127, 678531885, 675202727, 671872795, 668549538, 665187776, 661853313, 658556998, 655238569, 651969016, 648744702, 645447612, 642088890, 638770044, 635585666, 632560670, 629530728, 626334786, 623070419, 619860590, 616745651, 613725185, 610662520, 607507706, 604396105, 601356387, 598414063, 595638335, 592931688, 590226471, 587521970, 584800720, 582093298, 579434454, 576833427, 574346006, 571991444, 569670022, 567363977, 565145671, 562981844, 560799956, 558680356, 556734502, 554911494, 553117335, 551347315, 549638093, 548025608, 546540737, 545144439, 543745518, 542365730, 541142106, 540115118, 539079070, 537887573, 536834896, 536078036, 535362601, 534631252, 533966839, 533349752, 532807231, 532348871, 531947851, 531629801, 531380355]
3248.7E31380355k26020k43605j71780J3232M3273K1160J62899K46287K33769L35574
3269.1E31795144M10676L43382L48092M42147M63366M53651N34177O63281O62684O37472
3289.5E36754072P19368P54118P76172Q69214R28998Q98958Q62717Q49128Q77142R29832
3309.9E45219719R42648R96470J075626J079857J032233J025677J044512J001358R82046
3328.2E54400146J058459J126051J128674J087189J061975J101554J191914J278460
3344.6E63434422J327693J357794J369596J419723J466632J429498J389205J460493
3360.9E74655056J629889J871467K056718J905560J698017J855254K086640K100765
3377.2E89859366K081097K154409K235651K290786K411186K475620K404988K383172
$$ y = [531380355, 531154335, 530910730, 530738950, 530752182, 530795455, 530816615, 530979514, 531225801, 531459570, 531795144, 532205820, 532549202, 532897294, 533339441, 533802807, 534256458, 534790635, 535453916, 536116600, 536754072, 537473440, 538227558, 539003730, 539872944, 540801942, 541700900, 542563617, 543412745, 544289887, 545219719, 546162367, 547158837, 548234463, 549314320, 550346553, 551372230, 552416742, 553418100, 554400146, 555458605, 556584656, 557713330, 558800519, 559862494, 560964048, 562155962, 563434422, 564762115, 566119909, 567489505, 568909228, 570375860, 571805358, 573194563, 574655056, 576284945, 578156412, 580213130, 582118690, 583816707, 585671961, 587758601, 589859366, 591940463, 594094872, 596330523, 598621309, 601032495, 603508115, 605913103, 608296275]
3393.5F08296275K417267K466380K575576K666593K621472K629757K711117K678514
3409.8F29062951K716004K888501K886236K823949L000736L090501K965390K887249
3426.1F52321517K964080L050804L072381L139138L207505L163576L023505L026128
3442.4F76968634L184915L325462L432274L473759L389120L291368L285468L318369
3458.8G03669369L365994L439009L497243L475427L358722L201664L242850L437638
3475.1G30687916L462136L374100L417849L408671L215611L178537L355145L392458
3491.4G57492423L250301L250241L299773L267825L339290L449440L422141L403724
3507.7G84175158L465533L447175L317237L211736L257454L245711L163099L185750
$$ y = [608296275, 610713542, 613179922, 615755498, 618422091, 621043563, 623673320, 626384437, 629062951, 631778955, 634667456, 637553692, 640377641, 643378377, 646468878, 649434268, 652321517, 655285597, 658336401, 661408782, 664547920, 667755425, 670919001, 673942506, 676968634, 680153549, 683479011, 686911285, 690385044, 693774164, 697065532, 700351000, 703669369, 707035363, 710474372, 713971615, 717447042, 720805764, 724007428, 727250278, 730687916, 734150052, 737524152, 740942001, 744350672, 747566283, 750744820, 754099965, 757492423, 760742724, 763992965, 767292738, 770560563, 773899853, 777349293, 780771434, 784175158, 787640691, 791087866, 794405103, 797616839, 800874293, 804120004, 807283103, 810468853]
3524H10468853L297269L482163L563285L435254L302634L235757L165483L014028K839387
3542.4H39804113K945900L175914L231108L144384L041863K958358K819061K803981
3558.7H63924682K881229K633214K247214K520562L122508L147125K874554K684712
3575H86035800K573013K459765K460062K329648K043903K298236K769470K500117K159357
3593.4I07629371K188444K275050K292931K241373K099633J958489K028942K066672
3609.7I24780905J827061J743257J839579J822531J924276K111316K144515K057314
3626I40250754K065599K273262K200425K113640J975059J665414J593291J676381J507163
3644.3I57320988J241565J373470J818180J897156J671016J552463J508176J358867
$$ y = [810468853, 813766122, 817248285, 820811570, 824246824, 827549458, 830785215, 833950698, 836964726, 839804113, 842750013, 845925927, 849157035, 852301419, 855343282, 858301640, 861120701, 863924682, 866805911, 869439125, 871686339, 874206901, 877329409, 880476534, 883351088, 886035800, 888608813, 891068578, 893528640, 895858288, 897902191, 900200427, 902969897, 905470014, 907629371, 909817815, 912092865, 914385796, 916627169, 918726802, 920685291, 922714233, 924780905, 926607966, 928351223, 930190802, 932013333, 933937609, 936048925, 938193440, 940250754, 942316353, 944589615, 946790040, 948903680, 950878739, 952544153, 954137444, 955813825, 957320988, 958562553, 959936023, 961754203, 963651359, 965322375, 966874838, 968383014, 969741881]
3660.6I69741881J214206J160264J066566J003623J235604J325130J117587J044572
3677I78909433J060665Q88943P39038P63655O80506M75288N64634P22349O28293M46200
3697.4I85879004K44081J59144L41416M14371K18034P1704J27554J76728J73748J91688
3717.7I87997472L7611j67549n2810K47002M71950L56793j44660l97027J08659M72546
3738.1I88929987K61366n0008l14176j74582J13964J03593P6473J73449K16186J68562
3758.5I89504814J98424K42114M4227j01030Q4162L29196K87473K9028j83404j92880
3778.9I90242124Q940P8976P0572J97411J34468r2328m9114J36912J69098P1109j14739
3801.4I90853429j79172k18928j56641K32399L59237J05500q3446L6955m8876k27869
$$ y = [969741881, 970956087, 972116351, 973182917, 974186540, 975422144, 976747274, 977864861, 978909433, 979970098, 980859041, 981598079, 982361734, 983042240, 983517528, 984082162, 984804511, 985432804, 985879004, 986123085, 986282229, 986623645, 987038016, 987256050, 987327754, 987455308, 987632036, 987805784, 987997472, 988035083, 987867534, 987814724, 988061726, 988533676, 988890469, 988745809, 988348782, 988457441, 988929987, 989191353, 989141345, 988827169, 988652587, 988766551, 988870144, 988946617, 989120066, 989336252, 989504814, 989703238, 989945352, 989989579, 989888549, 989972711, 990301907, 990589380, 990618408, 990435004, 990242124, 990251064, 990330040, 990400612, 990598023, 990732491, 990640163, 990591049, 990727961, 990897059, 990968168, 990853429, 990674257, 990455329, 990298688, 990531087, 990890324, 990995824, 990912378, 990949333, 990900457, 990672588]
3821.8I90672588K9922J29819L0517N8830K6167J2338N2094j99616l42965m7922K00987
3844.2I90622759K30253K26199Q3983m28974n87225P2956L25203J59800k5869j311
3864.6I90677774O2466j61171k74122P4029L04758K35916r4712l56615j35720J82391
3885I90514994K94506P7903m8339J89066J08004k82050m23967k06113J02639L32415
3905.4I90659058M34160K42532p3195k54333l63886k33591R6619J48237J0669J5199
3925.8I90681469J0431r2566m589J63197J71185J5139l56376n28455m5478L60727J73509
3948.2I90548193K9207J04010J27733J25408P629k36034k77043n8293J19031J91867
3968.6I90681708J26242r8884k06768o8665K4677p0155j14381k7061Q5354R9301j37925
$$ y = [990672588, 990702510, 990832329, 990862846, 990921676, 990947843, 990960181, 991012275, 990812659, 990469694, 990421772, 990622759, 990853012, 991079211, 991163194, 990734220, 990146995, 990219951, 990545154, 990704954, 990679085, 990677774, 990740240, 990579069, 990304947, 990378976, 990683734, 990919650, 990824938, 990468323, 990332603, 990514994, 990809500, 990887403, 990839064, 991028130, 991136134, 990854084, 990430117, 990224004, 990326643, 990659058, 991093218, 991335750, 991262555, 991008222, 990644336, 990410745, 990507364, 990655601, 990666270, 990681469, 990691900, 990599334, 990594745, 990757942, 990929127, 990944266, 990587890, 990059435, 990013957, 990374684, 990548193, 990577400, 990681410, 990809143, 990934551, 990942180, 990706146, 990429103, 990370810, 990489841, 990681708, 990807950, 990709066, 990502298, 990433633, 990458310, 990388155, 990273774, 990246713, 990332067, 990431368, 990293443]
3991I90293443k96116j24335j132
3997.1I89871860
$$ y = [990293443, 989997327, 989872992, 989871860]
##END=$$ End of the data block
