##TITLE=QTS $$ Begin of the data block
##JCAMP-DX=5.00 $$ ACD/SpecManager v 10.08
##SPECTROMETER/DATA SYSTEM=Alpha
##DATE=17 Apr 2014 09:51:36
##DATA TYPE=INFRARED SPECTRUM
##DATA CLASS=XYDATA
##ORIGIN=
##OWNER=
##NPOINTS=1667
##FIRSTX=599.57470703
##LASTX=3997.16503906
##MAXX=3997.16503906
##MINX=599.57470703
##MAXY=0.99199831
##MINY=0.27479166
##XFACTOR=1.0000000000
##YFACTOR=1.000000000000000e-9
##FIRSTY=0.27479166
##DELTAX=2.03937006
##XUNITS=1/CM
##YUNITS=ARBITRARY UNITS
##XYDATA=(X++(Y..Y))
$$ plain form
599.6 274791658 275450081 275896132 276019394 276165485 276340753 276108742 275648385 275583118 276518613 278791696
620 278791696 282059968 285672426 289094359 292277247 294754684 295987487 296222031 295886070 295018017
638.3 295018017 293679684 292268008 291461021 292152852 294671088 299171418 306061953 315188020 325565666
656.7 325565666 336607903 347744435 357802927 365594715 372800261 381543338 387864351 391962022
673 391962022 395606279 398751348 401466101 404114068 406857461 409588575 412229061 414673746 416995585
691.3 416995585 419352025 421801835 424163789 426245093 428328186 430726260 433313102 435974121
707.7 435974121 438801855 441868901 445086122 448195159 451202810 454246312 457262099 460204870
724 460204870 463089108 465865314 468507767 471056312 473713726 476615787 479634285 482668787 485605121
$$ packed form
599.6B74791658O58423M46051J23262J46091J75268k32011m60357o5267R35495K273083
620B78791696L268272L612458L421933L182888K477437J232803K34544l35961q68053
638.3B95018017j338333j411676q06987O91831K518236M500330O890535R126067J0377646
656.7C25565666J1042237J1136532J0058492P791788P205546Q743077O321013M097671
673C91962022L644257L145069K714753K647967K743393K731114K640486K444685K321839
691.3D16995585K356440K449810K361954K081304K083093K398074K586842K661019
707.7D35974121K827734L067046L217221L109037L007651L043502L015787K942771
724D60204870K884238K776206K642453K548545K657414K902061L018498L034502K936334
$$ plain form
742.3 485605121 488434523 491292536 494320244 497455567 500489593 503435433 506435990 509634316
758.6 509634316 513034701 516401708 519546032 522635639 525892913 529245436 532505989 535832345
775 535832345 539368391 542793930 546065629 549521029 553197503 556844831 560280144 563516557 566837788
793.3 566837788 570395291 574011981 577710092 581582546 585431993 589214087 593183875 597310066
809.6 597310066 601284087 605123878 609092474 613149226 617085516 620974422 625073254 629334927
825.9 629334927 633591592 637825429 641869485 645637155 649412274 653418303 657457292 661425114
842.3 661425114 665404260 669291973 673109472 676981986 680873632 684624851 688125312 691552937
858.6 691552937 695061564 698528230 701905668 705254018 708536088 711620688 714520335 717248917
$$ packed form
742.3D85605121K829402K858013L027708L135323L034026K945840L000557L198326
758.6E09634316L400385L367007L144324L089607L257274L352523L260553L326356
775E35832345L536046L425539L271699L455400L676474L647328L435313L236413L321231
793.3E66837788L557503L616690L698111L872454L849447L782094L969788M126191
809.6E97310066L974021L839791L968596M056752L936290L888906M098832M261673
825.9F29334927M256665M233837M044056L767670L775119M006029M038989L967822
842.3F61425114L979146L887713L817499L872514L891646L751219L500461L427625
858.6F91552937L508627L466666L377438L348350L282070L084600K899647K728582
$$ plain form
874.9 717248917 719516397 721135557 722251892 723050296 723486006 723430812 723068774 722866654 723189712
893.2 723189712 724132478 725539327 727203012 729171693 731591105 734562993 738227904 742315769 745981276
911.6 745981276 748232901 748164892 745262504 739794075 732881486 726282358 722126603 722152233 726488113
930 726488113 733477414 740802765 746641517 750201821 751596749 751389921 750441432 749770820 750061214
948.3 750061214 751388609 753373861 755428910 757079244 757994235 757957220 756969452 755136549 752655268
966.7 752655268 749629676 745926201 741453111 736233950 730154157 723006964 714720309 705220163
983 705220163 694490731 682791412 670392632 657477975 644381881 631367207 618414700 605458081
999.3 605458081 592440665 579186797 565379024 550456703 533958137 516394198 499362022
$$ packed form
874.9G17248917K267480J619160J116335P98404M35710n5194l62038k02120L23058
893.2G23189712R42766J406849J663685J968681K419412K971888L664911M087865L665507
911.6G45981276K251625o8009k902388n468429o912589o599128m155755K5630M335880
930G26488113O989301P325351N838752L560304J394928k06828r48489o70612K90394
948.3G50061214J327395J985252K055049J650334R14991l7015r87768j832903k481281
966.7G52655268l025592l703475m473090n219161o079793p147193q286655r500146
983G05220163j0729432j1699319j2398780j2914657j3096094j3014674j2952507j2956619
999.3F05458081j3017416j3253868j3807773j4922321j6498566j7563939j7032176
$$ plain form
1013.6 499362022 484971464 475160688 470819920 471596092 476406395 484016538 493494362 504142225
1029.9 504142225 515005291 524889946 533154845 540082395 546508074 552897692 558518231 562053025
1046.2 562053025 562843800 561094582 557355165 552162707 546001196 539455473 533105135 527335942
1062.5 527335942 522328734 518102169 514868498 513082445 513104618 515269637 519968152 527267456 536542416
1080.9 536542416 546610475 556150258 564088702 570035696 574301839 577506125 580402672 583859146
1097.2 583859146 588731229 595761299 605627358 618703663 634702504 652567029 670672715 687493384
1113.5 687493384 702151120 714427352 724488437 732598245 739126563 744610786 749516547 754080176
1129.8 754080176 758228838 761528671 763383865 763130605 759930909 753163338 743094206 731149912
$$ packed form
1013.6D99362022j4390558r810776m340768P76172M810303P610143R477824J0647863
1029.9E04142225J0863066R884655Q264899O927550O425679O389618N620539L534794
1046.2E62053025P90775j749218l739417n192458o161511o545723o350338n769193
1062.5E27335942n007208m226565l233671j786053K2173K165019M698515P299304R274960
1080.9E36542416J0068059R539783P938444N946994M266143L204286K896547L456474
1097.2E83859146M872083P030070R866059J3076305J5998841J7864525J8105686J6820669
1113.5F87493384J4657736J2276232J0061085Q109808O528318N484223M905761M563629
1129.8G54080176M148662L299833J855194k53260l199696o767571j0069132j1944294
$$ plain form
1146.1 731149912 719859660 712229073 710770071 716536641 728402197 743808746 760322392 776179790
1162.4 776179790 790331125 802358091 812180877 819976151 826034188 830615878 834084213 836931348
1178.8 836931348 839438975 841600001 843391180 844882250 846171975 847252011 847971737 848223865 848113656
1197.1 848113656 847876370 847706318 847671211 847767889 847912908 847926259 847709477 847357750 847010374 846712649
1217.5 846712649 846424997 846002817 845328987 844427943 843393326 842155993 840627670 838939130 837221920
1235.9 837221920 835454643 833542764 831490397 829359710 827180147 824979007 822896838 821095586
1252.2 821095586 819637716 818563879 817995965 818026781 818602324 819628775 820908248 822127938 822917700
1270.5 822917700 823147357 822857261 822014749 820577681 818505168 815766037 812317789 808152556 803263307
$$ packed form
1146.1G31149912j1290252p630587j459002N766570J1865556J5406549J6513646J5857398
1162.4G76179790J4151335J2026966R822786P795274O058037M581690L468335K847135
1178.8H36931348K507627K161026J791179J491070J289725J080036P19726K52128j10209
1197.1H48113656k37286j70052l5107R6678J45019J3351k16782l51727l47376k97725
1217.5H46712649k87652m22180o73830r01044j034617j237333j528323j688540j717210
1235.9H37221920j767277j911879k052367k130687k179563k201140k082169j801252
1252.2H21095586j457870j073837n67914L0816N75543J026451J279473J219690P89762
1270.5H22917700K29657k90096q42512j437068k072513k739131l448248m165233m889249
$$ plain form
1288.9 803263307 797649622 791089416 783380210 774799764 766260266 758968115 753757715 750675976
1305.2 750675976 748928368 747540712 745909333 743810833 741179407 738227427 735223770 732247174
1321.5 732247174 729240060 726127207 722728252 718594730 713313282 706430316 697745621 687702358
1337.8 687702358 678070784 671845138 670971215 675491869 683817089 693025887 699932277 702573776
1354.2 702573776 700585485 694827676 686035216 674319088 660793841 646703005 631282449 614676356
1370.5 614676356 597401977 579449296 563125372 549576581 537948072 527665317 517784238
1384.7 517784238 506486654 493394941 479671359 464116305 445271879 425638109 406922251
1399 406922251 390828639 379338980 372473300 371469021 376791120 387973368 403701901 422008097
$$ packed form
1288.9H03263307n613685o560206p709206q580446q539498p292151n210400l081739
1305.2G50675976j747608j387656j631379k098500k631426k951980l003657k976596
1321.5G32247174l007114l112853l398955m133522n281448o882966q684695j0043263
1337.8F87702358r631574o225646q73923M520654Q325220R208798O906390K641499
1354.2G02573776j988291n757809q792460j1716128j3525247j4090836j5420556j6606093
1370.5F14676356j7274379j7952681j6323924j3548791j1628509j0282755r881079
1384.7E17784238j1297584j3091713j3723582j5555054j8844426j9633770j8715858
1399D06922251j6093612j1489659o865680j004279N322099J1182248J5728533J8306196
$$ plain form
1415.3 422008097 443073899 468088537 491237968 511311293 531195104 550129056 568925500
1429.6 568925500 586990237 602614462 618327320 634510994 647123277 657618046 667521298
1443.9 667521298 676468730 684758902 691876709 697408974 701659083 705295920 708193421 709667087
1460.2 709667087 710257053 710281849 709858596 709399700 708848953 707548440 705323577 702372670 698637962
1478.6 698637962 694001436 688578248 682619750 675769269 667330921 657730758 649028063 640293241
1494.9 640293241 629060984 616537511 605133235 595029771 583378792 565725148 549221456
1509.1 549221456 536436737 523449719 509584546 494776309 480367273 464808226 449396342
1523.4 449396342 436229408 423298776 411822677 401558965 390818536 382015258 375926226 369572997
$$ packed form
1415.3D22008097K1065802K5014638K3149431K0073325J9883811J8933952J8796444
1429.6E68925500J8064737J5624225J5712858J6183674J2612283J0494769R903252
1443.9F67521298Q947432Q290172P117807N532265M250109L636837K897501J473666
1460.2G09667087N89966K4796m23253m58896n50747j300513k224863k950907l734708
1478.6F98637962m636526n423188n958498o850481q438348r600163q702695q734822
1494.9F40293241j1232257j2523473j1404276j0103464j1650979j7653644j6503692
1509.1E49221456j2784719j2987018j3865173j4808237j4409036j5559047j5411884
1523.4D49396342j3166934j2930632j1476099j0263712j0740429q803278o089032o353229
$$ plain form
1539.7 369572997 364219248 361945093 361652285 362871051 365647435 370029181 375915766 383034855
1556.1 383034855 394066364 410581678 423421472 435772091 450256199 466677696 485762566
1570.3 485762566 503080845 519637465 540708899 560937583 577676058 594624639 611746430
1584.6 611746430 628250360 643889964 658538401 672092438 684620261 695976794 705910087
1598.9 705910087 714483559 721774340 727606237 731972396 735081494 736832321 737316132 736666679 734737575
1617.2 734737575 732218206 729388356 725636244 721651375 717929184 714275181 711233079 708751380
1633.6 708751380 706180632 704151690 703279376 703092754 703416884 704434395 706209362 708023906 710698366
1651.9 710698366 715830863 720757842 725296319 730725527 737416506 744741023 751395702 758518279
$$ packed form
1539.7C69572997n353749k274155k92808J218766K776384M381746N886585P119089
1556.1C83034855J1031509J6515314J2839794J2350619J4484108J6421497J9084870
1570.3D85762566J7318279J6556620K1071434K0228684J6738475J6948581J7121791
1584.6F11746430J6503930J5639604J4648437J3554037J2527823J1356533R933293
1598.9G05910087Q573472P290781N831897M366159L109098J750827M83811o49453j929104
1617.2G34737575k519369k829850l752112l984869l722191l654003l042102k481699
1633.6G08751380k570748k028942q72314j86622L24130J017511J774967J814544K674460
1651.9G10698366N132497M926979M538477N429208O690979P324517O654679P122577
$$ plain form
1668.2 758518279 766987741 774693608 782205284 790402472 797664821 804107726 811095357 820079625
1684.5 820079625 828043520 834227443 840743661 846849024 852977872 859482050 865586698 872302055
1700.9 872302055 878027201 882794619 887816250 892381251 896506846 900425076 904298127 908734143
1717.2 908734143 912976623 916176438 919070899 922044635 924699664 927006185 928996563 931196988
1733.5 931196988 933690727 935712993 937631726 939522743 941166043 942675054 944198549 945799410
1749.8 945799410 947438776 948756099 949796677 950799108 951802909 952872336 953813314 954560935 955243289
1768.2 955243289 955905378 956634402 957422316 958036900 958497822 958913565 959344745 959791899 960237980 960678935
1788.5 960678935 961033404 961447239 961980700 962450981 962825239 963191092 963548660 963829637 964018703 964152992
$$ packed form
1668.2G58518279Q469462P705867P511676Q197188P262349O442905O987631Q984268
1684.5H20079625P963895O183923O516218O105363O128848O504178O104648O715357
1700.9H72302055N725146M767418N021631M565001M125595L918230L873051M436016
1717.2I08734143M242480L199815K894461K973736K655029K306521J990378K200425
1733.5I31196988K493739K022266J918733J891017J643300J509011J523495J600861
1749.8I45799410J639366J317323J040578J002431J003801J069427R40978P47621O82354
1768.2I55243289O62089P29024P87914O14584M60922M15743M31180M47154M46081M40955
1788.5I60678935L54469M13835N33461M70281L74258L65853L57568K80977J89066J34289
$$ plain form
1808.9 964152992 964354813 964622140 964843631 965021372 965263546 965501010 965600610 965614080 965679228 965843022
1829.3 965843022 966091037 966315389 966434956 966523826 966580629 966603339 966696501 966866493 966946840 966993630 967126787
1851.8 967126787 967253804 967348814 967462897 967587590 967693925 967763364 967763484 967721045 967723310 967795968 967879713
1874.2 967879713 967926800 967948794 967932999 967889845 967875779 967876792 967847764 967826486 967805147 967757642 967712402 967639685
1898.7 967639685 967546284 967519462 967582464 967575371 967428982 967292607 967212081 967096388 966928661 966827810 966777444
1921.1 966777444 966656268 966520071 966406107 966216922 965934336 965666652 965436041 965190291 964970291 964756310
1941.5 964756310 964526713 964393198 964366972 964357913 964262128 964095235 964025319 964043260 963992715 963863075 963708937
1963.9 963708937 963540435 963388324 963244557 963102281 962995231 962876737 962698758 962498784 962318599 962164223
$$ packed form
1808.9I64152992K01821K67327K21491J77741K42174K37464R9600J3470O5148J63794
1829.3I65843022K48015K24352J19567Q8870N6803K2710R3162J69992Q0347M6790J33157
1851.8I67126787J27017R5010J14083J24693J06335O9439J20m2439K265P2658Q3745
1874.2I67879713M7087K1994j5795m3154j4066J013k9028k1278k1339m7505m5240p2717
1898.7I67639685r3401k6822O3002p093j46389j36375q0526j15693j67727j00851n0366
1921.1I66777444j21176j36197j13964j89185k82586k67684k30611k45750k20000k13981
1941.5I64756310k29597j33515k6226r059r5785j66893o9916J7941n0545j29640j54138
1963.9I63708937j68502j52111j43767j42276j07050j18494j77979j99974j80185j54376
$$ plain form
1984.3 962164223 962027848 961825848 961533487 961286962 961116791 960910439 960630655 960356593 960134864 959982455
2004.7 959982455 959857821 959643424 959364533 959088743 958790064 958528161 958332419 958051741 957646132 957259476
2025.1 957259476 956967354 956690311 956379950 956066847 955736995 955362678 954989195 954675555 954338670 953941941
2045.5 953941941 953598142 953285038 952875376 952404916 952032924 951759577 951451957 951101899 950752318 950390697
2065.9 950390697 950027406 949682295 949332774 948928952 948499322 948138177 947853088 947547913 947213113 946898580
2086.3 946898580 946565509 946215808 945858896 945471108 945091844 944745243 944387436 944022894 943695843 943373144
2106.7 943373144 943032086 942736566 942527115 942338407 942098677 941802919 941474736 941125751 940824986 940626800
2127.1 940626800 940414846 940152586 939914763 939690292 939454496 939213157 938985705 938778698 938600957 938443065
$$ packed form
1984.3I62164223j36375k02000k92361k46525j70171k06352k79784k74062k21729j52409
2004.7I59982455j24634k14397k78891k75790k98679k61903j95742k80678m05609l86656
2025.1I57259476k92122k77043l10361l13103l29852l74317l73483l13640l36885l96729
2045.5I53941941l43799l13104m09662m70460l71992k73347l07620l50058l49581l61621
2065.9I50390697l63291l45111l49521m03822m29630l61145k85089l05175l34800l14533
2086.3I46898580l33071l49701l56912l87788l79264l46601l57807l64542l27051l22699
2106.7I43373144l41058k95520k09451j88708k39730k95758l28183l48985l00765j98186
2127.1I40626800k11954k62260k37823k24471k35796k41339k27452k07007j77741j57892
$$ plain form
2147.5 938443065 938273966 938143432 938063145 937971473 937854707 937749684 937667310 937529683 937370896 937291503
2167.9 937291503 937266648 937291741 937387288 937504113 937578261 937619328 937689662 937772810 937818766 937891245 938024104
2190.3 938024104 938139200 938240051 938387990 938573718 938772857 938962281 939135373 939317644 939519286 939713597
2210.7 939713597 939874589 940070271 940333247 940608501 940845311 941010118 941201866 941508353 941828668 942045808
2231.1 942045808 942183614 942323685 942497551 942698896 942870200 943017125 943273306 943620801 943869412 944014251
2251.5 944014251 944165349 944304287 944418371 944563091 944739938 944896817 945036590 945199251 945400953 945592940
2271.9 945592940 945727468 945859075 946035624 946247041 946419120 946500659 946593583 946725190 946826398 946954250
2292.3 946954250 947116613 947216094 947281420 947360635 947390854 947352171 947336316 947415948 947534382 947576642 947579801
$$ packed form
2147.5I38443065j69099j30534q0287r1672j16766j05023q2374j37627j58787p9393
2167.9I37291503k4855K5093R5547J16825P4148M1067P0334Q3148M5956P2479J32859
2190.3I38024104J15096J00851J47939J85728J99139J89424J73092J82271K01642J94311
2210.7I39713597J60992J95682K62976K75254K36810J64807J91748L06487L20315K17140
2231.1I42045808J37806J40071J73866K01345J71304J46925K56181L47495K48611J44839
2251.5I44014251J51098J38938J14084J44720J76847J56879J39773J62661K01702J91987
2271.9I45592940J34528J31607J76549K11417J72079Q1539R2924J31607J01208J27852
2292.3I46954250J62363R9481O5326P9215L0219l8683j5855P9632J18434M2260L159
$$ plain form
2314.7 947579801 947736502 947939634 947853565 947580397 947518945 947724760 947973013 948131919 948173881 948169172
2335.1 948169172 948241830 948354602 948395133 948302090 948128760 948138773 948346138 948543847 948721945 949003220
2355.5 949003220 949335158 949544191 949654937 949935734 950132430 949836969 949431896 949329913 949352086 949306726
2375.9 949306726 949261785 949247241 949219704 949188054 949136138 949019670 948890269 948822677 948789001 948749423 948702097
2398.3 948702097 948616445 948490858 948388577 948316216 948195994 947970271 947689712 947447896 947255611 947059870
2418.7 947059870 946794212 946460605 946180463 946029484 945917785 945740223 945535362 945392132 945282221 945106566
2439.1 945106566 944871306 944649994 944425106 944164932 943877101 943542302 943190813 942862868 942572117 942339003
2459.5 942339003 942106009 941806078 941434741 941062808 940802097 940580666 940236568 939839303 939506531 939158559
$$ packed form
2314.7I47579801J56701K03132q6069k73168o1452K05815K48253J58906M1962m709
2335.1I48169172P2658J12772M0531r3043j73330J0013K07365J97709J78098K81275
2355.5I49003220L31938K09033J10746K80797J96696k95461m05073j01983K2173m5360
2375.9I49306726m4941j4544k7537l1650n1916j16468j29401o7592l3676l9578m7326
2398.3I48702097q5652j25587j02281p2361j20222k25723k80559k41816j92285j95741
2418.7I47059870k65658l33607k80142j50979j11699j77562k04861j43230j09911j75655
2439.1I45106566k35260k21312k24888k60174k87831l34799l51489l27945k90751k33114
2459.5I42339003k32994k99931l71337l71933k60711k21431l44098l97265l32772l47972
$$ plain form
2479.9 939158559 938777626 938468039 938177466 937858701 937590599 937316656 936948955 936538696 936244488 936125457
2500.3 936125457 935998976 935754478 935421824 935086250 934870064 934762537 934697092 934625983 934467614 934272230
2520.7 934272230 934163392 934073150 933914661 933743358 933600247 933446050 933247030 933037341 932839274 932589710
2541.1 932589710 932277918 931964993 931665838 931413472 931205690 930948019 930619419 930307388 930051863 929770589
2561.5 929770589 929402232 929000199 928668559 928441584 928237081 927974939 927686274 927403450 927095413 926784456
2581.9 926784456 926448762 926043332 925631940 925270736 925007820 924812615 924527943 924150884 923830986 923581183
2602.2 923581183 923337936 923042119 922655821 922209024 921732008 921273291 920868337 920500338 920069575 919541895
2622.6 919541895 919050872 918612778 918179929 917791843 917400241 916871071 916223466 915593147 915027082 914475977
$$ packed form
2479.9I39158559l80933l09587k90573l18765k68102k73943l67701m10259k94208j19031
2500.3I36125457j26481k44498l32654l35574k16186j07527o5445p1109j58369j95384
2520.7I34272230j08838r0242j58489j71303j43111j54197j99020k09689j98067k49564
2541.1I32589710l11792l12925k99155k52366k07782k57671l28600l12031k55525k81274
2561.5I29770589l68357m02033l31640k26975k04503k62142k88665k82824l08037l10957
2581.9I26784456l35694m05430m11392l61204k62916j95205k84672l77059l19898k49803
2602.2I23581183k43247k95817l86298m46797m77016m58717m04954l67999m30763n27680
2622.6I19541895m91023m38094m32849l88086l91602n29170o47605o30319n66065n51105
$$ plain form
2643 914475977 913941264 913474560 913009226 912479103 911887050 911228836 910515547 909759760 909062624 908499599
2663.4 908499599 907954037 907391667 906877398 906267822 905472219 904670119 903955698 903270423 902596116 901929021
2683.8 901929021 901246488 900588334 899994075 899434745 898915529 898368359 897677720 896925986 896222293 895511270
2704.2 895511270 894792318 894160986 893539608 892859161 892255187 891744435 891211867 890611291 889935732 889237225
2724.6 889237225 888639450 888135076 887585521 886943281 886225998 885456860 884670794 883899927 883148372 882361829
2745 882361829 881524444 880664825 879795671 878980100 878234088 877453804 876607716 875769317 874952137 874137282
2765.4 874137282 873338342 872530401 871657252 870696306 869733393 868852913 867999315 867134929 866259754 865326285
2785.8 865326285 864343405 863389373 862438738 861384213 860268176 859224439 858254969 857261240 856182575
$$ packed form
2643I14475977n34713m66704m65334n30123n92053o58214p13289p55787o97136n63025
2663.4I08499599n45562n62370n14269o09576p95603q02100p14421o85275o74307o67095
2683.8I01929021o82533o58154n94259n59330n19216n47170o90639p51734p03693p11023
2704.2H95511270p18952o31332o21378o80447o03974n10752n32568o00576o75559o98507
2724.6H89237225n97775n04374n49555o42240p17283p69138p86066p70867p51555p86543
2745H82361829q37385q59619q69154q15571p46012p80284q46088q38399q17180q14855
2765.4H74137282p98940q07941q73149r60946r62913q80480q53598q64386q75175r33469
2785.8H65326285r82880r54032r50635j054525j116037j043737r69470r93729j078665
$$ plain form
2804.1 856182575 854991853 853731751 852498055 851284206 849988043 848538458 846990764 845464528
2820.5 845464528 843956351 842362821 840628445 838777006 836852252 834885001 832867146 830784857
2836.8 830784857 828659117 826358676 823706985 820699930 817473471 814484775 812108994 810158491
2853.1 810158491 808334887 806563556 804893017 803310037 801717758 799993753 798100054 796240330
2869.4 796240330 794528723 792877853 791412115 790259242 789226770 788202465 787234247 786281765 785367489
2887.8 785367489 784606159 784024656 783472598 782843173 782256663 781742930 781130910 780302763 779321730 778227866
2908.1 778227866 776806712 774849296 772547901 770321906 768328488 766532302 764947474 763612270
2924.5 763612270 762560308 761721730 761129320 760904908 760910094 761019826 761241615 761464953 761521399 761302173
$$ packed form
2804.1H56182575j190722j260102j233696j213849j296163j449585j547694j526236
2820.5H45464528j508177j593530j734376j851439j924754j967251k017855k082289
2836.8H30784857k125740k300441k651691l007055l226459k988696k375781j950503
2853.1H10158491j823604j771331j670539j582980j592279j724005j893699j859724
2869.4G96240330j711607j650870j465738j152873j032472j024305r68218r52482r14276
2887.8G85367489p61330n81503n52058o29425n86510n13733o12020q28147r81033j093864
2908.1G78227866j421154j957416k301395k225995j993418j796186j584828j335204
2924.5G63612270j051962q38578n92410k24412N186J09732K21789K23338N6446k19226
$$ plain form
2944.9 761302173 760858297 760279715 759579599 758809924 758012593 757273734 756673634 756123185 755508661 754852653
2965.2 754852653 754288316 753799081 753194809 752414107 751524687 750571370 749604046 748670936 747758210 746776640
2985.6 746776640 745652795 744438708 743183196 741813421 740285337 738707125 737180054 735668063
3002 735668063 734132409 732645333 731217742 729736924 728212416 726741850 725343704 723973155 722588778
3020.3 722588778 721182823 719657004 717988849 716323495 714649439 712898672 711170495 709456623
3036.6 709456623 707557738 705488324 703493536 701639950 699766517 697794259 695829749 693922579
3052.9 693922579 692027926 690149546 688244224 686226249 684121430 681985497 679913521 677988172
3069.2 677988172 676070035 673999250 671832383 669735551 667764962 665833175 663928807 662122071
$$ packed form
2944.9G61302173m43876n78582p00116p69675p97331p38859o00100n50449o14524o56008
2965.2G54852653n64337m89235o04272p80702q89420r53317r67324r33110r12726r81570
2985.6G46776640j123845j214087j255512j369775j528084j578212j527071j511991
3002G35668063j535654j487076j427591j480818j524508j470566j398146j370549j384377
3020.3G22588778j405955j525819j668155j665354j674056j750767j728177j713872
3036.6G09456623j898885k069414j994788j853586j873433j972258j964510j907170
3052.9F93922579j894653j878380j905322k017975k104819k135933k071976j925349
3069.2F77988172j918137k070785k166867k096832j970589j931787j904368j806736
$$ plain form
3085.6 662122071 660309970 658429444 656648934 655000329 653319120 651505470 649673820 648003340
3101.9 648003340 646383226 644575715 642701328 641018629 639460683 637852788 636208117 634570062
3118.2 634570062 632908940 631265759 629724801 628170490 626423538 624609232 622848928 621109545
3134.5 621109545 619373441 617589355 615867138 614272833 612653434 610957980 609181762 607334316
3150.8 607334316 605583847 603949010 602282763 600618541 598974407 597311556 595716655 594234884
3167.1 594234884 592811763 591372907 589885712 588369727 586833835 585379601 584089875 582902789
3183.5 582902789 581750751 580526590 579273880 578128994 576999009 575827956 574714363 573694110
3199.8 573694110 572710395 571756721 570895612 570086122 569322169 568644583 567929983 567101479 566275954 565580785
$$ packed form
3085.6F62122071j812101j880526j780510j648605j681209j813650j831650j670480
3101.9F48003340j620114j807511j874387j682699j557946j607895j644671j638055
3118.2F34570062j661122j643181j540958j554311j746952j814306j760304j739383
3134.5F21109545j736104j784086j722217j594305j619399j695454j776218j847446
3150.8F07334316j750469j634837j666247j664222j644134j662851j594901j481771
3167.1E94234884j423121j438856j487195j515985j535892j454234j289726j187086
3183.5E82902789j152038j224161j252710j144886j129985j171053j113593j020253
3199.8E73694110r83715r53674q61109q09490p63953o77586p14600q28504q25525o95169
$$ plain form
3220.2 565580785 565022469 564524174 564035296 563552558 563043416 562516868 562089860 561812580 561550200 561181307
3240.6 561181307 560819924 560597181 560454547 560321391 560100257 559733033 559479833 559495509 559565067 559622586
3260.9 559622586 559740961 559825718 559847295 559961319 560191989 560391605 560553491 560767293 561009228 561197042
3281.3 561197042 561334014 561535239 561846614 562206984 562559724 562904537 563242733 563608706 564071059 564579785
3301.7 564579785 565095305 565645039 566167474 566568136 566957474 567427099 567819834 568110406 568431914 568734884
3322.1 568734884 568902910 568981051 569064260 569265664 569560170 569775939 569853246 569891512 569958568 569967210 569990218
3344.6 569990218 570192218 570484757 570715547 570974410 571418464 572001159 572567821 573130190 573866129 574830413
3364.9 574830413 575926065 576976836 577911198 578887761 579995453 581098616 582159102 583322287 584557950
$$ packed form
3220.2E65580785n58316m98295m88878m82738n09142n26548m27008k77280k62380l68893
3240.6E61181307l61383k22743j42634j33156k21134l67224k53200J5676O9558N7519
3260.9E59622586J18375Q4757K1577J14024K30670J99616J61886K13802K41935J87814
3281.3E61197042J36972K01225L11375L60370L52740L44813L38196L65973M62353N08726
3301.7E64579785N15520N49734N22435M00662L89338M69625L92735K90572L21508L02970
3322.1E68734884J68026P8141Q3209K01404K94506K15769P7307L8266O7056Q642K3008
3344.6E69990218K02000K92539K30790K58863M44054N82695N66662N62369P35939R64284
3364.9E74830413J095652J050771R34362R76563J107692J103163J060486J163185J235663
$$ plain form
3383.3 584557950 585804939 587231874 588783264 590198398 591484070 592810452 594298244 595933437
3399.6 595933437 597512007 598912537 600367010 602110326 603994250 605787992 607562542 609338999
3415.9 609338999 611105144 613016844 615026891 617039680 619170666 621440351 623659790 625946581
3432.2 625946581 628375053 630665600 632800162 635006070 637381852 639826655 642295957 644832969
3448.6 644832969 647496164 650219083 652906001 655600607 658336043 661089897 663841844 666637242
3464.9 666637242 669525087 672462642 675292134 678001583 680747151 683660686 686735094 689826369
3481.2 689826369 692763329 695614159 698626220 701814532 705047309 708214998 711360872 714557230
3497.5 714557230 717712998 720754087 723814607 726980746 730248094 733560562 736718535 739791751
$$ packed form
3383.3E84557950J246989J426935J551390J415134J285672J326382J487792J635193
3399.6E95933437J578570J400530J454473J743316J883924J793742J774550J776457
3415.9F09338999J766145J911700K010047K012789K130986K269685K219439K286791
3432.2F25946581K428472K290547K134562K205908K375782K444803K469302K537012
3448.6F44832969K663195K722919K686918K694606K735436K753854K751947K795398
3464.9F66637242K887845K937555K829492K709449K745568K913535L074408L091275
3481.2F89826369K936960K850830L012061L188312L232777L167689L145874L196358
3497.5G14557230L155768L041089L060520L166139L267348L312468L157973L073216
$$ plain form
3513.8 739791751 742994785 746367276 749730945 752993643 756274104 759660840 763130307 766547978
3530.1 766547978 769854367 773167551 776526392 779824138 783074677 786278486 789501548 792818725
3546.4 792818725 796124816 799334228 802507877 805730045 808889568 812017202 815246820 818330824
3562.8 818330824 821190596 824337542 827773690 831078470 834299147 837474704 840483248 843392968
3579.1 843392968 846404612 849385679 852252960 855372369 858640075 861543000 864408791 867483199
3595.4 867483199 870404482 873130322 875870287 878596842 881310284 884217262 887195706 889994383
3611.7 889994383 892673850 895251572 897924364 900989175 904023290 906694710 909230351 912026286
3628 912026286 915022850 917714357 920418978 923190594 925841093 928516984 931243837 933892369 936521888
$$ packed form
3513.8G39791751L203034L372491L363669L262698L280461L386736L469467L417671
3530.1G66547978L306389L313184L358841L297746L250539L203809L223062L317177
3546.4G92818725L306091L209412L173649L222168L159523L127634L229618L084004
3562.8H18330824K859772L146946L436148L304780L220677L175557L008544K909720
3579.1H43392968L011644K981067K867281L119409L267706K902925K865791L074408
3595.4H67483199K921283K725840K739965K726555K713442K906978K978444K798677
3611.7H89994383K679467K577722K672792L064811L034115K671420K535641K795935
3628I12026286K996564K691507K704621K771616K650499K675891K726853K648532K629519
$$ plain form
3646.4 936521888 939337015 942106009 944546759 947011590 949712753 952191591 954379082 956563056
3662.7 956563056 958704233 960754037 962836385 964897454 966739357 968653440 970531046 971990168
3679 971990168 973266721 974511862 975654483 976755798 977903306 979054689 980106473 980938196 981627345
3697.4 981627345 982203543 982696950 983247399 983814836 984301329 984777808 985290468 985619009 985866547 986252487
3717.7 986252487 986612439 986827612 987045228 987321496 987689972 988027036 988107324 988011956 988122046 988427103
3738.1 988427103 988650918 988799274 988759935 988566160 988779724 989339650 989529312 989468813 989512920 989562452
3758.5 989562452 989632070 989724398 989767611 989864707 990065157 990274608 990382135 990316093 990194023 990107417 990045011
3781 990045011 990151405 990440905 990721703 990860939 990839124 990826130 990907371 990958154 990974784 990891814 990760803
$$ packed form
3646.4I36521888K815127K768994K440750K464831K701163K478838K187491K183974
3662.7I56563056K141177K049804K082348K061069J841903J914083J877606J459122
3679I71990168J276553J245141J142621J101315J147508J151383J051784Q31723O89149
3697.4I81627345N76198M93407N50449N67437M86493M76479N12660L28541K47538L85940
3717.7I86252487L59952K15173K17616K76268L68476L37064Q0288r5368J10090L05057
3738.1I88427103K23815J48356l9339j93775K13564N59926J89662o0499M4107M9532
3758.5I89562452O9618R2328M3213R7096K00450K09451J07527o6042j22070q6606o2406
3781I90045011J06394K89500K80798J39236k1815j2994Q1241N0783J6630q2970j31011
$$ plain form
3803.4 990760803 990804851 990938723 991057575 991211534 991393149 991479278 991438210 991421282 991389751 991263986
3823.8 991263986 991153479 991213143 991411209 991458654 991312742 991181374 991115510 991065800 991069794 991194546 991383255
3846.2 991383255 991639435 991885424 991758049 991273284 991181493 991436362 991681993 991792500 991751075 991628647
3866.6 991628647 991514981 991434336 991444111 991476536 991552651 991614103 991379559 991119325 991247118 991524160 991619825
3889.1 991619825 991666973 991880715 991998315 991784215 991471291 991299510 991237581 991337836 991602838 991771698
3909.4 991771698 991682470 991441190 991212726 991223812 991388500 991330266 991175771 991203606 991344631 991502047
3929.8 991502047 991599739 991547763 991500676 991515517 991412699 991178155 991012216 991035581 991138041 991192937 991177797
3952.3 991177797 991163731 991210222 991302550 991324306 991136193 990927577 991015255 991271019 991310000 991149962 991041541
$$ packed form
3803.4I90760803M4048J33872J18852J53959J81615Q6129m1068j6928l1531j25765
3823.8I91263986j10507N9664J98066M7445j45912j31368o5864m9710L994J24752J88709
3846.2I91383255K56180K45989j27375m84765r1791K54869K45631J10507m1425j22428
3866.6I91628647j13666q0645R775L2425P6115O1452k34544k60234J27793K77042R5665
3889.1I91619825M7148K13742J17600k14100l12924j71781o1929J00255K65002J68860
3909.4I91771698q9228k41280k28464J1086J64688n8234j54495K7835J41025J57416
3929.8I91502047R7692n1976m7087J4841j02818k34544j65939K3365J02460N4896j5140
3952.3I91177797j4066M6491R2328K1756j88113k08616Q7678K55764L8981j60038j08421
$$ plain form
3974.7 991041541 991055548 991119266 991071463 990937412 990957618 991101444 991151333 991149068 991207957 991236448 991079330
3997.1 991079330
$$ packed form
3974.7I91041541J4007O3718m7803j34051K0206J43826M9889k265N8889K8491j57118
3997.1I91079330
##END=$$ End of the data block
