##TITLE=QMC5230 Grupo 6 $$ Begin of the data block
##JCAMP-DX=5.00 $$ ACD/SpecManager v 10.08
##SPECTROMETER/DATA SYSTEM=Alpha
##DATE=15 Sep 2014 09:51:18
##DATA TYPE=INFRARED SPECTRUM
##DATA CLASS=XYDATA
##ORIGIN=
##OWNER=
##NPOINTS=1765
##FIRSTX=399.76428223
##LASTX=3997.64306641
##MAXX=3997.64306641
##MINX=399.76428223
##MAXY=0.83465302
##MINY=0.25281546
##XFACTOR=1.0000000000
##YFACTOR=1.000000000000000e-9
##FIRSTY=0.80617458
##DELTAX=2.03961372
##XUNITS=1/CM
##YUNITS=ARBITRARY UNITS
##XYDATA=(X++(Y..Y))
399.8H06174576j72078j127720k323508k100409q60452p56920q9943J936197K341032
418.1H03020775Q51035p0035o33240j060009q79526l71218j78218o02483j203835j065493
438.5G97807753n07951m52578p12096q73328r60946r26554n15819l92139j082241j546025
458.9G89838076r15170m87387r53079j695692j892090j281083q85725j332640k203942
477.3G78191268k455532j961887j832545k915799m080773m014671l626167m319609
493.6G52984285p014036j1876464j9546032l3322274m4534743l5193145k3706675j4158011
509.9E63632905L1235815P7155113O6962361L0690611Q009254j240730o260633j2949348
526.2G57235348k5612831m5729041n2098691j0512472M8338890N9250772L2521308
$$ y = [806174576, 806002498, 804874778, 802551270, 800450861, 799590409, 798833489, 798743546, 800679743, 803020775, 803871810, 803801775, 803168535, 802108526, 801229000, 800857782, 800679564, 800077081, 798873246, 797807753, 797299802, 796847224, 796135128, 795261800, 794300854, 793374300, 792858481, 792466342, 791384101, 789838076, 788922906, 788435519, 787482440, 785786748, 783894658, 782613575, 781727850, 780395210, 778191268, 775735736, 773773849, 771941304, 769025505, 764944732, 760930061, 757303894, 752984285, 745970249, 734093785, 714547753, 681225479, 636690736, 601497591, 577790916, 563632905, 594868720, 672023833, 738986194, 769676805, 777686059, 776445329, 770184696, 757235348, 731622517, 685893476, 633794785, 623282313, 671621203, 730871975, 763393283]
540.5G63393283J1840045M448891K280593J711667J875042K152205K200007J646519
556.8G91548252N73576n54264j089394r80318p56919j033664j626491j759053j379668
575.2G82942057j130462j535296k014995k146244j956225j957655k431571l413200
591.5G66356409m702211n838096p469773j1986673k2164047l3088446k3459613J4977992
607.8F72625542M4093132L5524606J1343897k977789j115203O374002N610943N54502
624.1G72033632j444876j436234j497447k048195k547324k462327k055883j987577
640.4G56553769k537548l013850k756834k148926k348363l540218n114258o893634
656.8G28200138r535313j2557209j0935962k678692O699741J0141372M308880K41160
$$ y = [763393283, 775233328, 779682219, 781962812, 783674479, 785549521, 787701726, 789901733, 791548252, 792121828, 791567564, 790478170, 789497852, 788740933, 787707269, 786080778, 784321725, 782942057, 781811595, 780276299, 778261304, 776115060, 774158835, 772201180, 769769609, 766356409, 761654198, 755816102, 748346329, 736359656, 714195609, 681107163, 657647550, 672625542, 716718674, 752243280, 763587177, 760609388, 759494185, 765868187, 771479130, 772033632, 770588756, 769152522, 767655075, 765606880, 763059556, 760597229, 758541346, 756553769, 754016221, 751002371, 748245537, 746096611, 743748248, 740208030, 735093772, 728200138, 718664825, 706107616, 695171654, 692492962, 699192703, 709334075, 713642955, 713884115]
673.1G13884115k481997n412519p759034j0175944j4277994k1598399l5010994n5266439
689.4E61900795o6524715m4570982J63883M4157386P7567756P7451169M4354558J3319910
705.7G07819760j428187o625116q201837q709193q972287r213388r470105r616435
722F45583212r776830j0442496j1396706j2430310j3646901j5275478j7269194j9604027
738.3E35741270k2474766k5911391l0239552l6163420m3331295m5953363l5406411
752.6B96261072j4389336J815558J1111050K9464782N4776162O4162850N6195885N0138980
768.9E49537003M7004461L7123621K4947345J7391324J3323248J0598421Q607208P259190
785.3G15791821O382406N640328M919887M401862M200936M154384M073024L757596
$$ y = [713884115, 711402118, 705989599, 698230565, 688054621, 673776627, 652178228, 617167234, 561900795, 495376080, 450805098, 450968981, 495126367, 572694123, 650145292, 694499850, 707819760, 706391573, 699766457, 691564620, 682855427, 673883140, 664669752, 655199647, 645583212, 635806382, 625363886, 613967180, 601536870, 587889969, 572614491, 555345297, 535741270, 513266504, 487355113, 457115561, 420952141, 377620846, 331667483, 296261072, 281871736, 283687294, 294798344, 324263126, 379039288, 443202138, 499398023, 549537003, 596541464, 633665085, 658612430, 676003754, 689327002, 699925423, 708532631, 715791821, 722174227, 727814555, 732734442, 737136304, 741337240, 745491624, 749564648, 753322244]
801.6G53322244L359615L052950K716899K147973J380741O16432P1108J76013P92920
819.9G67636895J098693R17375P34329K88188j290798m369676q712470j2194276q626938
838.3G35481322K961099J0160267L983856q219302r012342P352114K0229936J6320526
854.6G79257476P655204L296792J743734J102984P27236L65198O2406j16706k34008
873G93860316l92616n78761o74963o55830o59227r37223j687765k920032m249573m973590
893.4G76130736n137503o548286j1558950k1045088l1863332l0972600m957855K8333068
909.7F92380190L6424279K2914946J0857284O184638M426539L084123J824081R20117
926G79016197M24444o3061n90504r74059j171767j450479j994133k745152l527880
$$ y = [753322244, 756681859, 759734809, 762451708, 764599681, 765980422, 766596854, 766667962, 766843975, 767636895, 768735588, 769652963, 770387292, 770675480, 769384682, 765015006, 756302536, 744108260, 735481322, 738442421, 748602688, 752586544, 744367242, 735354900, 742707014, 762936950, 779257476, 786912680, 790209472, 791953206, 793056190, 793783426, 794148624, 794211030, 794094324, 793860316, 793467700, 792888939, 792213976, 791558146, 790898919, 789961696, 788273931, 785353899, 781104326, 776130736, 770993233, 764444947, 752885997, 731840909, 699977577, 669004977, 664047122, 692380190, 728804469, 751719415, 762576699, 768761337, 773187876, 776271999, 778096080, 779016197, 779440641, 779377580, 778787076, 777813017, 776641250, 775190771, 773196638, 770451486, 766923606]
944.3G66923606m667639p153333j0507941j1082709q757114j2132347k2502899k0617008
960.7F69502616M603565K8675258L0315518J8995881P661104J860977Q96990n39422
977G61972487l786266n990147m334212j096666q26120k756417n493581j1124432j9437433
995.3G07127213j6597867N100668J6791105K147556j5084207k2212208k3776173j8526018
1011.6F34970069k415717J7678380K5754512J9540488J2617886R942353M479587m914701
1028G17652857j2842834j5834093j4202833j2385368j3024628r331048M853725K1390915
1044.3F66276693K7872801K3585200J6080440J0213196O461859L936767K228499J230001
1060.6G57885456O37412K13444k21788r38118k175391l995418o718397j0432721j2072563
$$ y = [766923606, 762255967, 755102634, 744594693, 733511984, 724754870, 712622523, 690119624, 669502616, 674106181, 702781439, 733096957, 752092838, 759753942, 761614919, 762511909, 761972487, 758186221, 752196074, 747861862, 746765196, 745939076, 743182659, 737689078, 726564646, 707127213, 690529346, 695630014, 712421119, 714568675, 699484468, 677272260, 653496087, 634970069, 632554352, 650232732, 675987244, 695527732, 708145618, 718087971, 722567558, 717652857, 704810023, 688975930, 674773097, 662387729, 649363101, 640032053, 644885778, 666276693, 694149494, 717734694, 733815134, 744028330, 750490189, 754426956, 756655455, 757885456, 758522868, 758736312, 758514524, 757576406, 755401015, 751405597, 744687200, 734254479, 722181916]
1079G22181916m767358R115398J5279651J0403096M238069J386404M12226L58k99037
1097.3G57950723n25176o91712q59618j095653j417577j832128j917422r10937N50150
1115.7G49250650Q99733L16798k15828n43177p76053q68141p33436n71489n98907p28727
1136.1G45431423p35104o51538n84364o51777r39071j305103j581789k021670l468931
1154.4G33492076q044719j2235225n092442O959200P411778J127363k227486l809392
1170.7G17581153o233633j1114359j6669511j0642469J1966228K6259244J6971707
1185G28118360L056586k364874l221989l076315k629876k133667j923621k024591k145588
1203.4G11654425k242565k347291k334177k405584k469361j867414q55922o68109j874208
$$ y = [722181916, 717414558, 726529956, 741809607, 752212703, 756450772, 757837176, 758249402, 758249760, 757950723, 757425547, 756733835, 755874217, 754778564, 753360987, 751528859, 749611437, 748700500, 749250650, 750150383, 750467181, 750251353, 749708176, 748932123, 748063982, 747330546, 746759057, 746160150, 745431423, 744696319, 744044781, 743460417, 742808640, 741869569, 740564466, 738982677, 736961007, 733492076, 725447357, 713212132, 708119690, 715078890, 722490668, 723618031, 721390545, 717581153, 711347520, 700233161, 683563650, 672921181, 684887409, 711146653, 728118360, 731174946, 728810072, 725588083, 722511768, 719881892, 717748225, 715824604, 713800013, 711654425, 709411860, 707064569, 704730392, 702324808, 699855447, 697988033, 697132111, 696464002, 694589794]
1221.7F94589794l926814n234301l368080O52433K062142r358k402962l907978n096436
1240.1F73358440o259918p549763r192884j1244118j3406932j5544534j8110633k2182405
1256.4E69867253k8590738l4255743k8353870p56771L9482326O5710246O2208295L9403975
1272.7F84714973J6754866K790987m037797o617368p310211q095980r532511j1214256
1289F57452703j2987137j5016020j6935110j7482579j5729784j2917758j0905802q682847
1305.4E46795666o021261q623719j9561351l2664984m0921658m1422040l2825499j6369760
1321.7C48385394N473017L0201763N5210293P8287392Q5919142O7079842L6518812
1336G07075655J2576640j506925q360981j1324525j2927890j3900340j4464497j5096009
$$ y = [694589794, 690662980, 685428679, 682060599, 682713032, 684775174, 684765816, 682362854, 678454876, 673358440, 667098522, 659548759, 650355875, 639111757, 625704825, 610160291, 592049658, 569867253, 541276515, 507020772, 478666902, 477910131, 517392457, 583102703, 645310998, 684714973, 701469839, 704260826, 700223029, 693605661, 686295450, 678199470, 668666959, 657452703, 644465566, 629449546, 612514436, 595031857, 579302073, 566384315, 555478513, 546795666, 540774405, 532150686, 512589335, 479924351, 439002693, 397580653, 364755154, 348385394, 353858411, 384060174, 439270467, 517557859, 603477001, 670556843, 707075655, 719652295, 718145370, 709784389, 698459864, 685531974, 671631634, 657167137, 642071128]
1352.3F42071128j6214967j7971337k0226180k4479211l2921254m0798247l8403928
1366.6D51056004j9378514J3152361M1245759N0681859M0657997K5657296J4831305
1380.8F17904067P264912J509488l593981p296443o568671j455009M462362N149781
1397.1F17376506J079321l371238o507636q904516j0330916j1285066j2642205j3559342
1413.5E51854908j3918697j6007841k0770490k2342235k2611350k3217469k2265077
1427.7D10721749k2362918k0414650j3163477k280236R867371J6614854K0217478K3082048
1444.1D22282219K6132733L3798366M4922412N1326990M5982420L2768906J4298081
1458.3F71512127n79119o586432j1461497j5043676j4645576j4922082j8456281k0554423
$$ y = [642071128, 625856161, 607884824, 587658644, 563179433, 530258179, 489459932, 451056004, 431677490, 444829851, 486075610, 536757469, 577415466, 603072762, 617904067, 625168979, 626678467, 623084486, 615788043, 609219372, 607764363, 612226725, 617376506, 618455827, 615084589, 608576953, 599672437, 589341521, 578056455, 565414250, 551854908, 537936211, 521928370, 501157880, 478815645, 456204295, 432986826, 410721749, 388358831, 367944181, 354780704, 352500468, 362367839, 378982693, 399200171, 422282219, 448414952, 482213318, 527135730, 578462720, 624445140, 657214046, 671512127, 670933008, 664346576, 652885079, 637841403, 623195827, 608273745, 589817464, 569263041]
1474.7E69263041k0461619k1849871k5360763l0299455l3886045k9669732l735631
1488.9D03999925K9540240K7590692o73472l1461358l5557867o65992L7817269N9621096
1505.2D90210533N6271613K1959901Q68737n057931p777392r379745r993672j1424423
1521.6E25677621j1925459j1788606j3214797j3186276j2715578j3330400j0949314
1535.8D38567191p012874l988117l62753Q61555j960307q844078j9022703k7446926
1552.2C70790988k8546363j7857850Q058429M1407466N2034468N8510184N6828350
1566.4E41225672M1361511K5304019J2021303N254865J971960k196133q922100k0689130
1582.8E95331967l2784283l8325906m0948600m7143370n4528534n4481238l8658649
$$ y = [569263041, 548801422, 526951551, 501590788, 471291333, 437405288, 407735556, 403999925, 433540165, 461130857, 460457385, 428996027, 393438160, 392772168, 430589437, 490210533, 546482146, 568442047, 569310784, 564252853, 556475461, 547095716, 537102044, 525677621, 513752162, 501963556, 488748759, 475562483, 462846905, 449516505, 438567191, 431554317, 427566200, 427203447, 428065002, 426104695, 417260617, 398237914, 370790988, 342244625, 324386775, 332445204, 373852670, 425887138, 484397322, 541225672, 582587183, 607891202, 619912505, 625167370, 627139330, 624943197, 616021097, 595331967, 562547684, 524221778, 483273178, 436129808, 381601274, 327120036, 288461387]
1597B88461387j0842144J3734549K8600842L7037611L6517083K5409580J3871163Q843213
1613.4D41633284L857821m407793k001941J1446863K1653384J8868715J0916561M800915
1629.7E06767809j16169l834009q565754j2039989j3638437j5888601j6909957j6857088
1646D18917805j2890220o656110q372962k0042778k5357186k8028012l0275434k4732113
1662.3B62562990r747535P342428K5842786M4075966M5514703M2309671L8485706K8832466
1678.6D85219181K2967159K3376942K6993394K2265792J6956389J6437530J4936269
1692.9F29152656J5536487J6214788J4793634J4791548J1519492R296894R078741P397115
1709.2G27781355O170631N851745O243468P053017O134510M535258M091919M016876
$$ y = [288461387, 277619243, 291353792, 319954634, 356992245, 393509328, 418918908, 432790071, 441633284, 445491105, 441083312, 439081371, 450528234, 472181618, 491050333, 501966894, 506767809, 506651640, 502817631, 494251877, 482211888, 468573451, 452684850, 435774893, 418917805, 406027585, 399371475, 390998513, 370955735, 345598549, 317570537, 287295103, 262562990, 252815455, 260157883, 286000669, 330076635, 375591338, 417901009, 456386715, 485219181, 508186340, 531563282, 558556676, 580822468, 597778857, 614216387, 629152656, 644689143, 660903931, 675697565, 690489113, 702008605, 711305499, 720384240, 727781355, 733951986, 739803731, 746047199, 753100216, 759234726, 763769984, 767861903, 771878779]
1725.5G71878779L638804L364146L042876K986551K077758O31034m16994j234531q91268
1743.9G85077155O67393K689838M150808M393399L631413L107309K476037J637757
1760.2H07831109J235187J170933J578212K053082J946747J171708L82304L31640P46549
1778.6H18447471P66694K64287k60532o30617q51273j326025k182245k343357j167416
1796.9H10716987M30226J164436M32790k98560M19915K230048L888309M609346M347384
1815.3H27940881K963305R72867k42949J6153Q98540J232267Q55743J6213o92546j012922
1835.7H32947552j068949r14634o76691p77185j296222j813829k166868j981795q64684
1854H21386695O67512J464188J239717N60821l03329j674294l737032n130232l979265
$$ y = [771878779, 775517583, 778881729, 781924605, 784911156, 786988914, 787619948, 787202954, 785968423, 785077155, 785744548, 788434386, 792585194, 796978593, 800610006, 803717315, 806193352, 807831109, 809066296, 810237229, 811815441, 813868523, 815815270, 816986978, 817369282, 817700922, 818447471, 819214165, 819478452, 819217920, 818587303, 817736030, 816410005, 814227760, 811884403, 810716987, 811147213, 812311649, 812744439, 812445879, 812865794, 815095842, 818984151, 823593497, 827940881, 830904186, 831877053, 831634104, 831650257, 832548797, 833781064, 834636807, 834653020, 833960474, 832947552, 831878603, 830963969, 830287278, 829510093, 828213871, 826400042, 824233174, 822251379, 821386695, 822054207, 823518395, 824758112, 825318933, 825015604, 823341310, 819604278, 814474046, 810494781]
1872.4H10494781j116634J701057L329218L462255K367675P75337l755P93219K326607
1890.7H24129760L014386K538860J506209O04987J62304M2319Q6665J56403J30594
1909.1H32372487m9234l03387m66764n91219q08597r87291j076043j010060o76274
1927.5H26403618m02391o42359j289547j679480j545966j607060k699435m948318q134126
1945.8H03454936j1188865r805083j158774Q438527J1079967P689357L126025n11288
1962.1H11124802k439261j515269J678526L879965L507137K065420Q89123J69098j66893
1980.5H19192648l0398M93705R03725Q21412M43220Q5771j28627j99914k17318k09093
2000.9H21155131k23756k86877l93808n27859o40809p04706o69777m59373j30356R1732
$$ y = [810494781, 809378147, 811079204, 814408422, 817870677, 820238352, 821013689, 821009934, 821803153, 824129760, 827144146, 829683006, 831189215, 831794202, 831956506, 831998825, 832085490, 832241893, 832372487, 832323253, 832019866, 831553102, 830961883, 830153286, 829165995, 828089952, 827079892, 826403618, 826001227, 825358868, 824069321, 822389841, 820843875, 819236815, 816537380, 811589062, 803454936, 792266071, 782460988, 781302214, 789740741, 800820708, 808510065, 811636090, 811124802, 808685541, 807170272, 808848798, 812728763, 816235900, 818301320, 819190443, 819359541, 819192648, 819162250, 819655955, 820559680, 821381092, 821824312, 821910083, 821781456, 821581542, 821364224, 821155131, 820931375, 820644498, 820250690, 819722831, 819082022, 818377316, 817707539, 817248166, 817117810, 817209542]
2021.3H17209542P6830j67608n23269q32439q87513n68271k3007M19319N26786L76284
2041.7H15606654J55985k8491j74701k67923l15666l72947m66883n85615p25389q76784
2062.1H11948240j009762j002968o51657m5360M61877O27220M91797K54870Q5235j0908
2082.5H11148584j03891j63019j54495j59681k95460n06163o58393o68704n12838k48969
2102.9H07676971k6226O7174J24872K05278K47360J96576P1585q6605k13504l02971
2123.3H07960510m15444n47886o39558o61731o47544o48976o74128o18935m44114k50519
2143.7H02411675j64508k26558l76582n43296o70910p04825n23686n5135M96626P86424
2164.1H00429225P40230N06461K37465L4093j39176l41535n71012p74086q82268q49187
$$ y = [817209542, 817286372, 817118764, 816595495, 815763056, 814875543, 814307272, 814284265, 814703584, 815230370, 815606654, 815762639, 815734148, 815559447, 815291524, 814975858, 814602911, 814136028, 813550413, 812825024, 811948240, 810938478, 809935510, 809283853, 809238493, 809700370, 810327590, 810819387, 811074257, 811159492, 811148584, 811044693, 810881674, 810727179, 810567498, 810272038, 809765875, 809107482, 808438778, 807925940, 807676971, 807650745, 807717919, 807842791, 808048069, 808295429, 808492005, 808563590, 808476985, 808263481, 807960510, 807545066, 806997180, 806357622, 805695891, 805048347, 804399371, 803725243, 803106308, 802662194, 802411675, 802247167, 802020609, 801644027, 801100731, 800429821, 799724996, 799201310, 799146175, 799642801, 800429225, 801169455, 801675916, 801913381, 801947474, 801808298, 801466763, 800895751, 800121665, 799239397, 798390210]
2184.5G98390210o98984m86493k19464N3882K22326K17318O8426j68145m13298n60522
2204.8G96405256n77212m96864l83019l08335k39313o6936K01941M16934M71831L91244
2225.2G95815527K32578M5359j38104l20971m70579n05745m45008m23551m50194m31716
2245.6G92907596l88205m36843o13034q50975j090169j188994r55760m47035k9981
2264G86906600N0366j18017l92735o43790o94275m40776M351M12702O77109P85589
2284.4G86547124P00593N15223L79562L19004K84195J83344M4346o2704j86205l17156
2304.8G88407326l83139m64082o74665j057207j591385j977741j675427n95570L61860
2323.1G80349970N02229K41637L7253l48985j115382j814425j853168o97136J400292
$$ y = [798390210, 797691226, 797204733, 796985269, 797039151, 797261477, 797478795, 797547221, 797379076, 796965778, 796405256, 795828044, 795331180, 794948161, 794639826, 794400513, 794333577, 794535518, 794952452, 795424283, 795815527, 796048105, 796093464, 795955360, 795634389, 795163810, 794658065, 794213057, 793789506, 793339312, 792907596, 792519391, 792082548, 791469514, 790618539, 789528370, 788339376, 787383616, 786936581, 786906600, 786956966, 786838949, 786446214, 785802424, 785108149, 784667373, 784671724, 785084426, 785761535, 786547124, 787247717, 787762940, 788142502, 788461506, 788745701, 788929045, 788973391, 788910687, 788724482, 788407326, 788024187, 787560105, 786885440, 785828233, 784236848, 782259107, 780583680, 779988110, 780349970, 780852199, 781093836, 781131089, 780782104, 779666722, 777852297, 775999129, 775301993, 776702285]
2341.5G76702285K792775K231658Q25584J38223k2352k85446n95928n52654k84672
2359.9G80949473j54852k01822k00689k32219l36469m30584n70595p62164q86441q34763
2380.2G76338875o38425m22776k83003j79708o8307l8743j58012l69131n90146o92904
2400.6G72897720n19752q8811L95119P57218Q93950P51734M25815M7565k53499l75569
2421G74931490l60012l21149l57986m69923n68926n63801m49955k84433j24991k6763
2441.4G71403551l5822j40131k85983m71413p07984r59396j094878q51989j30832O19233
2461.8G67344356Q77499O84738L38495K6643j91211l72053n33878n86629n48780n39184
2482.2G66499996n47290n30541n56528o27637o76572o90461n83171k78533L6716J14322
$$ y = [776702285, 779495060, 781726718, 782552302, 782690525, 782668173, 782382727, 781786799, 781234145, 780949473, 780794621, 780592799, 780392110, 780159891, 779823422, 779392838, 778822243, 778060079, 777173638, 776338875, 775700450, 775277674, 774994671, 774814963, 774746656, 774707913, 774549901, 774180770, 773590624, 772897720, 772377968, 772289157, 772684276, 773441494, 774335444, 775087178, 775512993, 775560558, 775307059, 774931490, 774571478, 774250329, 773892343, 773422420, 772853494, 772289693, 771839738, 771555305, 771430314, 771403551, 771367729, 771227598, 770941615, 770470202, 769762218, 768802822, 767707944, 766855955, 766725123, 767344356, 768221855, 768906593, 769245088, 769271731, 769080520, 768708467, 768174589, 767587960, 767039180, 766499996, 765952706, 765422165, 764865637, 764238000, 763561428, 762870967, 762287796, 762009263, 762045979, 762160301]
2502.6G62160301M7326Q3387J88172J86682m709l71039p77483j128077j398087j423955
2523G57562518j004279j97768O06060J007915R48846O36518K50518j85191o81162j157165
2543.4G57786810j423597j235425o00875O6936M15445M58121L74257L06309K61902
2561.8G56409883J68980M3153r834P5936K83241M51684M15445K18749M649j42992k60114
2584.2G57658780m13716n81324o67215n97894m18723k71022k46346k99811m04000n96941
2604.6G53161788q69572j159311j440465j772106k148688k342522j958191q06987O77943
2623G41341889J745760K091110J980245J775801J545489J184404P28428L06845n066
2641.3G52694905k19286l68774m67360m92632m55201m62115n68509p20381q53837r38773
$$ y = [762160301, 762207627, 762291014, 762479186, 762665868, 762661159, 762290120, 761512637, 760384560, 758986473, 757562518, 756558239, 756360471, 756966531, 757974446, 758923292, 759559810, 759810328, 759625137, 758943975, 757786810, 756363213, 755127788, 754526913, 754593849, 755009294, 755467415, 755841672, 756147981, 756409883, 756578863, 756622016, 756612182, 756688118, 756971359, 757423043, 757838488, 758057237, 758061886, 757918894, 757658780, 757245064, 756663740, 755996525, 755398631, 754979908, 754708886, 754462540, 754162729, 753758729, 753161788, 752292216, 751132905, 749692440, 747920334, 745771646, 743429124, 741470933, 740663946, 741341889, 743087649, 745178759, 747159004, 748934805, 750480294, 751664698, 752393126, 752699971, 752694905, 752475619, 752106845, 751639485, 751146853, 750691652, 750229537, 749661028, 748940647, 748086810, 747148037]
2661.7G47148037r59516q77440o82175n06699m56571m15802k78354j36852j06991k06768
2682.1G42520869m26054p24256j027882j268745j453519j595914j604557j335085p01606
2700.5G32383251J45614R07123J417876J610875J460612J072943O06775K32160R9480
2718.8G39936709J52290K06530J89841P4566j18792k72990m04954n79416p53224r09329
2739.2G37521231j038909j097441j083731j062989j117528j231491j257658j146257
2755.5G28485227j017154r17554q11815p37607p16865p05362p21991p87854q59976
2773.9G21209049r65357j183271j513720j927137k369225k790809l232181l680765
2790.2G03546584m039169m192948l978133l265739k080679n21362J198173K744734
$$ y = [747148037, 746188521, 745311081, 744628906, 744122207, 743665636, 743249834, 742971480, 742834628, 742727637, 742520869, 742094815, 741370559, 740342677, 739073932, 737620413, 736024499, 734419942, 733084857, 732383251, 732528865, 733435988, 734853864, 736464739, 737925351, 738998294, 739605069, 739837229, 739936709, 740088999, 740295529, 740485370, 740559936, 740441144, 740168154, 739763200, 739183784, 738430560, 737521231, 736482322, 735384881, 734301150, 733238161, 732120633, 730889142, 729631484, 728485227, 727468073, 726550519, 725738704, 725001097, 724284232, 723578870, 722856879, 722069025, 721209049, 720243692, 719060421, 717546701, 715619564, 713250339, 710459530, 707227349, 703546584, 699507415, 695314467, 691336334, 688070595, 685989916, 685468554, 686666727, 689411461]
2806.5F89411461L869534M437506M478097M157960L633857L004611K291262J532376
2822.8G16816664P78079M7624o24955j186669j586139j837730k040744k293706k580345
2841.2G05492079k755880k712965k526045k341211k209246k042353j595438o18934
2857.5F88690007P39336J936078K624214K761483K374649J686573J061082O91890N17965
2875.9G03083277M32968N19872Q21411J042307Q66174L68417k06113p49767j189530
2894.2G04989016j506209j753271j965702k104699k059221j785875j403689j159489
2910.5F91250861j221061j531482j930177k271175k472759k501547k242982j418055
2926.8F75661623J31727J911103L038586L121316K461135J586736Q23974K45333k11537
$$ y = [689411461, 693280995, 697718501, 702196598, 706354558, 709988415, 712993026, 715284288, 716816664, 717594743, 717642367, 717017412, 715830743, 714244604, 712406874, 710366130, 708072424, 705492079, 702736199, 700023234, 697497189, 695155978, 692946732, 690904379, 689308941, 688690007, 689429343, 691365421, 693989635, 696751118, 699125767, 700812340, 701873422, 702565312, 703083277, 703516245, 704036117, 704857528, 705899835, 706766009, 707134426, 706928313, 706178546, 704989016, 703482807, 701729536, 699763834, 697659135, 695599914, 693814039, 692410350, 691250861, 690029800, 688498318, 686568141, 684296966, 681824207, 679322660, 677079678, 675661623, 675793350, 677704453, 680743039, 683864355, 686325490, 687912226, 688736200, 688981533, 688769996]
2945.2F88769996o14822j006603j378000j716614k072691k417148k737879l072381
2961.5F73753858l388584l573358l473222l000975k117753q93891L03328J038909J204014
2979.9F59852326R48906N67555L25978J56820j81615p44284j368284j925945k346754
2998.2F55284703k514720k411246k227545k348781l109276m474879o126642p545352
3014.5F24526262q002639o748914l580868O78718M587471O826341O676793M360617
3030.9F29323781R01579k570927n250156o460905n755484l599882j589537j262664
3047.2F03735805k789081n391836q234083r932995q368135l241300K282440N262256
3063.5E73323071N771697M659891K473533K70665j072109j401544q92937R0361J116752
$$ y = [688769996, 688155174, 687148571, 685770571, 684053957, 681981266, 679564118, 676826239, 673753858, 670365274, 666791916, 663318694, 660317719, 658199966, 657306075, 657609403, 658648312, 659852326, 660801232, 661368787, 661694765, 661851585, 661669970, 660925686, 659557402, 657631457, 655284703, 652769983, 650358737, 648131192, 645782411, 642673135, 638198256, 632071614, 624526262, 616523623, 609774709, 606193841, 606872559, 611460030, 618286371, 624963164, 629323781, 630225360, 627654433, 622404277, 615943372, 610187888, 606588006, 604998469, 603735805, 600946724, 595554888, 587320805, 577387810, 569019675, 565778375, 568060815, 573323071, 579094768, 583754659, 586228192, 586498857, 585426748, 584025204, 583132267, 583222628, 584339380]
3081.9E84339380J917780K445638K798259L012836L008783K705991K172649J808047
3098.2F04209363J974822K287447J940131O19829j311600l070772l779531l103137
3114.5E99766552j923441j589478k533555m494905o992102r234786j0491788j0333538
3130.8E52172959q422733m635751L23057M942954P905960Q951187Q560539P355332
3147.1E77153504N889237M426896K970457J616180N82993r3460n58734r86397j518965
3165.5E89481711k197742k907097l541351m168093m855931n575776o277799o970227
3181.8E52987695p662356q204699q258283p436693n506157k534092J051724M411161
3198.1E18848300O581843P158875O320298M507601K421558P74443p2479q9347L71158
$$ y = [584339380, 586257160, 588702798, 591501057, 594513893, 597522676, 600228667, 602401316, 604209363, 606184185, 608471632, 610411763, 611031592, 609719992, 606649220, 602869689, 599766552, 597843111, 596253633, 593720078, 589225173, 582233071, 572998285, 562506497, 552172959, 543750226, 539114475, 539437532, 544380486, 552286446, 561237633, 569798172, 577153504, 583042741, 587469637, 590440094, 592056274, 592639267, 592545807, 591987073, 591000676, 589481711, 587283969, 584376872, 580835521, 576667428, 571811497, 566235721, 559957922, 552987695, 545325339, 537120640, 528862357, 521425664, 515919507, 513385415, 514437139, 518848300, 525430143, 532589018, 538909316, 543416917, 545838475, 546612918, 546540439, 546451092, 546822250]
3216.5E46822250N34773j73092j588285l021360m024386m712284n308210n898118o542623
3234.8E16088665p196665p797659q427351r049535r418398r423793r173125q663624
3251.1D46938515p847965o667763m890144k400309M81367L131718M771828M643143
3267.5D38160390K683997k25306k974778n132526o886959q197308q845270q938312
3283.8C99643928q677483q022904o749213m829377k553075j42128K320051M676492
3300.1C75666291O766855Q525819R839356J0660499J1054605J1109710J0944098J0647804
3316.4D55215037J0205269R557992Q825570Q308977Q245975Q447111Q516609Q313299
3332.7E25635839P894158P369220O846130O375074N901695N432009N036712M685819
$$ y = [546822250, 547357023, 547183931, 545595646, 542574286, 538549900, 533837616, 528529406, 522631288, 516088665, 508892000, 501094341, 492666990, 483617455, 474199057, 464775264, 455602139, 446938515, 439090550, 432422787, 427532643, 425132334, 425613701, 428745419, 433517247, 438160390, 440844387, 440619081, 437644303, 432511777, 425624818, 417427510, 408582240, 399643928, 390966445, 382943541, 376194328, 371364951, 368811876, 368669748, 370989799, 375666291, 382433146, 390958965, 400798321, 411458820, 422513425, 433623135, 444567233, 455215037, 465420306, 474978298, 483803868, 492112845, 500358820, 508805931, 517322540, 525635839, 533529997, 540899217, 547745347, 554120421, 560022116, 565454125, 570490837, 575176656]
3349E75176656M333973L989339L680408L425896L205240K949059K640307K370715K143145
3367.4F03914738J847326J512230J254916J066029Q90911P02441N21063M16160M03643
3385.7F12529457M85658O20961N86033L62933K86162M37200M75526J72257j27256m2200
3406.1F15786731J39952J24276O1750n901p1108J2278Q0467q762j5736J39594K46227
3428.6F16489768J95920K05637L06546J86444l7849p630J61827K82466L59893L65973
3449F18508995L90172M79340N48363O15895O67691O27458O74784R21965J051247P77066
3469.4F25262976L74734L67045O57142Q85069R03249O86169N93781P31945P18892O39677
3489.8F31820679P58469R25362R55164Q44419Q10683Q98540P72715N62966O47902Q55446
$$ y = [575176656, 579510629, 583499968, 587180376, 590606272, 593811512, 596760571, 599400878, 601771593, 603914738, 605762064, 607274294, 608529210, 609595239, 610486150, 611188591, 611709654, 612125814, 612529457, 613015115, 613636076, 614222109, 614585042, 614871204, 615308404, 615783930, 615956187, 615828931, 615786731, 615926683, 616050959, 616112709, 616106808, 616035700, 616047978, 616128445, 616119683, 616103947, 616243541, 616489768, 616685688, 616891325, 617197871, 617384315, 617346466, 617338836, 617500663, 617783129, 618143022, 618508995, 618899167, 619378507, 619926870, 620542765, 621210456, 621837914, 622512698, 623434663, 624485910, 625262976, 625637710, 626004755, 626661897, 627546966, 628450215, 629136384, 629730165, 630462110, 631181002, 631820679, 632579148, 633504510, 634459674, 635304093, 636114776, 637013316, 637786031, 638348997, 638996899, 639852345]
3510.2F39852345J020789J049221Q83519P88331R09806J078963J021266Q14915P68005
3528.5F48187160Q45910R57846J160503J242220J113892J193165J460135J428068J039028
3546.9F58627927Q11398R06587J001000J062870J169682J227140J168609J101434J190186
3565.2F68266833J316666J211942J041531J095772J307845J440883J499533J595676
3581.5F78776681J700163J664102J384437J208127J327872J421511J408339J455724
3597.9F90346956J466394J347303J281798J293004J317024J295209J232981J206339
3614.2G00787008J192927J198411J082540P96914O47247P45952Q39710N80430L50237
3632.5G08221376L72350L90351L93271M46737N25296N80907O07133M90308p391l44515
$$ y = [639852345, 640873134, 641922355, 642805874, 643594205, 644504011, 645582974, 646604240, 647419155, 648187160, 649033070, 649990916, 651151419, 652393639, 653507531, 654700696, 656160831, 657588899, 658627927, 659439325, 660345912, 661346912, 662409782, 663579464, 664806604, 665975213, 667076647, 668266833, 669583499, 670795441, 671836972, 672932744, 674240589, 675681472, 677181005, 678776681, 680476844, 682140946, 683525383, 684733510, 686061382, 687482893, 688891232, 690346956, 691813350, 693160653, 694442451, 695735455, 697052479, 698347688, 699580669, 700787008, 701979935, 703178346, 704260886, 705057800, 705705047, 706450999, 707290709, 707871139, 708221376, 708593726, 708984077, 709377348, 709824085, 710349381, 710930288, 711537421, 712027729, 712020338, 711675823]
3652.9G11675823j14978K90454N14507N09322M05550L64959L53038K46406O4433L4689
3673.3G14344203r536k16961j76370L7670K67982N78165Q70765O63697J04905q166
3693.7G16456354J15752J54853J38283P7128j967Q523O1810K3306j65641l28184l05175
3716.2G16235042k21491j39117j05799j86264l20077l19839j17004J72317L89398L66628
3736.5G15753794J44124j2160Q94K4379n186K7299m5061k41697k18570q4817j25051
3759G15217948k66314k08318l7610O973r6857k92361l75152k23934K38k0146k74301
3781.4G13430166l10778j67251r6977j01804j63436j89126j34230j07348j21533j75715
3801.8G11861968k00987j67489k41458k80857j66893o8844q5652r8824j11461k74062
$$ y = [711675823, 711560845, 711851299, 712365806, 712875128, 713280678, 713645637, 713998675, 714245081, 714309514, 714344203, 714334667, 714117706, 713941336, 713979006, 714246988, 714825153, 715695918, 716359615, 716464520, 716456354, 716572106, 716726959, 716865242, 716942370, 716940403, 716948926, 717010736, 717034042, 716868401, 716540217, 716235042, 716013551, 715874434, 715768635, 715582371, 715262294, 714942455, 714825451, 714997768, 715387166, 715753794, 715897918, 715885758, 715886652, 715911031, 715905845, 715933144, 715888083, 715646386, 715427816, 715342999, 715217948, 714951634, 714743316, 714705706, 714712679, 714615822, 714323461, 713948309, 713724375, 713724613, 713704467, 713430166, 713119388, 712952137, 712855160, 712753356, 712589920, 712400794, 712266564, 712159216, 712037683, 711861968, 711660981, 711493492, 711252034, 710971177, 710804284, 710735440, 710649788, 710550964, 710439503, 710165441]
3822.2G10165441l19421k34068j89244j18435l0398P5102Q3029j29700k49922j88172
3842.6G08864212k12491k93612k46584j09137k15888m95731l90768k28227j28090k0385
3863G06523299o9439j57297j03891r8824j96100k67386k60472k34902k34544j26780
3883.4G04773664j09553l51190m84646n03242m95910l20316j07288K3544P4505k3484
3903.8G02476084j59800j31547l8386P212K5154M649o8784j21474j37150j82510k40087
3926.2G01433361k59996k26617j86920k35855k90096k61784k44200k41518j94371j42455
3946.6F99149549j35183j96517k52426k13980j73629k05218j89722r9957n0008j6749
3967F97616160L4332M0651K3663J2993k2292p9930j26481j27434j46389j98722k12193
$$ y = [710165441, 709846020, 709611952, 709422708, 709304273, 709273875, 709348977, 709432006, 709302306, 709052384, 708864212, 708651721, 708358109, 708111525, 708002388, 707786500, 707290769, 706900001, 706671774, 706543684, 706523299, 706453860, 706296563, 706192672, 706093848, 705897748, 705630362, 705369890, 705134988, 704900444, 704773664, 704664111, 704312921, 703828275, 703325033, 702829123, 702508807, 702401519, 702425063, 702499568, 702476084, 702316284, 702184737, 702146351, 702153563, 702178717, 702183366, 702114582, 701993108, 701855958, 701673448, 701433361, 701173365, 700946748, 700759828, 700523973, 700233877, 699972093, 699727893, 699486375, 699292004, 699149549, 699014366, 698817849, 698565423, 698351443, 698177814, 697972596, 697782874, 697682917, 697632909, 697616160, 697650492, 697691143, 697714806, 697727799, 697705507, 697625577, 697499096, 697371662, 697225273, 697026551, 696814358]
3989.5F96814358k13682k03252j82092k09928
3997.6F96005404
$$ y = [696814358, 696600676, 696397424, 696215332, 696005404]
##END=$$ End of the data block
